Organisation Name,NACS Code,Organisation Type,Address1,Address2,Address3,Address4,Address5,PostCode,Telephone Number,NHS.UK users rating,Value  (NHS.UK users rating),Banding Classification  (NHS.UK users rating),Car parking (Is there car parking at this organisation?),Disabled access (Disabled access)
Bedfordshire Office,,SCL,"Unit L5/A Bucks-Biz, Bletchley Business Campus","1-9 Barton Road, Bletchley",,Milton Keynes,,MK2 3HU,Tel: 07838484157,No ratings yet Rate it yourself - /Services/careproviders/LeaveReview/DefaultView.aspx?id=1-12650537265,0,0,,
Anglo Support and Housing Ltd,,SCL,1-9 Barton Road,Bletchley,,Milton Keynes,,MK2 3HU,Tel: 07999784417,No ratings yet Rate it yourself - /Services/careproviders/LeaveReview/DefaultView.aspx?id=1-13134202487,0,0,,
Victory Locum Limited,,SCL,"Office 220, Bletchley Business Campus","1-9  Barton Road, Bletchley",,Milton Keynes,,MK2 3HU,Tel: 07368854235,No ratings yet Rate it yourself - /Services/careproviders/LeaveReview/DefaultView.aspx?id=1-15761717387,0,0,,
Alina Homecare Specialist Care - Buckinghamshire,,SCL,R8/B Bletchley Business Campus,"1-9 Barton Road, Bletchley",,Milton Keynes,,MK2 3HU,,No ratings yet Rate it yourself - /Services/careproviders/LeaveReview/DefaultView.aspx?id=1-18729476745,0,0,,
Future Care Enable Ltd,,SCL,39A Barton Road,Bletchley,,Milton Keynes,Buckinghamshire,MK2 3HW,Tel: 01908372003,No ratings yet Rate it yourself - /Services/careproviders/LeaveReview/DefaultView.aspx?id=1-3126868127,0,0,,
MK Executive Care,,SCL,121A Queensway,Bletchley,,Milton Keynes,Buckinghamshire,MK2 2DH,Tel: 01908375199,1 rating Rate it yourself - /Services/careproviders/LeaveReview/DefaultView.aspx?id=1-6688278810,,,,
Westminster Homecare Limited (Milton Keynes),,SCL,Thomas Grant House,"20 Watling Street, Bletchley",,Milton Keynes,Buckinghamshire,MK2 2BL,Tel: 01908373734,No ratings yet Rate it yourself - /Services/careproviders/LeaveReview/DefaultView.aspx?id=1-126215543,0,0,,
Fenny Mews & Stratford View,,SCL,100-108 Watling Street,Bletchley,,Milton Keynes,Buckinghamshire,MK1 1BW,Tel: 01908046140,No ratings yet Rate it yourself - /Services/careproviders/LeaveReview/DefaultView.aspx?id=1-2437174350,0,0,,
Milton Keynes Supported Living Service,,SCL,"Office 1, Lakeview House","Bond Avenue, Bletchley",,Milton Keynes,,MK1 1FB,Tel: 01908678713,No ratings yet Rate it yourself - /Services/careproviders/LeaveReview/DefaultView.aspx?id=1-3584727102,0,0,,
Care Support MK Ltd,,SCL,4B Bramley Road,Bletchley,,Milton Keynes,Buckinghamshire,MK1 1PT,Tel: 01908889043,No ratings yet Rate it yourself - /Services/careproviders/LeaveReview/DefaultView.aspx?id=1-4227555900,0,0,,
Higher Height Care,,SCL,10 Neath Crescent,Bletchley,,Milton Keynes,,MK3 6LN,Tel: 07538793274,No ratings yet Rate it yourself - /Services/careproviders/LeaveReview/DefaultView.aspx?id=1-10796910437,0,0,,
Blue Lotus Healthcare Ltd,,SCL,8 Forfar Drive,Bletchley,,Milton Keynes,,MK3 7LS,Tel: 07415107443,No ratings yet Rate it yourself - /Services/careproviders/LeaveReview/DefaultView.aspx?id=1-14785900504,0,0,,
FÉ Care,,SCL,"5 Brickhill Manor Court, Watling Street",Little Brickhill,,Milton Keynes,,MK17 9LN,Tel: 07590019509,1 rating Rate it yourself - /Services/careproviders/LeaveReview/DefaultView.aspx?id=1-9414449474,,,,
Precious Homes Limited,,SCL,Unit 4,Bradbourne Drive,,Milton Keynes,,MK7 8BN,,No ratings yet Rate it yourself - /Services/careproviders/LeaveReview/DefaultView.aspx?id=1-14279108155,0,0,,
Elevation Care Services,,SCL,3 Turpyn Court,Woughton On The Green,,Milton Keynes,,MK6 3BW,Tel: 01908889758,No ratings yet Rate it yourself - /Services/careproviders/LeaveReview/DefaultView.aspx?id=1-1933771567,0,0,,
Intrust Care Milton Keynes,,SCL,"First Floor, 5 Whittle Court",Knowlhill,,Milton Keynes,,MK5 8FT,Tel: 01908380600,No ratings yet Rate it yourself - /Services/careproviders/LeaveReview/DefaultView.aspx?id=1-2652660951,0,0,,
MacIntyre Milton Keynes Support,,SCL,Seebeck House,"Seebeck Place, Knowlhill",,Milton Keynes,,MK5 8FR,Tel: 01908968130,No ratings yet Rate it yourself - /Services/careproviders/LeaveReview/DefaultView.aspx?id=1-2116494820,0,0,,
MK Supported Housing Limited,,SCL,105,London Road,,Milton Keynes,Buckinghamshire,MK5 8AG,Tel: 07412069401,No ratings yet Rate it yourself - /Services/careproviders/LeaveReview/DefaultView.aspx?id=1-2540557439,0,0,,
Optimum Haven Care Ltd,,SCL,3 Lanercost Crescent,Monkston,,Milton Keynes,,MK10 9EA,,No ratings yet Rate it yourself - /Services/careproviders/LeaveReview/DefaultView.aspx?id=1-12249385506,0,0,,
"Bedfordshire, Buckinghamshire and Milton Keynes",,SCL,"46 Shenley Pavilions, Chalkdell Drive",Shenley Wood,,Milton Keynes,,MK5 6LB,Tel: 01908787940,No ratings yet Rate it yourself - /Services/careproviders/LeaveReview/DefaultView.aspx?id=1-15199003905,0,0,,
Access24 Health and Medical Services Ltd,,SCL,16 Kelly Gardens,Oxley Park,,Milton Keynes,Buckinghamshire,MK4 4HY,Tel: 01908476008,1 rating Rate it yourself - /Services/careproviders/LeaveReview/DefaultView.aspx?id=1-3081023799,,,,
Eastview Healthcare Milton Keynes,,SCL,Office 1.33 Milton Keynes Spaces,100 Avebury Boulevard,,Milton Keynes,,MK9 1FH,Tel: 01536217884,No ratings yet Rate it yourself - /Services/careproviders/LeaveReview/DefaultView.aspx?id=1-13593112273,0,0,,
Knightingles Healthcare Ltd - MK,,SCL,Unit 240,100 Avebury Boulevard,,Milton Keynes,,MK9 1FH,Tel: 01767668886,No ratings yet Rate it yourself - /Services/careproviders/LeaveReview/DefaultView.aspx?id=1-17984742765,0,0,,
Sarmey Healthcare Ltd,,SCL,Office 202,100 Avebury Boulevard,,Milton Keynes,,MK9 1FH,Tel: 07985233020,No ratings yet Rate it yourself - /Services/careproviders/LeaveReview/DefaultView.aspx?id=1-18174439309,0,0,,
GND Support,,SCL,11 Benbow Court,Shenley Church End,,Milton Keynes,,MK5 6JG,Tel: 07581231760,No ratings yet Rate it yourself - /Services/careproviders/LeaveReview/DefaultView.aspx?id=1-3106852091,0,0,,
Enrich Support Services Limited,,SCL,43 Lockhart Avenue,Oxley Park,,Milton Keynes,,MK4 4TY,Tel: 07824700571,No ratings yet Rate it yourself - /Services/careproviders/LeaveReview/DefaultView.aspx?id=1-17928040794,0,0,,
Midsummer Court,,SCL,Suite 205A Midsummer Court,313 Midsummer Boulevard,,Milton Keynes,,MK9 2UB,Tel: 03300552205,No ratings yet Rate it yourself - /Services/careproviders/LeaveReview/DefaultView.aspx?id=1-14955121975,0,0,,
Unite Highland Care (Milton Keynes),,SCL,220B Midsummer Court,314 Midsummer Boulevard,,Milton Keynes,,MK9 2UB,Tel: 07459329211,No ratings yet Rate it yourself - /Services/careproviders/LeaveReview/DefaultView.aspx?id=1-18246706168,0,0,,
Blessing's Care Ltd Domiciliary Care,,SCL,Regus Building,314 Midsummer Court,,Milton Keynes,Buckinghamshire,MK9 2UB,Tel: 08006890764,No ratings yet Rate it yourself - /Services/careproviders/LeaveReview/DefaultView.aspx?id=1-2026022001,0,0,,
Vital HealthCare - Buckinghamshire,,SCL,Regus,Midsummer Court,,Milton Keynes,,MK9 2UB,Tel: 01473212089,No ratings yet Rate it yourself - /Services/careproviders/LeaveReview/DefaultView.aspx?id=1-11296527731,0,0,,
Destiny International Care,,SCL,Midsummer Court,314 Midsummer Boulevard,,Milton Keynes,,MK9 2UB,Tel: 07928946680,No ratings yet Rate it yourself - /Services/careproviders/LeaveReview/DefaultView.aspx?id=1-12758515369,0,0,,
Around the Clock Healthcare - Head Office,,SCL,314 Midsummer Boulevard,Midsummer Court,,Milton Keynes,,MK9 2UB,Tel: 07882092732,No ratings yet Rate it yourself - /Services/careproviders/LeaveReview/DefaultView.aspx?id=1-9703790401,0,0,,
Teddy's Haven,,SCL,Midsummer Court,314 MIDSUMMER BOULEVARD,,Milton Keynes,,MK9 2UB,Tel: 07877320416,No ratings yet Rate it yourself - /Services/careproviders/LeaveReview/DefaultView.aspx?id=1-9711136864,0,0,,
"Room 130i, 314 Midsummer Court",,SCL,"Office 128, 314 Midsummer court",Midsummer Boulevard,,Milton Keynes,,MK9 2UB,Tel: 01908440014,1 rating Rate it yourself - /Services/careproviders/LeaveReview/DefaultView.aspx?id=1-6909562639,,,,
"Dimensions Beds, Bucks, Cambs and Luton Domiciliary Care Office",,SCL,"Suite 2-14, Margaret Powell House",401 Midsummer Boulevard,,Milton Keynes,,MK9 3BN,Tel: 07384215578,No ratings yet Rate it yourself - /Services/careproviders/LeaveReview/DefaultView.aspx?id=1-11634129953,0,0,,
Expectation Care Limited,,SCL,Margaret Powell House,433c Midsummer Boulevard,,Milton Keynes,,MK9 3BN,Tel: 01908990030,No ratings yet Rate it yourself - /Services/careproviders/LeaveReview/DefaultView.aspx?id=1-4973614157,0,0,,
Starry Care,,SCL,"Suite 1, 3rd Floor, Margaret Powell House",401 Midsummer Boulevard,,Milton Keynes,,MK9 3BN,Tel: 01908044353,No ratings yet Rate it yourself - /Services/careproviders/LeaveReview/DefaultView.aspx?id=1-6316887918,0,0,,
Havilah Care,,SCL,13 Diamond Court,"Opal Drive, Fox Milne",,Milton Keynes,,MK15 0DU,Tel: 07714466659,No ratings yet Rate it yourself - /Services/careproviders/LeaveReview/DefaultView.aspx?id=1-11285275609,0,0,,
18 Morland Drive,,SCL,18 Morland Drive,Grange Farm,,Milton Keynes,,MK8 0PB,Tel: 07539222699,No ratings yet Rate it yourself - /Services/careproviders/LeaveReview/DefaultView.aspx?id=1-17886257053,0,0,,
Charice Healthcare Main Office,,SCL,Regus House,"Fairbourne Drive, Atterbury",,Milton Keynes,Buckinghamshire,MK10 9RG,,No ratings yet Rate it yourself - /Services/careproviders/LeaveReview/DefaultView.aspx?id=1-17967425703,0,0,,
Medicare Support & Housing Ltd,,SCL,"Suite 208B, Regus House","Fairbourne Drive, Atterbury",,Milton Keynes,,MK10 9RG,Tel: 07935473423,No ratings yet Rate it yourself - /Services/careproviders/LeaveReview/DefaultView.aspx?id=1-16926403098,0,0,,
Quality Life Matters Care Services Ltd,,SCL,Milton Keynes Atterbury Lakes,"Fairbourne Drive, Atterbury",,Milton Keynes,,MK10 9RG,Tel: 07427446591,No ratings yet Rate it yourself - /Services/careproviders/LeaveReview/DefaultView.aspx?id=1-12376126000,0,0,,
Regus House,,SCL,Regus House,"Fairbourne Drive, Atterbury",,Milton Keynes,Buckinghamshire,MK10 9RG,Tel: 03301333976,No ratings yet Rate it yourself - /Services/careproviders/LeaveReview/DefaultView.aspx?id=1-12460181724,0,0,,
EJC Group Ltd,,SCL,"Office 207A, Fairbourne Drive",Atterbury,,Milton Keynes,,MK10 9RG,Tel: 07957723273,No ratings yet Rate it yourself - /Services/careproviders/LeaveReview/DefaultView.aspx?id=1-13531286654,0,0,,
Kay Healthcare Office,,SCL,Regus House,"Fairbourne Drive, Atterbury",,Milton Keynes,Buckinghamshire,MK10 9RG,,No ratings yet Rate it yourself - /Services/careproviders/LeaveReview/DefaultView.aspx?id=1-15167797965,0,0,,
Gemini Exclusive Care Ltd,,SCL,"Office 226, Regus House","Fairbourne Drive, Atterbury",,Milton Keynes,,MK10 9RG,Tel: 01908032685,1 rating Rate it yourself - /Services/careproviders/LeaveReview/DefaultView.aspx?id=1-1593256490,,,,
Brightblessing Healthcare Ltd,,SCL,80 Fen Street,Brooklands,,Milton Keynes,,MK10 7ET,Tel: 07944890871,No ratings yet Rate it yourself - /Services/careproviders/LeaveReview/DefaultView.aspx?id=1-11182429428,0,0,,
Fairview Resources,,SCL,"151 Foxhunter Drive, Milton Keynes Business  Centre,",Linford Wood,,Milton Keynes,,MK14 6GD,Tel: 07496221339,No ratings yet Rate it yourself - /Services/careproviders/LeaveReview/DefaultView.aspx?id=1-3179021767,0,0,,
Precious Hope and Home Care Limited - Milton Keynes,,SCL,Milton Keynes Business Centre,"Foxhunter Drive, Linford Wood",,Milton Keynes,,MK14 6GD,Tel: 01908821298,No ratings yet Rate it yourself - /Services/careproviders/LeaveReview/DefaultView.aspx?id=1-1922184031,0,0,,
Autism Care Community Services (Milton Keynes),,SCL,"121, Milton Keynes Business Centre","Foxhunter Drive, Linford Wood",,Milton Keynes,Buckinghamshire,MK14 6GD,Tel: 01908698910,No ratings yet Rate it yourself - /Services/careproviders/LeaveReview/DefaultView.aspx?id=1-2614916990,0,0,,
Courtcare Flexi,,SCL,51 Burners Lane South,,,Milton Keynes,,MK11 3HA,Tel: 03300225456,No ratings yet Rate it yourself - /Services/careproviders/LeaveReview/DefaultView.aspx?id=1-5567899672,0,0,,
Green Force Healthcare,,SCL,9 Glyn Street,New Bradwell,,Milton Keynes,,MK13 0DF,Tel: 01133507369,No ratings yet Rate it yourself - /Services/careproviders/LeaveReview/DefaultView.aspx?id=1-19059429944,0,0,,
ExcelCare24,,SCL,Wolverton and Greenleys Town Council,Creed Street,,Wolverton,Buckinghamshire,MK12 5LY,Tel: 01908766221,No ratings yet Rate it yourself - /Services/careproviders/LeaveReview/DefaultView.aspx?id=1-2213849687,0,0,,
Sanctuary Oasis Limited,,SCL,"Town Hall, Creed Street",Wolverton,,Milton Keynes,Buckinghamshire,MK12 5LY,Tel: 01908322839,No ratings yet Rate it yourself - /Services/careproviders/LeaveReview/DefaultView.aspx?id=1-1759523773,0,0,,
Dunnis Limited,,SCL,13 Marius Grove,Fairfields,,Milton Keynes,,MK11 4DH,,No ratings yet Rate it yourself - /Services/careproviders/LeaveReview/DefaultView.aspx?id=1-13607598586,0,0,,
Cor Care Force Ltd,,SCL,"C35 Harben House,",Tickford Street,,Newport Pagnell,,MK16 9EY,,No ratings yet Rate it yourself - /Services/careproviders/LeaveReview/DefaultView.aspx?id=1-13733589150,0,0,,
Johav Care Support Healthcare Limited,,SCL,45a High Street,Stony Stratford,,Milton Keynes,,MK11 1AA,Tel: 01908046891,No ratings yet Rate it yourself - /Services/careproviders/LeaveReview/DefaultView.aspx?id=1-10279936459,0,0,,
LKEE Care Services - Milton Keynes,,SCL,45a High Street,Stony Stratford,,Milton Keynes,,MK11 1AA,Tel: 07713675535,No ratings yet Rate it yourself - /Services/careproviders/LeaveReview/DefaultView.aspx?id=1-18390498853,0,0,,
Median Wellness Ltd,,SCL,10 Falcon Drive,Old Stratford,,Milton Keynes,,MK19 6DJ,Tel: 08000936935,No ratings yet Rate it yourself - /Services/careproviders/LeaveReview/DefaultView.aspx?id=1-12347189515,0,0,,
Valley House,,SCL,"Marston Road, Marston Moretaine",,,Bedford,Bedfordshire,MK43 0PP,Tel: 01525840785,No ratings yet Rate it yourself - /Services/careproviders/LeaveReview/DefaultView.aspx?id=1-4538935030,0,0,,
MacIntyre Ampthill Support,,SCL,The Old School House,Bedford Road,,Ampthill,Bedfordshire,MK45 2NB,Tel: 01525406501,No ratings yet Rate it yourself - /Services/careproviders/LeaveReview/DefaultView.aspx?id=1-119125988,0,0,,
Precious Homes Bedfordshire,,SCL,Treow House,"Parkside Drive, Houghton Regis",,Dunstable,Bedfordshire,LU5 5QL,Tel: 01582863229,No ratings yet Rate it yourself - /Services/careproviders/LeaveReview/DefaultView.aspx?id=1-2679886188,0,0,,
Immensity Healthcare Limited,,SCL,7 Needlepin Way,,,Buckingham,,MK18 7RA,Tel: 07881960025,No ratings yet Rate it yourself - /Services/careproviders/LeaveReview/DefaultView.aspx?id=1-17939812632,0,0,,
Violets Homecare Services Limited,,SCL,Chiltern House,81 High Street North,,Dunstable,Bedfordshire,LU6 1JJ,Tel: 01582476044,No ratings yet Rate it yourself - /Services/careproviders/LeaveReview/DefaultView.aspx?id=1-122467385,0,0,,
Ascon Care Services Limited,,SCL,Room 38,81 - 83 High Street North,,Dunstable,,LU6 1JJ,Tel: 01582670049,1 rating Rate it yourself - /Services/careproviders/LeaveReview/DefaultView.aspx?id=1-9868219627,,,,
Rysvil Care Services Limited,,SCL,19 Apex Business Centre,,,Dunstable,,LU5 4SB,Tel: 01582450772,No ratings yet Rate it yourself - /Services/careproviders/LeaveReview/DefaultView.aspx?id=1-127830964,0,0,,
Care Support Empower,,SCL,4 Evans Close,Houghton Regis,,Dunstable,,LU5 5TF,Tel: 07305563754,No ratings yet Rate it yourself - /Services/careproviders/LeaveReview/DefaultView.aspx?id=1-11780538979,0,0,,
Salutem Supported Living East,,SCL,Office f38 - Quarry Walk,,,Dunstable,,LU6 3FN,Tel: 01872864337,No ratings yet Rate it yourself - /Services/careproviders/LeaveReview/DefaultView.aspx?id=1-14716345381,0,0,,
Frogmore Road,,SCL,23 Frogmore Road,,,Houghton Regis,Bedfordshire,LU5 5FX,Tel: 03003004299,No ratings yet Rate it yourself - /Services/careproviders/LeaveReview/DefaultView.aspx?id=1-344173032,0,0,,
All 4 Health Main Office,,SCL,Verna House,9 Bicester Road,,Aylesbury,Buckinghamshire,HP19 9AG,Tel: 01296593301,No ratings yet Rate it yourself - /Services/careproviders/LeaveReview/DefaultView.aspx?id=1-15198323148,0,0,,
Utmostcare Limited,,SCL,Verna House,9 Bicester Road,,Aylesbury,Buckinghamshire,HP19 9AG,Tel: 07828268141,No ratings yet Rate it yourself - /Services/careproviders/LeaveReview/DefaultView.aspx?id=1-10369345270,0,0,,
CVC Services Ltd,,SCL,49 Ailward Road,,,Aylesbury,Buckinghamshire,HP19 9TY,Tel: 01296706171,No ratings yet Rate it yourself - /Services/careproviders/LeaveReview/DefaultView.aspx?id=1-17994097719,0,0,,
Panache Care Ltd,,SCL,Flat A,"Ashton Court, 1 Oxford Road",,Aylesbury,,HP19 8ER,Tel: 01296291319,No ratings yet Rate it yourself - /Services/careproviders/LeaveReview/DefaultView.aspx?id=1-12911330628,0,0,,
Rhodsac Supported Living Services,,SCL,Flat 18,"Chiltern House, Oxford Road",,Aylesbury,Buckinghamshire,HP19 8FQ,Tel: 01296415239,No ratings yet Rate it yourself - /Services/careproviders/LeaveReview/DefaultView.aspx?id=1-6350630265,0,0,,
Living Horizon,,SCL,7 Smith Close,,,Aylesbury,Buckinghamshire,HP20 1JX,Tel: 01296821009,No ratings yet Rate it yourself - /Services/careproviders/LeaveReview/DefaultView.aspx?id=1-469634029,0,0,,
Lakesyde Care Limited,,SCL,12 Hilton Close,Kempston,,Bedford,,MK42 7FT,Tel: 07927053123,No ratings yet Rate it yourself - /Services/careproviders/LeaveReview/DefaultView.aspx?id=1-11855965974,0,0,,
Essential Services Direct,,SCL,"Unit 18B, Futures House","The Moakes, Marsh Farm",,Luton,,LU3 3QB,Tel: 07455972319,No ratings yet Rate it yourself - /Services/careproviders/LeaveReview/DefaultView.aspx?id=1-11829397532,0,0,,
Premier Medical Healthcare Limited,,SCL,Office 2 Unit 5,"The Point, Gatehouse Way",,Aylesbury,,HP19 8DB,Tel: 07831881399,No ratings yet Rate it yourself - /Services/careproviders/LeaveReview/DefaultView.aspx?id=1-17709852568,0,0,,
SSA Quality Care,,SCL,"5 The Courtyard, Merlin Centre",Gatehouse Close,,Aylesbury,Buckinghamshire,HP19 8DP,Tel: 01296398763,No ratings yet Rate it yourself - /Services/careproviders/LeaveReview/DefaultView.aspx?id=1-1805501466,0,0,,
Connect 2 Flexicare Head Office,,SCL,Unit 5 Midshires Business Park,Smeaton Close,,Aylesbury,,HP19 8HL,Tel: 01296329380,No ratings yet Rate it yourself - /Services/careproviders/LeaveReview/DefaultView.aspx?id=1-3294214110,0,0,,
Aylesbury,,SCL,Midshires House,"Midshires Business Park, Smeaton Close",,Aylesbury,,HP19 8HL,,No ratings yet Rate it yourself - /Services/careproviders/LeaveReview/DefaultView.aspx?id=1-11847559487,0,0,,
Responsive Healthcare Ltd,,SCL,"Suite 9, Pure Offices","Midshires Business Park, Smeaton Close",,Aylesbury,,HP19 8HL,Tel: 01296768965,No ratings yet Rate it yourself - /Services/careproviders/LeaveReview/DefaultView.aspx?id=1-14638496733,0,0,,
Triple E Healthcare Ltd (Aylesbury),,SCL,"Suite 52, Pure Offices","Midshires Business Park, Smeaton Close",,Aylesbury,,HP19 8HL,,No ratings yet Rate it yourself - /Services/careproviders/LeaveReview/DefaultView.aspx?id=1-14144060193,0,0,,
Aylesbury Supported Living Service,,SCL,Woodley House,64/65 Rabans Close,,Aylesbury,,HP19 8RS,Tel: 01296393000,No ratings yet Rate it yourself - /Services/careproviders/LeaveReview/DefaultView.aspx?id=1-12552442715,0,0,,
Angels Care Agency Limited,,SCL,Claydon House,"1 Edison Road, Rabans Lane Industrial Area",,Aylesbury,Buckinghamshire,HP19 8TE,Tel: 01296582220,No ratings yet Rate it yourself - /Services/careproviders/LeaveReview/DefaultView.aspx?id=1-8372245858,0,0,,
Nurses Alliance Limited,,SCL,Claydon House,"1 Edison Road, Rabans Lane Industrial Area",,Aylesbury,Buckinghamshire,HP19 8TE,Tel: 01296434611,No ratings yet Rate it yourself - /Services/careproviders/LeaveReview/DefaultView.aspx?id=1-4499652087,0,0,,
Insight Care & Support Ltd,,SCL,25a Wendover Road,,,Aylesbury,,HP21 7SZ,,No ratings yet Rate it yourself - /Services/careproviders/LeaveReview/DefaultView.aspx?id=1-15176132793,0,0,,
Green Pastures Care Services,,SCL,13 Kershaw Close,,,Luton,,LU3 4AT,Tel: 07861718670,No ratings yet Rate it yourself - /Services/careproviders/LeaveReview/DefaultView.aspx?id=1-12879871979,0,0,,
Castle Mercy Healthcare Services Ltd,,SCL,93 Thame Road,,,Aylesbury,,HP21 8LY,Tel: 07859900382,No ratings yet Rate it yourself - /Services/careproviders/LeaveReview/DefaultView.aspx?id=1-18580000797,0,0,,
Instant Homecare,,SCL,Instant Security ltd 95d,Marsh Road,,Luton,,LU3 2QG,Tel: 03333444313,No ratings yet Rate it yourself - /Services/careproviders/LeaveReview/DefaultView.aspx?id=1-11343414102,0,0,,
SeeAbility Buckinghamshire Support Service,,SCL,"The Office, Waterside House",Taylor Road,,Aylesbury,Buckinghamshire,HP21 8DJ,,No ratings yet Rate it yourself - /Services/careproviders/LeaveReview/DefaultView.aspx?id=1-2807137233,0,0,,
ABOBVO Links Ltd,,SCL,5 Viscount Close,,,Luton,,LU3 2PW,Tel: 07877787845,No ratings yet Rate it yourself - /Services/careproviders/LeaveReview/DefaultView.aspx?id=1-18392407519,0,0,,
Zach's Care,,SCL,"Wrest Park, Room 118 - first floor","Enterprise House, Silsoe",,Bedford,,MK45 4HR,Tel: 01525306740,2 ratings Rate it yourself - /Services/careproviders/LeaveReview/DefaultView.aspx?id=1-12630290304,,,,
Lomack Healthcare,,SCL,162 Bedford Road,Kempston,,Bedford,Bedfordshire,MK42 8BH,Tel: 01234844034,No ratings yet Rate it yourself - /Services/careproviders/LeaveReview/DefaultView.aspx?id=1-108814630,0,0,,
Cordial Support Limited,,SCL,"Alperton House, 18 Hartwell Drive",Kempston,,Bedford,,MK42 8UY,Tel: 07400440865,No ratings yet Rate it yourself - /Services/careproviders/LeaveReview/DefaultView.aspx?id=1-12636378378,0,0,,
Purified Hearts Care Services,,SCL,19 Avon Place,,,Aylesbury,,HP21 9LR,Tel: 07908053863,No ratings yet Rate it yourself - /Services/careproviders/LeaveReview/DefaultView.aspx?id=1-10890628893,0,0,,
KS Care,,SCL,Safestore Offices,Elstow Road,,Bedford,,MK42 9QZ,Tel: 01234965583,No ratings yet Rate it yourself - /Services/careproviders/LeaveReview/DefaultView.aspx?id=1-3757447628,0,0,,
Kitec Supported Living,,SCL,"Office B, Elstow Road",Kempston,,Bedford,,MK42 9QZ,,No ratings yet Rate it yourself - /Services/careproviders/LeaveReview/DefaultView.aspx?id=1-16437635737,0,0,,
JOINING HANDS HEALTHCARE,,SCL,38 Spring Road,Kempston,,Bedford,,MK42 8LP,Tel: 07501268720,No ratings yet Rate it yourself - /Services/careproviders/LeaveReview/DefaultView.aspx?id=1-11938602010,0,0,,
Wendover House,,SCL,137 Wendover Road,Stoke Mandeville,,Aylesbury,Buckinghamshire,HP22 5TF,Tel: 01296612598,No ratings yet Rate it yourself - /Services/careproviders/LeaveReview/DefaultView.aspx?id=1-4132063918,0,0,,
Ruby 24hrCare,,SCL,110-112 Leagrave Road,,,Luton,,LU4 8HX,Tel: 01582391189,No ratings yet Rate it yourself - /Services/careproviders/LeaveReview/DefaultView.aspx?id=1-18217362678,0,0,,
Advance Bedfordshire and Berkshire,,SCL,Bowls Court,11 Abigail Close,,Luton,Bedfordshire,LU3 1ND,Tel: 01582415797,No ratings yet Rate it yourself - /Services/careproviders/LeaveReview/DefaultView.aspx?id=1-17989751751,0,0,,
Distinct Care and Support,,SCL,56 Whitby Road,,,Luton,,LU3 1BQ,Tel: 07341111295,No ratings yet Rate it yourself - /Services/careproviders/LeaveReview/DefaultView.aspx?id=1-7540012479,0,0,,
Creative Support - Bedford Services,,SCL,Unit B,"Bedford Business Centre, Mile Road",,Bedford,,MK42 9TW,Tel: 01612360829,No ratings yet Rate it yourself - /Services/careproviders/LeaveReview/DefaultView.aspx?id=1-6804247386,0,0,,
Join Hands Care,,SCL,4a Crystal House,New Bedford Road,,Luton,,LU1 1HS,Tel: 01582850605,No ratings yet Rate it yourself - /Services/careproviders/LeaveReview/DefaultView.aspx?id=1-12255459743,0,0,,
FirstCare-Bedfordshire & MK,,SCL,"3rd Floor, Howard House 40-64",St. Johns Street,,Bedford,,MK42 0DJ,Tel: 07789925287,No ratings yet Rate it yourself - /Services/careproviders/LeaveReview/DefaultView.aspx?id=1-291683646,0,0,,
Winray Care Housing - Luton,,SCL,Christchurch House,"Suite 101b, 40 Upper George Street",,Luton,,LU1 2RS,Tel: 01582564780,No ratings yet Rate it yourself - /Services/careproviders/LeaveReview/DefaultView.aspx?id=1-17947916312,0,0,,