Organisation Name,NACS Code,Organisation Type,Address1,Address2,Address3,Address4,Address5,PostCode,Telephone Number,NHS.UK users rating,Value  (NHS.UK users rating),Banding Classification  (NHS.UK users rating),Car parking (Is there car parking at this organisation?),Disabled access (Disabled access)
Empowerment Care Ltd,,SCL,Regus Orbit Plaza,Watling Street,,Cannock,,WS11 0EL,Tel: 07906164708,1 rating Rate it yourself - /Services/careproviders/LeaveReview/DefaultView.aspx?id=1-3012563794,,,,
ECHO Support Ltd,,SCL,"126 Regus, Watling Court",Orbital Plaza,,Cannock,,WS11 0EL,Tel: 01543404682,No ratings yet Rate it yourself - /Services/careproviders/LeaveReview/DefaultView.aspx?id=1-15683424142,0,0,,
Rose Meadow Care - Main Office,,SCL,Watling Court,Orbital Plaza,,Cannock,Staffordshire,WS11 0EL,Tel: 07984842957,No ratings yet Rate it yourself - /Services/careproviders/LeaveReview/DefaultView.aspx?id=1-15762860085,0,0,,
Hadet Healthcare,,SCL,180 Walsall Road,,,Cannock,,WS11 0JL,Tel: 01543220340,No ratings yet Rate it yourself - /Services/careproviders/LeaveReview/DefaultView.aspx?id=1-8923499278,0,0,,
Support4U,,SCL,62,Buxton Road,,Walsall,,WS3 3QJ,Tel: 01922612104,No ratings yet Rate it yourself - /Services/careproviders/LeaveReview/DefaultView.aspx?id=1-8220138653,0,0,,
Harmony Care - Little Bloxwich Community Hub,,SCL,Stoney Lane,,,Walsall,West Midlands,WS3 3DW,Tel: 01922694412,No ratings yet Rate it yourself - /Services/careproviders/LeaveReview/DefaultView.aspx?id=1-6624088635,0,0,,
Better Care Services Ltd,,SCL,"4 Kingston Court Shopping Arcade, Walsall Road",,,Cannock,,WS11 0HQ,Tel: 07888271213,No ratings yet Rate it yourself - /Services/careproviders/LeaveReview/DefaultView.aspx?id=1-16566708152,0,0,,
Five Star Support,,SCL,Sandbank,Bloxwich,,Walsall,,WS3 2HL,Tel: 07525816813,No ratings yet Rate it yourself - /Services/careproviders/LeaveReview/DefaultView.aspx?id=1-4773068254,0,0,,
Mayfield House,,SCL,11 Queen Street,,,Cannock,,WS11 1AE,Tel: 03335777830,No ratings yet Rate it yourself - /Services/careproviders/LeaveReview/DefaultView.aspx?id=1-11608156262,0,0,,
Catherine Care,,SCL,Unit 13A,"Norton Canes Business Park, Jerome Road, Norton Canes",,Cannock,,WS11 9UE,Tel: 01922415888,No ratings yet Rate it yourself - /Services/careproviders/LeaveReview/DefaultView.aspx?id=1-16378242005,0,0,,
Saddlebrook Healthcare Services Ltd,,SCL,3 Poplar Lane,,,Cannock,,WS11 1NQ,,No ratings yet Rate it yourself - /Services/careproviders/LeaveReview/DefaultView.aspx?id=1-16373569495,0,0,,
Upward Care Limited,,SCL,Bloxwich Hall,"Elmore Court, Elmore Green Road",,"Bloxwich, Walsall",West Midlands,WS3 2QW,,No ratings yet Rate it yourself - /Services/careproviders/LeaveReview/DefaultView.aspx?id=1-2204416917,0,0,,
Divine Healthcare Solutions - Main Office,,SCL,47,Field Road,,Walsall,,WS3 3JD,Tel: 03335770655,1 rating Rate it yourself - /Services/careproviders/LeaveReview/DefaultView.aspx?id=1-11866602277,,,,
Voyage (DCA) West Midlands,,SCL,62-72 Barnard Road,,,Wolverhampton,,WV11 2JZ,Tel: 07973720390,No ratings yet Rate it yourself - /Services/careproviders/LeaveReview/DefaultView.aspx?id=1-2141142104,0,0,,
SYNC ALLIANCE HEALTHCARE,,SCL,3 Brundard Close,,,Walsall,West Midlands,WS3 1AR,Tel: 02037800056,No ratings yet Rate it yourself - /Services/careproviders/LeaveReview/DefaultView.aspx?id=1-5059844390,0,0,,
Gracious Healthcare Services Ltd,,SCL,592 Bloxwich Road,,,Walsall,,WS3 2XE,Tel: 01922669797,No ratings yet Rate it yourself - /Services/careproviders/LeaveReview/DefaultView.aspx?id=1-10272518016,0,0,,
Empower Care and Support Limited,,SCL,32 Bluebell Crescent,,,Walsall,,WS3 1FE,Tel: 07825751521,No ratings yet Rate it yourself - /Services/careproviders/LeaveReview/DefaultView.aspx?id=1-18386662797,0,0,,
Affinity Trust - Domicilary Care Agency - West Midlands,,SCL,Flat 7,"Parrys Court, Woodside Place",,Cannock,,WS11 4AA,Tel: 01215533502,No ratings yet Rate it yourself - /Services/careproviders/LeaveReview/DefaultView.aspx?id=1-1420150690,0,0,,
Stalwart Care Services,,SCL,56 Mattox Road,,,Wolverhampton,,WV11 3TQ,,No ratings yet Rate it yourself - /Services/careproviders/LeaveReview/DefaultView.aspx?id=1-16479521559,0,0,,
One Touch Quality Kare,,SCL,"Bramcote Way, 3 Bramcote Way",Rushall,,Walsall,,WS4 1DG,Tel: 01216040218,No ratings yet Rate it yourself - /Services/careproviders/LeaveReview/DefaultView.aspx?id=1-6367824093,0,0,,
STAFFORDSHIRE,,SCL,36 Whateley Road,,,Walsall,West Midlands,WS3 1QU,Tel: 07392346554,No ratings yet Rate it yourself - /Services/careproviders/LeaveReview/DefaultView.aspx?id=1-12604070679,0,0,,
Forever Care,,SCL,228 Lichfield Road,Rushall,,Walsall,,WS4 1SA,Tel: 01922642777,No ratings yet Rate it yourself - /Services/careproviders/LeaveReview/DefaultView.aspx?id=1-8687203641,0,0,,
Pooleview Support Services,,SCL,36 Kings Road,,,Walsall,,WS4 1JB,Tel: 07342959720,No ratings yet Rate it yourself - /Services/careproviders/LeaveReview/DefaultView.aspx?id=1-7464191702,0,0,,
Isabella Homes Limited,,SCL,60 Cadman Crescent,,,Wolverhampton,,WV10 0SJ,Tel: 01902687286,No ratings yet Rate it yourself - /Services/careproviders/LeaveReview/DefaultView.aspx?id=1-6973317111,0,0,,
Arreta Care Limited,,SCL,78A Bond Way,Hednesford,,Cannock,,WS12 4SN,,No ratings yet Rate it yourself - /Services/careproviders/LeaveReview/DefaultView.aspx?id=1-8417838965,0,0,,
MK Executive Care Midlands,,SCL,"7th Floor, Townend House",Park Street,,Walsall,,WS1 1NS,Tel: 07931359586,No ratings yet Rate it yourself - /Services/careproviders/LeaveReview/DefaultView.aspx?id=1-8821157299,0,0,,
Kinver Care Ltd,,SCL,"Townend House, 4th Floor North",Park Street,,Walsall,,WS1 1NS,Tel: 01902238777,6 ratings Rate it yourself - /Services/careproviders/LeaveReview/DefaultView.aspx?id=1-6857717176,,,,
Mediservices Care Ltd,,SCL,5J Townend House,,,Walsall,,WS1 1NS,Tel: 07928635455,No ratings yet Rate it yourself - /Services/careproviders/LeaveReview/DefaultView.aspx?id=1-13938633149,0,0,,
Dignus Support,,SCL,10 Hatherton Road,,,Walsall,,WS1 1XS,Tel: 01213575049,No ratings yet Rate it yourself - /Services/careproviders/LeaveReview/DefaultView.aspx?id=1-2823384014,0,0,,
ANIF CARE,,SCL,Planetary Business Centre,Planetary Road,,Willenhall,West Midlands,WV13 3SW,Tel: 07538825279,No ratings yet Rate it yourself - /Services/careproviders/LeaveReview/DefaultView.aspx?id=1-15977015036,0,0,,
Healthcare 1st Choice Wolverhampton,,SCL,Planetary House,"Business Park, Planetary Road",,Willenhall,,WV13 3SW,,No ratings yet Rate it yourself - /Services/careproviders/LeaveReview/DefaultView.aspx?id=1-14246478435,0,0,,
Bellamy House (Empowering U Care),,SCL,Bellamy House,Wilkes Street,,Willenhall,,WV13 2BS,Tel: 01902290600,No ratings yet Rate it yourself - /Services/careproviders/LeaveReview/DefaultView.aspx?id=1-1764191782,0,0,,
Ameliorate Living - Main Office,,SCL,West Midlands House,Gipsy Lane,,Willenhall,West Midlands,WV13 2HA,,No ratings yet Rate it yourself - /Services/careproviders/LeaveReview/DefaultView.aspx?id=1-18392659780,0,0,,
New Leaf Healthcare Services,,SCL,West Midlands House,Gipsy Lane,,Willenhall,West Midlands,WV13 2HA,Tel: 01902212152,No ratings yet Rate it yourself - /Services/careproviders/LeaveReview/DefaultView.aspx?id=1-12060337302,0,0,,
Harmony Revival Supported Living Services Limited,,SCL,"The Rock Centre, 27-31 Lichfield House",Lichfield Street,,Walsall,,WS1 1TJ,Tel: 07805219843,1 rating Rate it yourself - /Services/careproviders/LeaveReview/DefaultView.aspx?id=1-12815736066,,,,
ECHO Supported Living Services Limited,,SCL,Suite 117 The Rock Centre,27-31 Lichfield Street,,Walsall,,WS1 1TJ,,2 ratings Rate it yourself - /Services/careproviders/LeaveReview/DefaultView.aspx?id=1-8026516958,,,,
CHAREY CARE UK LTD,,SCL,"The Rock House, Lichfield House",27-31 Lichfield Street,,Walsall,,WS1 1TJ,Tel: 01922276973,No ratings yet Rate it yourself - /Services/careproviders/LeaveReview/DefaultView.aspx?id=1-15520381141,0,0,,
Inmind community Support Services Limited,,SCL,The Rock Center,27-31 Lichfield Street,,Walsall,West Midlands,WS1 1TJ,Tel: 01922611315,No ratings yet Rate it yourself - /Services/careproviders/LeaveReview/DefaultView.aspx?id=1-4704543143,0,0,,
Essence Health Ltd,,SCL,Lichfield House 27-31,Lichfield Street,,Walsall,,WS1 1TJ,Tel: 01922640333,No ratings yet Rate it yourself - /Services/careproviders/LeaveReview/DefaultView.aspx?id=1-5208790400,0,0,,
My Pillar Limited,,SCL,77 Bridge Street,,,Walsall,,WS1 1JQ,,No ratings yet Rate it yourself - /Services/careproviders/LeaveReview/DefaultView.aspx?id=1-3584279621,0,0,,
CARE-A-LOT LIMITED,,SCL,43 Guy Avenue,,,Wolverhampton,,WV10 9SB,,No ratings yet Rate it yourself - /Services/careproviders/LeaveReview/DefaultView.aspx?id=1-12083470911,0,0,,
Abimatic Care Ltd,,SCL,178 Goodwood Drive,,,Wolverhampton,,WV10 6GP,Tel: 07954853554,No ratings yet Rate it yourself - /Services/careproviders/LeaveReview/DefaultView.aspx?id=1-15356238395,0,0,,
Mech Healthcare Limited,,SCL,19-20 Vicarage Place (Mwanaka Shop),,,Walsall,,WS1 3NA,Tel: 07402168788,No ratings yet Rate it yourself - /Services/careproviders/LeaveReview/DefaultView.aspx?id=1-12324929900,0,0,,
Liberty Support - Midlands,,SCL,6 Nightingale Place,Pendeford,,Wolverhampton,,WV9 5HF,Tel: 07807104674,No ratings yet Rate it yourself - /Services/careproviders/LeaveReview/DefaultView.aspx?id=1-2279487888,0,0,,
Varsity Healthcare Ltd,,SCL,48 Inkerman Street,,,Wolverhampton,,WV10 0EP,Tel: 07985417480,No ratings yet Rate it yourself - /Services/careproviders/LeaveReview/DefaultView.aspx?id=1-16610917399,0,0,,
Breakthru Care Ltd,,SCL,Office No 1,63a Hillary Street,,Walsall,,WS2 9BP,Tel: 03333660746,No ratings yet Rate it yourself - /Services/careproviders/LeaveReview/DefaultView.aspx?id=1-4844306850,0,0,,
Resjes Ltd,,SCL,"Suite F3, Old Bank Business Centre","43-45 Church Street, Darlaston",,Wednesbury,,WS10 8DU,Tel: 07479882292,No ratings yet Rate it yourself - /Services/careproviders/LeaveReview/DefaultView.aspx?id=1-7374590713,0,0,,
Rubery Court,,SCL,55-57 Walsall Road,Darlaston,,Walsall,West Midlands,WS10 9JS,Tel: 01212851171,4 ratings Rate it yourself - /Services/careproviders/LeaveReview/DefaultView.aspx?id=1-2396350652,,,,
Orlando Care Homes LTD,,SCL,Old Bank Innovation Centre,"35-37 King Street, Darlaston",,Wednesbury,,WS10 8DE,Tel: 07727124128,No ratings yet Rate it yourself - /Services/careproviders/LeaveReview/DefaultView.aspx?id=1-14380731854,0,0,,
ABC Support Limited,,SCL,Westbury House,Westbury Street,,Wolverhampton,West Midlands,WV1 1JD,Tel: 01902393940,No ratings yet Rate it yourself - /Services/careproviders/LeaveReview/DefaultView.aspx?id=1-15763848918,0,0,,
GSS Healthcare Ltd,,SCL,Office 13b,"York Chambers, 33 York Street",,Wolverhampton,,WV1 3RN,Tel: 07966270229,No ratings yet Rate it yourself - /Services/careproviders/LeaveReview/DefaultView.aspx?id=1-13931190885,0,0,,
Eden Support Ltd,,SCL,Newhampton Arts Centre,Dunkley Street,,Wolverhampton,West Midlands,WV1 4AN,Tel: 01902771778,No ratings yet Rate it yourself - /Services/careproviders/LeaveReview/DefaultView.aspx?id=1-1456310911,0,0,,
Sublime Care Solution,,SCL,Office 1-3 Pressworks,36-38 Berry Street,,Wolverhampton,,WV1 1HA,Tel: 01902239014,No ratings yet Rate it yourself - /Services/careproviders/LeaveReview/DefaultView.aspx?id=1-5987198251,0,0,,
Santos Care Limited,,SCL,36 -38  Berry Street,,,Wolverhampton,,WV1 1HA,Tel: 01902427605,2 ratings Rate it yourself - /Services/careproviders/LeaveReview/DefaultView.aspx?id=1-12038361290,,,,
Majestic Healthcare LTD,,SCL,"Unit 20, The Pressworks 36-38",Berry Street,,Wolverhampton,,WV1 1HA,,No ratings yet Rate it yourself - /Services/careproviders/LeaveReview/DefaultView.aspx?id=1-14234228045,0,0,,
Complesso Healthcare Solutions,,SCL,Suite 8 The Boot Factory,22 Cleveland Road,,Wolverhampton,,WV2 1BH,Tel: 07496363510,No ratings yet Rate it yourself - /Services/careproviders/LeaveReview/DefaultView.aspx?id=1-2440773264,0,0,,
Creative Support - Wolverhampton Services,,SCL,The Boot Factory,22 Cleveland Road,,Wolverhampton,West Midlands,WV2 1BH,Tel: 01902458797,No ratings yet Rate it yourself - /Services/careproviders/LeaveReview/DefaultView.aspx?id=1-133366769,0,0,,
Prayngel Healthcare Limited,,SCL,Derwent House 42-46,Waterloo Road,,Wolverhampton,,WV1 4XB,Tel: 03303909535,1 rating Rate it yourself - /Services/careproviders/LeaveReview/DefaultView.aspx?id=1-2110699995,,,,
Medirite Healthcare,,SCL,Regent House,Bath Avenue,,Wolverhampton,West Midlands,WV1 4EG,Tel: 01902823438,No ratings yet Rate it yourself - /Services/careproviders/LeaveReview/DefaultView.aspx?id=1-2159545366,0,0,,
Geocare Services Wolverhampton,,SCL,Regent House,Bath Avenue,,Wolverhampton,West Midlands,WV1 4EG,Tel: 01902810119,No ratings yet Rate it yourself - /Services/careproviders/LeaveReview/DefaultView.aspx?id=1-9440117254,0,0,,
Ignite Nursing,,SCL,Regent House,Bath Avenue,,Wolverhampton,West Midlands,WV1 4EG,,No ratings yet Rate it yourself - /Services/careproviders/LeaveReview/DefaultView.aspx?id=1-14582792368,0,0,,
Alie Limited,,SCL,36 Waterloo Road,,,Wolverhampton,,WV1 4BL,Tel: 07533058309,No ratings yet Rate it yourself - /Services/careproviders/LeaveReview/DefaultView.aspx?id=1-10710205051,0,0,,
Care Angels Homecare Ltd,,SCL,9 Waterloo Road,,,Wolverhampton,West Midlands,WV1 4DJ,Tel: 01902275780,No ratings yet Rate it yourself - /Services/careproviders/LeaveReview/DefaultView.aspx?id=1-7694244777,0,0,,
Zion Care Services Limited,,SCL,9 Waterloo Road,,,Wolverhampton,West Midlands,WV1 4DJ,Tel: 07368934880,1 rating Rate it yourself - /Services/careproviders/LeaveReview/DefaultView.aspx?id=1-10644063424,,,,
TS Healthcare Limited,,SCL,11 Waterloo Road,,,Wolverhampton,West Midlands,WV1 4DJ,,No ratings yet Rate it yourself - /Services/careproviders/LeaveReview/DefaultView.aspx?id=1-7566958465,0,0,,
Martworld Care Services Limited,,SCL,"Waterloo Court, Offices 7 & 9",31 Waterloo Road,,Wolverhampton,,WV1 4DJ,Tel: 01902256397,1 rating Rate it yourself - /Services/careproviders/LeaveReview/DefaultView.aspx?id=1-2937441998,,,,
Wentworth Community Care Ltd,,SCL,6 Market Place,Brewood,,Stafford,,ST19 9BS,Tel: 01902946935,No ratings yet Rate it yourself - /Services/careproviders/LeaveReview/DefaultView.aspx?id=1-12606274881,0,0,,
Promises of Care,,SCL,80 Darlington Street,,,Wolverhampton,West Midlands,WV1 4JD,Tel: 01902587099,No ratings yet Rate it yourself - /Services/careproviders/LeaveReview/DefaultView.aspx?id=1-2501499161,0,0,,
Goldcrest Healthcare Service (Midlands),,SCL,28 Cleveland Street,,,Wolverhampton,,WV1 3HT,Tel: 01902972055,No ratings yet Rate it yourself - /Services/careproviders/LeaveReview/DefaultView.aspx?id=1-10233651067,0,0,,
Swan Care Solutions,,SCL,Suite 203 Denning House,1a George Street,,Wolverhampton,,WV2 4DP,Tel: 07925665692,2 ratings Rate it yourself - /Services/careproviders/LeaveReview/DefaultView.aspx?id=1-9267859487,,,,
Blu-Sky Care Limited,,SCL,Flat 1,"Hanover House, 11 George Street",,Wolverhampton,,WV2 4DG,Tel: 01902420571,No ratings yet Rate it yourself - /Services/careproviders/LeaveReview/DefaultView.aspx?id=1-446703229,0,0,,
Lonsdale Midlands DCA,,SCL,1st Floor St. Georges House,Lever Street,,Wolverhampton,,WV2 1EZ,Tel: 01905798247,No ratings yet Rate it yourself - /Services/careproviders/LeaveReview/DefaultView.aspx?id=1-131377984,0,0,,
Beyond Support Limited,,SCL,Regus 84 Salop Street,3rd & 4th floors,,Wolverhampton,,WV3 0SR,Tel: 01217924377,No ratings yet Rate it yourself - /Services/careproviders/LeaveReview/DefaultView.aspx?id=1-4187252777,0,0,,
Rance Healthcare Services Ltd,,SCL,84 Salop Street,3rd and 4th Floors,,Wolverhampton,,WV3 0SR,Tel: 01902973451,No ratings yet Rate it yourself - /Services/careproviders/LeaveReview/DefaultView.aspx?id=1-11775024685,0,0,,
Head Office,,SCL,317 Regus 3rd Floor,84 Salop Street,,Wolverhampton,,WV3 0SR,Tel: 07932028658,No ratings yet Rate it yourself - /Services/careproviders/LeaveReview/DefaultView.aspx?id=1-13945958923,0,0,,
Lovage Homecare Ltd,,SCL,"Office 424, 4th Floor, 84 Salop Street",,,Wolverhampton,,WV3 0SR,Tel: 07411757500,No ratings yet Rate it yourself - /Services/careproviders/LeaveReview/DefaultView.aspx?id=1-12903720590,0,0,,
"Whiteshed Healthcare, Wolverhampton",,SCL,84 Salop Street,"3rd & 4th Floors,",,Wolverhampton,,WV3 0SR,Tel: 07445031390,No ratings yet Rate it yourself - /Services/careproviders/LeaveReview/DefaultView.aspx?id=1-14567008830,0,0,,
The Hub,,SCL,Progress House,127 Millfields Road,,Wolverhampton,West Midlands,WV4 6JG,,No ratings yet Rate it yourself - /Services/careproviders/LeaveReview/DefaultView.aspx?id=1-6615555179,0,0,,
Integra Supported Housing,,SCL,Integra Support - Office S4,"Deansgate Offices, Tettenhall Road",,Wolverhampton,,WV1 4TH,Tel: 01384288220,3 ratings Rate it yourself - /Services/careproviders/LeaveReview/DefaultView.aspx?id=1-498786000,,,,
Arch West Midlands,,SCL,55 Cherry Tree Avenue,,,Walsall,,WS5 4JN,Tel: 01217140500,No ratings yet Rate it yourself - /Services/careproviders/LeaveReview/DefaultView.aspx?id=1-12427547986,0,0,,
Rockspur House,,SCL,16 Orchard Lane,Codsall,,Wolverhampton,,WV8 1NE,,No ratings yet Rate it yourself - /Services/careproviders/LeaveReview/DefaultView.aspx?id=1-9691794362,0,0,,
Oak Cottage,,SCL,Oak Street,,,Wolverhampton,West Midlands,WV3 0AD,Tel: 01902212188,No ratings yet Rate it yourself - /Services/careproviders/LeaveReview/DefaultView.aspx?id=1-14213419184,0,0,,
Caremax Support Services Ltd,,SCL,Spring Road,Ettingshall,,Wolverhampton,,WV4 6JX,,No ratings yet Rate it yourself - /Services/careproviders/LeaveReview/DefaultView.aspx?id=1-10177317455,0,0,,
ULTICare Limited,,SCL,"The Saturn Centre, Suite 10, 2nd Floor","Spring Road, Ettingshall",,Wolverhampton,,WV4 6JX,Tel: 01902492100,No ratings yet Rate it yourself - /Services/careproviders/LeaveReview/DefaultView.aspx?id=1-2161811352,0,0,,
House of the Flame Lily,,SCL,144 Penn Road,,,Wolverhampton,West Midlands,WV3 0EE,Tel: 03334560120,No ratings yet Rate it yourself - /Services/careproviders/LeaveReview/DefaultView.aspx?id=1-6592356837,0,0,,
Mancroft,,SCL,2 Mancroft Road,,,Wolverhampton,West Midlands,WV6 8RS,Tel: 01902742428,No ratings yet Rate it yourself - /Services/careproviders/LeaveReview/DefaultView.aspx?id=1-318519330,0,0,,
Charis Home Care Ltd,,SCL,1 Greensand Drive,Coseley,,Bilston,,WV14 8SF,Tel: 07539739455,No ratings yet Rate it yourself - /Services/careproviders/LeaveReview/DefaultView.aspx?id=1-14443768195,0,0,,
Bessie Care Solutions Ltd,,SCL,58 Pembroke Road,,,West Bromwich,,B71 2NN,Tel: 07446077856,No ratings yet Rate it yourself - /Services/careproviders/LeaveReview/DefaultView.aspx?id=1-13679828846,0,0,,
Aspirations Staffordshire,,SCL,"Door No.8, Unit 2B, Dunston Business Village Park",Stafford Road,,Stafford,,ST18 9AB,Tel: 01785450381,No ratings yet Rate it yourself - /Services/careproviders/LeaveReview/DefaultView.aspx?id=1-15526020978,0,0,,
Sunnyside Healthcare Services Limited,,SCL,22 Glebefields Road,,,Tipton,,DY4 0NZ,Tel: 07823441285,No ratings yet Rate it yourself - /Services/careproviders/LeaveReview/DefaultView.aspx?id=1-10834154931,0,0,,
JayasCare,,SCL,6 Comsey Road,,,Birmingham,,B43 7RG,Tel: 07493878610,No ratings yet Rate it yourself - /Services/careproviders/LeaveReview/DefaultView.aspx?id=1-14143157178,0,0,,
55 Bowstoke Road,,SCL,55 Bowstoke Road,,,Birmingham,West Midlands,B43 5DJ,Tel: 01214484863,No ratings yet Rate it yourself - /Services/careproviders/LeaveReview/DefaultView.aspx?id=1-2280337989,0,0,,
Imperial Breeze Healthcare Ltd,,SCL,Office 30 Brook House,"Brook Street Business Centre, Brook Street",,Tipton,,DY4 9DD,Tel: 01217942522,No ratings yet Rate it yourself - /Services/careproviders/LeaveReview/DefaultView.aspx?id=1-5468513247,0,0,,
Konastone Healthcare Ltd,,SCL,20 Brook House,Brook Street,,Tipton,West Midlands,DY4 9DD,,No ratings yet Rate it yourself - /Services/careproviders/LeaveReview/DefaultView.aspx?id=1-2950714022,0,0,,
Crestar Healthcare,,SCL,Grenville House,New Swan Lane,,West Bromwich,West Midlands,B70 0NS,Tel: 01215720043,No ratings yet Rate it yourself - /Services/careproviders/LeaveReview/DefaultView.aspx?id=1-2106265434,0,0,,
Daffodil House,,SCL,2 Spring Street,,,Tipton,,DY4 8TF,Tel: 07400166858,No ratings yet Rate it yourself - /Services/careproviders/LeaveReview/DefaultView.aspx?id=1-10291543287,0,0,,
Knoll House,,SCL,The Avenue,Penn,,Wolverhampton,West Midlands,WV4 5HW,Tel: 01902330559,No ratings yet Rate it yourself - /Services/careproviders/LeaveReview/DefaultView.aspx?id=1-2632838280,0,0,,
Empathy view Healthcare Services Limited,,SCL,42 Kings Road,,,Dudley,,DY3 1HP,Tel: 07984152870,No ratings yet Rate it yourself - /Services/careproviders/LeaveReview/DefaultView.aspx?id=1-14355762409,0,0,,
Universal Integrated Services,,SCL,"Office 12, Western Gateway Building YMCA",38 Carters Green,,West Bromwich,,B70 9LG,Tel: 07483331523,No ratings yet Rate it yourself - /Services/careproviders/LeaveReview/DefaultView.aspx?id=1-14185814553,0,0,,
Clements Health Care,,SCL,13 Carters Green,,,West Bromwich,West Midlands,B70 9QP,Tel: 01215535303,No ratings yet Rate it yourself - /Services/careproviders/LeaveReview/DefaultView.aspx?id=1-3645349686,0,0,,
Trust In Care Limited,,SCL,339 High Street,,,West Bromwich,,B70 9QG,Tel: 01214391171,No ratings yet Rate it yourself - /Services/careproviders/LeaveReview/DefaultView.aspx?id=1-15273405070,0,0,,
Select Lifestyles Limited,,SCL,"Select House, 335-337",High Street,,West Bromwich,,B70 8LU,Tel: 01215412122,No ratings yet Rate it yourself - /Services/careproviders/LeaveReview/DefaultView.aspx?id=1-13938197009,0,0,,
Great Care Home Health care Services Ltd,,SCL,9 St Michaels Court,Victoria Street,,West Bromwich,West Midlands,B70 8ET,Tel: 01215533830,No ratings yet Rate it yourself - /Services/careproviders/LeaveReview/DefaultView.aspx?id=1-1202836939,0,0,,
Care Cover 24/7,,SCL,"Suite B, Maple House","Kingswood Business Park, Holyhead Road, Albrighton",,Wolverhampton,,WV7 3AU,Tel: 01902255083,No ratings yet Rate it yourself - /Services/careproviders/LeaveReview/DefaultView.aspx?id=1-8406382998,0,0,,
Pegasus Care Home,,SCL,65-67 Beeches Road,,,West Bromwich,West Midlands,B70 6HQ,Tel: 01215532900,No ratings yet Rate it yourself - /Services/careproviders/LeaveReview/DefaultView.aspx?id=1-331297275,0,0,,
Sandwell Community Caring Trust,,SCL,"9th Floor, West Plaza",144 High Street,,West Bromwich,West Midlands,B70 6JJ,Tel: 01215532722,1 rating Rate it yourself - /Services/careproviders/LeaveReview/DefaultView.aspx?id=1-123515298,,,,
Health Matters,,SCL,Office at Health Matters,14-16 Beauchamp Avenue,,Birmingham,,B20 1DR,,No ratings yet Rate it yourself - /Services/careproviders/LeaveReview/DefaultView.aspx?id=1-2828593075,0,0,,
Future Home Care Ltd Birmingham,,SCL,Castlemill,Burnt Tree,,Tipton,West Midlands,DY4 7UF,Tel: 07946210997,No ratings yet Rate it yourself - /Services/careproviders/LeaveReview/DefaultView.aspx?id=1-2805173042,0,0,,
Lifeways Community Care Limited (Birmingham & Wolverhampton),,SCL,Castlemill,Burnt Tree,,Tipton,West Midlands,DY4 7UF,Tel: 01215414000,No ratings yet Rate it yourself - /Services/careproviders/LeaveReview/DefaultView.aspx?id=1-2730089873,0,0,,
SLC Paragon (Midlands),,SCL,Castlemill,Burnt Tree,,Tipton,West Midlands,DY4 7UF,Tel: 01215414003,No ratings yet Rate it yourself - /Services/careproviders/LeaveReview/DefaultView.aspx?id=1-2842257585,0,0,,
Trident Reach Domiciliary Care - Dudley & Wolverhampton Branch,,SCL,"Floor 2, South Wing","Castle Mill Building, Burnt Tree",,Tipton,,DY4 7UF,Tel: 01212265822,No ratings yet Rate it yourself - /Services/careproviders/LeaveReview/DefaultView.aspx?id=1-1526784641,0,0,,
Premiere Advantage Ltd,,SCL,206s Castlemill,Burnt Tree,,Tipton,,DY4 7UF,Tel: 07947272058,No ratings yet Rate it yourself - /Services/careproviders/LeaveReview/DefaultView.aspx?id=1-12161473956,0,0,,