Organisation Name,NACS Code,Organisation Type,Address1,Address2,Address3,Address4,Address5,PostCode,Telephone Number,NHS.UK users rating,Value  (NHS.UK users rating),Banding Classification  (NHS.UK users rating),Car parking (Is there car parking at this organisation?),Disabled access (Disabled access)
London Supported Living Services,,SCL,St. Richards House,110 Eversholt Street,,London,,NW1 1BS,Tel: 02072845450,No ratings yet Rate it yourself - /Services/careproviders/LeaveReview/DefaultView.aspx?id=1-130597324,0,0,,
Immediate Social Care Limited,,SCL,30C Acton Street,,,London,,WC1X 9NE,Tel: 02086380778,No ratings yet Rate it yourself - /Services/careproviders/LeaveReview/DefaultView.aspx?id=1-650238255,0,0,,
Westminster Bridge Road,,SCL,Ground Floor,100 Westminster Bridge Road,,London,,SE1 7XA,Tel: 02072614100,No ratings yet Rate it yourself - /Services/careproviders/LeaveReview/DefaultView.aspx?id=1-15199313488,0,0,,
SENSE - South East Supported Living Services,,SCL,101 Pentonville Road,Kings Cross,,London,,N1 9LG,Tel: 03003309250,No ratings yet Rate it yourself - /Services/careproviders/LeaveReview/DefaultView.aspx?id=1-1648725751,0,0,,
Together for Mental Wellbeing Supported Living Branch,,SCL,52 Walnut Tree Walk,,,London,,SE11 6DN,Tel: 02077807300,No ratings yet Rate it yourself - /Services/careproviders/LeaveReview/DefaultView.aspx?id=1-368178527,0,0,,
Transforming Support (South London),,SCL,36-37 Albert Embankment,,,London,,SE1 7TL,Tel: 03033003000,No ratings yet Rate it yourself - /Services/careproviders/LeaveReview/DefaultView.aspx?id=1-18174111815,0,0,,
Secure Care London Ltd,,SCL,Alpha House,100 Borough High Street,,London,,SE1 1LB,Tel: 07939369898,No ratings yet Rate it yourself - /Services/careproviders/LeaveReview/DefaultView.aspx?id=1-17411315387,0,0,,
Transforming Support (Coulsdon),,SCL,New City Court,20 St. Thomas Street,,London,,SE1 9RS,Tel: 03033003000,No ratings yet Rate it yourself - /Services/careproviders/LeaveReview/DefaultView.aspx?id=1-18174788241,0,0,,
Battersea Place Retirement Village Limited,,SCL,73 Albert Bridge Road,Battersea,,London,,SW11 4DS,Tel: 07745649051,No ratings yet Rate it yourself - /Services/careproviders/LeaveReview/DefaultView.aspx?id=1-2525654037,0,0,,
Islington Council Supported Living Service for Adults with Learning Disabilities,,SCL,14A Arlington Square,,,London,,N1 7DR,Tel: 02075271811,No ratings yet Rate it yourself - /Services/careproviders/LeaveReview/DefaultView.aspx?id=1-4678566272,0,0,,
Clarion Health Ltd,,SCL,63 St. Mary Axe,,,London,,EC3A 8AA,Tel: 07533371155,No ratings yet Rate it yourself - /Services/careproviders/LeaveReview/DefaultView.aspx?id=1-16465962094,0,0,,
Piper House,,SCL,2 St Marks Road,,,London,,W11 1RQ,Tel: 07951472868,No ratings yet Rate it yourself - /Services/careproviders/LeaveReview/DefaultView.aspx?id=1-2867132067,0,0,,
St Martins of Tours Housing - 158-162 New North Road,,SCL,158-162 New North Road,,,London,,N1 7BH,Tel: 02077049786,No ratings yet Rate it yourself - /Services/careproviders/LeaveReview/DefaultView.aspx?id=1-112849219,0,0,,
VIDA Supported Living - London,,SCL,3 More,London Riverside,,London,,SE1 2RE,Tel: 02039101460,No ratings yet Rate it yourself - /Services/careproviders/LeaveReview/DefaultView.aspx?id=1-17716386282,0,0,,
Equal People Mencap,,SCL,73 St Charles Square,Kensington,,London,,W10 6EJ,Tel: 02089640544,No ratings yet Rate it yourself - /Services/careproviders/LeaveReview/DefaultView.aspx?id=1-210054189,0,0,,
Devoted Butterfly Ltd,,SCL,Unit 27 Links Yard,Spelman Street,,London,,E1 5LX,Tel: 07961795534,No ratings yet Rate it yourself - /Services/careproviders/LeaveReview/DefaultView.aspx?id=1-14334842334,0,0,,
The Safehouse BD Limited,,SCL,348a,Kilburn High Road,,London,,NW6 2QJ,Tel: 03332244946,1 rating Rate it yourself - /Services/careproviders/LeaveReview/DefaultView.aspx?id=1-11427888128,,,,
Creative Support - London Services,,SCL,Unit 5,"Archway Business Centre, 19-23 Wedmore Street",,London,,N19 4RZ,Tel: 02072722865,No ratings yet Rate it yourself - /Services/careproviders/LeaveReview/DefaultView.aspx?id=1-133366799,0,0,,
Brent Supported Living,,SCL,167 Willesden Lane,,,London,,NW6 7YL,Tel: 02084595007,No ratings yet Rate it yourself - /Services/careproviders/LeaveReview/DefaultView.aspx?id=1-9656379878,0,0,,
Golden Key Support Ltd,,SCL,93-101 Greenfield Road,,,London,,E1 1EJ,Tel: 02036897015,No ratings yet Rate it yourself - /Services/careproviders/LeaveReview/DefaultView.aspx?id=1-2420902049,0,0,,
Serenity Integrated Care,,SCL,"Nile Business Centre, Second Floor, Room No. 214",60 Nelson Street,,London,,E1 2DE,Tel: 07957565164,No ratings yet Rate it yourself - /Services/careproviders/LeaveReview/DefaultView.aspx?id=1-3783795171,0,0,,
Mondonovo Care Limited,,SCL,"Unit B2, 62 Beechwood Road",Hackney,,London,,E8 3DY,Tel: 07467710336,No ratings yet Rate it yourself - /Services/careproviders/LeaveReview/DefaultView.aspx?id=1-6383116359,0,0,,
Global Healthcare Limited,,SCL,"Unit 6, 80a Ashfield Street",,,London,,E1 2BJ,Tel: 02034881059,No ratings yet Rate it yourself - /Services/careproviders/LeaveReview/DefaultView.aspx?id=1-17715492184,0,0,,
Domiciliary Care Agency Surrey,,SCL,John Morris House Community Centre,"164 St Johns Hill, Battersea",,London,,SW11 1SW,Tel: 07458127283,No ratings yet Rate it yourself - /Services/careproviders/LeaveReview/DefaultView.aspx?id=1-13562441189,0,0,,
Edward Gibbons House,,SCL,Flat 1 Edward Gibbons House,Parmiter Street,,London,,E2 9NG,Tel: 020 8983 1983,2 ratings Rate it yourself - /Services/careproviders/LeaveReview/DefaultView.aspx?id=1-1162640335,,,,
Ramah Ker Services Ltd,,SCL,Unit BB46,"The Link, 49 Effra Road",,London,,SW2 1BZ,Tel: 07735479207,No ratings yet Rate it yourself - /Services/careproviders/LeaveReview/DefaultView.aspx?id=1-14684729467,0,0,,
Creative Support - Sue Starkey House & Shipton House,,SCL,Sue Starkey House,6 West Arbour Street,,London,,E1 0FB,Tel: 07817460325,No ratings yet Rate it yourself - /Services/careproviders/LeaveReview/DefaultView.aspx?id=1-2326318021,0,0,,
Beechcroft Care Ltd,,SCL,182A Denmark Hill,,,London,,SE5 8EE,Tel: 07367067572,No ratings yet Rate it yourself - /Services/careproviders/LeaveReview/DefaultView.aspx?id=1-18026916935,0,0,,
"London Borough of Hackney, Housing with Care",,SCL,Hackney Service Centre,"1 Hillman Street, Hackney",,London,,E8 1DY,Tel: 02083564864,No ratings yet Rate it yourself - /Services/careproviders/LeaveReview/DefaultView.aspx?id=1-136277108,0,0,,
CLIA Care,,SCL,Apartment 5,1C Osiers Road,,London,,SW18 1NL,Tel: 07738510983,2 ratings Rate it yourself - /Services/careproviders/LeaveReview/DefaultView.aspx?id=1-4279526341,,,,
Social Care 4U,,SCL,4 Downs Court Parade,Amhurst Road,,London,,E8 2AQ,Tel: 02089867722,No ratings yet Rate it yourself - /Services/careproviders/LeaveReview/DefaultView.aspx?id=1-128649142,0,0,,
Creative Support - Melody Road,,SCL,Poplar House,"126a, Melody Road",,London,,SW18 2BF,Tel: 07976915989,No ratings yet Rate it yourself - /Services/careproviders/LeaveReview/DefaultView.aspx?id=1-9554124815,0,0,,
Assured Healthcare Limited,,SCL,30 Wagner Street,,,London,,SE15 1NN,Tel: 07985373246,No ratings yet Rate it yourself - /Services/careproviders/LeaveReview/DefaultView.aspx?id=1-15321217985,0,0,,
First Connect Healthcare Ltd,,SCL,1 Hooks Close,,,London,,SE15 2TP,,No ratings yet Rate it yourself - /Services/careproviders/LeaveReview/DefaultView.aspx?id=1-16378409964,0,0,,
Brockwell Care,,SCL,1-4 Brixton Hill Place,,,London,,SW2 1HJ,Tel: 02086785944,No ratings yet Rate it yourself - /Services/careproviders/LeaveReview/DefaultView.aspx?id=1-996882727,0,0,,
Kuklous HealthCare Limited,,SCL,108-114,Golders Green Road,,London,,NW11 8HB,Tel: 02084580103,No ratings yet Rate it yourself - /Services/careproviders/LeaveReview/DefaultView.aspx?id=1-11772776505,0,0,,
58 Acton Lane,,SCL,58 Acton Lane,,,London,,NW10 8TU,Tel: 02036208147,No ratings yet Rate it yourself - /Services/careproviders/LeaveReview/DefaultView.aspx?id=1-5076460230,0,0,,
Yad Voezer Limited Supported Living Service,,SCL,9a Amhurst Park,Hackney,,London,,N16 5DH,Tel: 02088028899,No ratings yet Rate it yourself - /Services/careproviders/LeaveReview/DefaultView.aspx?id=1-6581839338,0,0,,
Townley Road,,SCL,2-3 Townley Road,,,London,,SE22 8SW,Tel: 02086935449,No ratings yet Rate it yourself - /Services/careproviders/LeaveReview/DefaultView.aspx?id=1-9672526789,0,0,,
Mary Jones Court,,SCL,6 Garford Street,Westferry,,London,,E14 8JQ,Tel: 02075157300,No ratings yet Rate it yourself - /Services/careproviders/LeaveReview/DefaultView.aspx?id=1-347806712,0,0,,
Yarrow Domiciliary Care Agency,,SCL,31-33 Lumiere Court,209 Balham High Road,,London,,SW17 7BQ,Tel: 02087354600,No ratings yet Rate it yourself - /Services/careproviders/LeaveReview/DefaultView.aspx?id=1-136010893,0,0,,
Southside Partnership Domiciliary Care Agency,,SCL,31-33 Lumiere Court,209 Balham High Road,,London,,SW17 7BQ,Tel: 02087726222,No ratings yet Rate it yourself - /Services/careproviders/LeaveReview/DefaultView.aspx?id=1-117373860,0,0,,
Diligent Care Services,,SCL,4 Holmsdale Terrace,South Tottenham,,London,,N15 6PP,Tel: 02088080805,No ratings yet Rate it yourself - /Services/careproviders/LeaveReview/DefaultView.aspx?id=1-295820741,0,0,,
Marigold Care Group Ltd,,SCL,14 Little Dimocks,,,London,,SW12 9JJ,Tel: 07446323937,No ratings yet Rate it yourself - /Services/careproviders/LeaveReview/DefaultView.aspx?id=1-13513401606,0,0,,
Sanctuary Supported Living - Ealing Care Services,,SCL,26 Cumberland Park,,,Acton,London,W3 6SX,Tel: 02089931346,No ratings yet Rate it yourself - /Services/careproviders/LeaveReview/DefaultView.aspx?id=1-2369911445,0,0,,
Mountsview Homes,,SCL,47 Desmond Street,,,London,,SE14 6JA,,No ratings yet Rate it yourself - /Services/careproviders/LeaveReview/DefaultView.aspx?id=1-18243575099,0,0,,
Three C's Support,,SCL,Unit 4,"82-84, Childers Street",,London,,SE8 5FS,,No ratings yet Rate it yourself - /Services/careproviders/LeaveReview/DefaultView.aspx?id=1-4826424113,0,0,,
Bio Luminuex Health Care Limited,,SCL,Docklands Business Centre,10-16 Tiller Road,,London,,E14 8PX,Tel: 02032913906,No ratings yet Rate it yourself - /Services/careproviders/LeaveReview/DefaultView.aspx?id=1-4054170060,0,0,,
KT's Care Angels West London,,SCL,"Suite 201, A J P Business Centre",152-154 Coles Green Road,,London,,NW2 7HD,Tel: 02082054862,No ratings yet Rate it yourself - /Services/careproviders/LeaveReview/DefaultView.aspx?id=1-11932085259,0,0,,
Akos Care Limited,,SCL,82b,Eastway,,London,,E9 5JF,Tel: 07961751566,No ratings yet Rate it yourself - /Services/careproviders/LeaveReview/DefaultView.aspx?id=1-12471853830,0,0,,
D&M Supported Living Limited,,SCL,4 Ruddington Close,,,London,,E5 0SR,Tel: 07438789671,No ratings yet Rate it yourself - /Services/careproviders/LeaveReview/DefaultView.aspx?id=1-16408570137,0,0,,
80b Randall Avenue,,SCL,80b Randall Avenue,,,London,,NW2 7SU,Tel: 02084520336,No ratings yet Rate it yourself - /Services/careproviders/LeaveReview/DefaultView.aspx?id=1-6374429312,0,0,,
37 Coleraine Road,,SCL,37 Coleraine Road,Wood Green,,London,,N8 0QJ,Tel: 02088884348,3 ratings Rate it yourself - /Services/careproviders/LeaveReview/DefaultView.aspx?id=1-246078383,,,,
Bleep 360 Care Canary Wharf,,SCL,30 Churchill Place,We Work,,London,,E14 5RE,,No ratings yet Rate it yourself - /Services/careproviders/LeaveReview/DefaultView.aspx?id=1-13038295800,0,0,,
Central Support Ltd,,SCL,2 Harbinger Road,,,London,,E14 3AA,Tel: 07984763353,No ratings yet Rate it yourself - /Services/careproviders/LeaveReview/DefaultView.aspx?id=1-18463657875,0,0,,
Nwando Domiciliary Care,,SCL,Unit G03 The Chocolate Factory,5 Clarendon Road,,London,,N22 6XJ,Tel: 02031769464,2 ratings Rate it yourself - /Services/careproviders/LeaveReview/DefaultView.aspx?id=1-2064595547,,,,
Rathbone Outreach Service,,SCL,8 Chatsworth Way,8 Chatsworth Way,,London,,SE27 9HR,,No ratings yet Rate it yourself - /Services/careproviders/LeaveReview/DefaultView.aspx?id=1-109913358,0,0,,
Lester Court,,SCL,27 Bruce Road,,,London,,E3 3HN,Tel: 02034864226,No ratings yet Rate it yourself - /Services/careproviders/LeaveReview/DefaultView.aspx?id=1-6915425867,0,0,,
Verve Homecare Ltd,,SCL,Exchange Tower,1 Harbour Exchange Square,,London,,E14 9GE,Tel: 02072230000,No ratings yet Rate it yourself - /Services/careproviders/LeaveReview/DefaultView.aspx?id=1-13886269735,0,0,,
Creative Support - Duncan Court,,SCL,88 Teviot Street,,,London,,E14 6PX,Tel: 02075380297,No ratings yet Rate it yourself - /Services/careproviders/LeaveReview/DefaultView.aspx?id=1-2634727056,0,0,,
CareTech South East Supported Living,,SCL,44 Chestnut Road,,,London,,SE27 9LF,,No ratings yet Rate it yourself - /Services/careproviders/LeaveReview/DefaultView.aspx?id=1-7059929908,0,0,,
The Tower Project - Indigo Mews,,SCL,"13 Indigo Mews, Ashton Street",,,London,,E14 9PN,,No ratings yet Rate it yourself - /Services/careproviders/LeaveReview/DefaultView.aspx?id=1-15539615205,0,0,,
ABP Cares Limited,,SCL,27b Hanover Road,,,London,,N15 4DL,Tel: 07956190022,No ratings yet Rate it yourself - /Services/careproviders/LeaveReview/DefaultView.aspx?id=1-18693418805,0,0,,
Living Spring Solutions (Care & Training) Ltd,,SCL,"River View Office, Unit 1",Greenwich Quay,,London,,SE8 3EY,Tel: 020 3417 0405,No ratings yet Rate it yourself - /Services/careproviders/LeaveReview/DefaultView.aspx?id=1-2491149075,0,0,,
365 Care Solutions Ltd,,SCL,"Unit 156, Light Box, 111 Power Road",,,London,,W4 5PY,Tel: 02083168994,No ratings yet Rate it yourself - /Services/careproviders/LeaveReview/DefaultView.aspx?id=1-11210283645,0,0,,
L'Arche London,,SCL,9-13 Norwood High Street,West Norwood,,London,,SE27 9JU,Tel: 02086706714,No ratings yet Rate it yourself - /Services/careproviders/LeaveReview/DefaultView.aspx?id=1-3984596263,0,0,,
Real Homecare,,SCL,"Unit 213, Tudorleaf Business Centre",2-8 Fountayne Road,,London,,N15 4QL,Tel: 07539616931,No ratings yet Rate it yourself - /Services/careproviders/LeaveReview/DefaultView.aspx?id=1-7261994517,0,0,,
Unit 1A Tudorleaf Business Centre,,SCL,Unit 1A Tudorleaf Business Centre,2-8 Fountayne Road,,London,,N15 4QL,Tel: 07908756984,No ratings yet Rate it yourself - /Services/careproviders/LeaveReview/DefaultView.aspx?id=1-13633599257,0,0,,
Star Maris Healthcare Limited,,SCL,Unit 221 Tudorleaf Business Centre,2-8 Fountayne Road,,London,,N15 4QL,Tel: 07957444158,3 ratings Rate it yourself - /Services/careproviders/LeaveReview/DefaultView.aspx?id=1-14348055165,,,,
Fairplacecare,,SCL,44 Watford Way,,,London,,NW4 3AL,Tel: 02082056856,No ratings yet Rate it yourself - /Services/careproviders/LeaveReview/DefaultView.aspx?id=1-6521526589,0,0,,
Aurora Options,,SCL,Unit 3 California Building,Deals Gateway,,London,,SE13 7SB,Tel: 0208498103,No ratings yet Rate it yourself - /Services/careproviders/LeaveReview/DefaultView.aspx?id=1-13420339116,0,0,,
Streatham,,SCL,223 Streatham High Road,,,London,,SW16 6EN,Tel: 02086773333,No ratings yet Rate it yourself - /Services/careproviders/LeaveReview/DefaultView.aspx?id=1-5605130305,0,0,,
Eastern Lodge,,SCL,28 Eastern Road,,,London,,N22 7DD,Tel: 07402951877,No ratings yet Rate it yourself - /Services/careproviders/LeaveReview/DefaultView.aspx?id=1-11433625155,0,0,,
Dillon Care Pathway,,SCL,24 Talbot Crescent,Hendon,,London,,NW4 4PE,Tel: 02071937462,No ratings yet Rate it yourself - /Services/careproviders/LeaveReview/DefaultView.aspx?id=1-147679369,0,0,,
"Ealing, London",,SCL,"Unit 513, Crown House",North Circular Road,,London,,NW10 7PN,Tel: 02089657209,No ratings yet Rate it yourself - /Services/careproviders/LeaveReview/DefaultView.aspx?id=1-1080036731,0,0,,
Dimensions London North/East Domiciliary Care Office,,SCL,1 Joshua Close,Muswell Hill,,London,,N10 2JF,Tel: 03003039002,No ratings yet Rate it yourself - /Services/careproviders/LeaveReview/DefaultView.aspx?id=1-1713686994,0,0,,
Tudor Gardens,,SCL,27-31 Tudor Gardens,Kingsbury,,London,,NW9 8RL,Tel: 02089084692,No ratings yet Rate it yourself - /Services/careproviders/LeaveReview/DefaultView.aspx?id=1-142751234,0,0,,
St Nicholas Glebe,,SCL,6 St. Nicholas Glebe,Rectory Lane,,London,,SW17 9QH,Tel: 02087670071,No ratings yet Rate it yourself - /Services/careproviders/LeaveReview/DefaultView.aspx?id=1-9671158985,0,0,,
Curans Care,,SCL,173 Tooting High Street,,,London,,SW17 0SZ,Tel: 02086720240,No ratings yet Rate it yourself - /Services/careproviders/LeaveReview/DefaultView.aspx?id=1-5764206241,0,0,,
"Brandon Trust Supported Living - Trident Business Centre, Tooting",,SCL,89 Bickersteth Road,Tooting,,London,,SW17 9SH,Tel: 01452886307,No ratings yet Rate it yourself - /Services/careproviders/LeaveReview/DefaultView.aspx?id=1-4305903260,0,0,,
15 Earlham Grove,,SCL,15 Earlham Grove,,,London,,N22 5HJ,Tel: 08002313286,No ratings yet Rate it yourself - /Services/careproviders/LeaveReview/DefaultView.aspx?id=1-14905863341,0,0,,
Olive Homecare and Support Limited London Branch,,SCL,"Suite 102, Regent 88",210 Church Road,,London,,E10 7JQ,Tel: 02031500659,No ratings yet Rate it yourself - /Services/careproviders/LeaveReview/DefaultView.aspx?id=1-15977021175,0,0,,
Westminster Homecare Limited (North London),,SCL,"Hyde House, The Hyde",Edgware Road,,London,,NW9 6LH,Tel: 02082002030,No ratings yet Rate it yourself - /Services/careproviders/LeaveReview/DefaultView.aspx?id=1-126215494,0,0,,
Evergreen Care,,SCL,Central House,1 Ballards Lane,,London,,N3 1LQ,Tel: 02080904748,1 rating Rate it yourself - /Services/careproviders/LeaveReview/DefaultView.aspx?id=1-2525712341,,,,
HALLMARK HEALTHCARE SERVICE LIMITED,,SCL,"Central House, 1 Ballards Lane",Finchley Central,,London,,N3 1LQ,Tel: 07903413347,1 rating Rate it yourself - /Services/careproviders/LeaveReview/DefaultView.aspx?id=1-12369721155,,,,
J.C.Michael Groups Ltd Stratford,,SCL,65 Broadway,,,London,,E15 4BQ,Tel: 02085144462,1 rating Rate it yourself - /Services/careproviders/LeaveReview/DefaultView.aspx?id=1-2223386681,,,,
ML Homes,,SCL,17 Elm Park Road,,,London,,N3 1EG,,No ratings yet Rate it yourself - /Services/careproviders/LeaveReview/DefaultView.aspx?id=1-10359881067,0,0,,
SLS Outreach,,SCL,49 Waddington Road,,,London,,E15 1QL,Tel: 02036377590,1 rating Rate it yourself - /Services/careproviders/LeaveReview/DefaultView.aspx?id=1-12562379517,,,,
Nisacraftcare,,SCL,27 - 28 Continental House,497 Sunleigh Road,,Wembley,,HA0 4LY,Tel: 02087338227,No ratings yet Rate it yourself - /Services/careproviders/LeaveReview/DefaultView.aspx?id=1-6386783869,0,0,,
"Brockley, London",,SCL,95 Ewhurst Road,"Crofton Park, Brockley",,London,,SE4 1SD,,No ratings yet Rate it yourself - /Services/careproviders/LeaveReview/DefaultView.aspx?id=1-9595952459,0,0,,
Magic House,,SCL,5-11 Green Lanes,,,London,,N13 4TN,Tel: 02088264348,No ratings yet Rate it yourself - /Services/careproviders/LeaveReview/DefaultView.aspx?id=1-662701994,0,0,,
Alters Recruitment Limited t/a Alters Nursing - London,,SCL,4 Church Street,Stratford,,London,,E15 3HX,Tel: 02082791515,No ratings yet Rate it yourself - /Services/careproviders/LeaveReview/DefaultView.aspx?id=1-127105530,0,0,,
Vista Care,,SCL,Suite 3,119 The Grove,,London,,E15 1EN,Tel: 02033276431,No ratings yet Rate it yourself - /Services/careproviders/LeaveReview/DefaultView.aspx?id=1-12155847617,0,0,,
Shine House,,SCL,2 Moss Hall Crescent,,,London,,N12 8NY,Tel: 02033043053,No ratings yet Rate it yourself - /Services/careproviders/LeaveReview/DefaultView.aspx?id=1-2948851953,0,0,,
Mawii Home Care Limited,,SCL,Romer House,132 Lewisham High Street,,London,,SE13 6EE,Tel: 02039848477,No ratings yet Rate it yourself - /Services/careproviders/LeaveReview/DefaultView.aspx?id=1-6193098257,0,0,,
Jome Healthcare,,SCL,Romer House,132 Lewisham High Street,,London,,SE13 6EE,Tel: 02030924672,No ratings yet Rate it yourself - /Services/careproviders/LeaveReview/DefaultView.aspx?id=1-11915657295,0,0,,
HDH Care and Support,,SCL,"Romer House, Ist Floor",132 Lewisham High Street,,London,,SE13 6EE,Tel: 02030924845,No ratings yet Rate it yourself - /Services/careproviders/LeaveReview/DefaultView.aspx?id=1-10153499805,0,0,,
Baytree Lodge,,SCL,270 - 272 Ballards Lane,Finchley,,London,,N12 0ET,Tel: 02084458114,No ratings yet Rate it yourself - /Services/careproviders/LeaveReview/DefaultView.aspx?id=1-128394376,0,0,,
Kenyarcher Care Ltd,,SCL,Kingsbury House,468 Church Lane,,London,,NW9 8UA,Tel: 07577601984,No ratings yet Rate it yourself - /Services/careproviders/LeaveReview/DefaultView.aspx?id=1-13309169228,0,0,,
New Villas Office,,SCL,"2 New Villas, Baronet Road",,,London,,N17 0LT,,No ratings yet Rate it yourself - /Services/careproviders/LeaveReview/DefaultView.aspx?id=1-4826754631,0,0,,
Bluefield Care Services,,SCL,282 Lewisham High Street,,,London,,SE13 6JZ,Tel: 02086900005,1 rating Rate it yourself - /Services/careproviders/LeaveReview/DefaultView.aspx?id=1-3492776865,,,,
Niorgrey Health Care Limited,,SCL,"Ibex House, Unit 7","1C Maryland Park, Stratford",,London,,E15 1HR,Tel: 07904603217,No ratings yet Rate it yourself - /Services/careproviders/LeaveReview/DefaultView.aspx?id=1-15069672235,0,0,,
J.C.Michael Groups Ltd Wandsworth,,SCL,182 The Broadway,,,London,,SW19 1RY,Tel: 02085408441,No ratings yet Rate it yourself - /Services/careproviders/LeaveReview/DefaultView.aspx?id=1-2193075496,0,0,,
JS Care Agency,,SCL,G30b Expressway,1 Dock Road,,London,,E16 1AH,Tel: 02084704219,No ratings yet Rate it yourself - /Services/careproviders/LeaveReview/DefaultView.aspx?id=1-4726779082,0,0,,
Yellowstone Healthcare Ltd,,SCL,"Unit G12, Waterfront Studios Business Centre",1 Dock Road,,London,,E16 1AG,Tel: 02038769258,No ratings yet Rate it yourself - /Services/careproviders/LeaveReview/DefaultView.aspx?id=1-4341131778,0,0,,
Comforts Independent Living Care Ltd,,SCL,"Rex House, Office 103",354 Ballards Lane,,London,,N12 0DD,Tel: 02030924035,No ratings yet Rate it yourself - /Services/careproviders/LeaveReview/DefaultView.aspx?id=1-2200880547,0,0,,
Social Care Consortium,,SCL,Rex House,second floor,354 Ballards Lane,North Finchley,Greater London,N12 0DD,,No ratings yet Rate it yourself - /Services/careproviders/LeaveReview/DefaultView.aspx?id=1-721730232,0,0,,
Winside Care,,SCL,"Office 1, Apex House",Grand Arcade,,London,,N12 0EH,Tel: 02037577189,No ratings yet Rate it yourself - /Services/careproviders/LeaveReview/DefaultView.aspx?id=1-5229681404,0,0,,
Precious Homes North London,,SCL,8 Mount View Road,,,London,,NW9 0UT,Tel: 02089040862,No ratings yet Rate it yourself - /Services/careproviders/LeaveReview/DefaultView.aspx?id=1-1434459956,0,0,,
Fortis Care North London,,SCL,Balfour House,741 High Road,,London,,N12 0BP,Tel: 02084458885,1 rating Rate it yourself - /Services/careproviders/LeaveReview/DefaultView.aspx?id=1-3648782378,,,,
21 Hartsworth Close,,SCL,21 Hartsworth Close,,,London,,E13 0TD,Tel: 07305885806,No ratings yet Rate it yourself - /Services/careproviders/LeaveReview/DefaultView.aspx?id=1-15357785654,0,0,,
Nomase Care Ltd,,SCL,"Ivy House, First Floor",Bradgate Road,,London,,SE6 4TT,Tel: 02037509722,3 ratings Rate it yourself - /Services/careproviders/LeaveReview/DefaultView.aspx?id=1-2418462505,,,,
The Place Care,,SCL,"Unit 24,",679 High Road Leyton,,London,,E10 6RA,Tel: 02045309167,No ratings yet Rate it yourself - /Services/careproviders/LeaveReview/DefaultView.aspx?id=1-11891111821,0,0,,
Ablegrange Supported Living,,SCL,47 Kingsway,The Annex,,Wembley,Middlesex,HA9 7QP,Tel: 02089030952,No ratings yet Rate it yourself - /Services/careproviders/LeaveReview/DefaultView.aspx?id=1-2989004583,0,0,,
Kisharon Supported Living,,SCL,333 Edgware Road,,,London,,NW9 6TD,Tel: 02084572525,No ratings yet Rate it yourself - /Services/careproviders/LeaveReview/DefaultView.aspx?id=1-169593433,0,0,,