Organisation Name,NACS Code,Organisation Type,Address1,Address2,Address3,Address4,Address5,PostCode,Telephone Number,NHS.UK users rating,Value  (NHS.UK users rating),Banding Classification  (NHS.UK users rating),Car parking (Is there car parking at this organisation?),Disabled access (Disabled access)
Sutton,,SCL,243-247 Beckenham Road,,,Beckenham,Kent,BR3 4RP,Tel: 01622722400,No ratings yet Rate it yourself - /Services/careproviders/LeaveReview/DefaultView.aspx?id=1-15199313358,0,0,,
Support Point Healthcare Services,,SCL,3 The Dene,Upper Shirley Road,,Croydon,,CR0 5HA,Tel: 07908137437,No ratings yet Rate it yourself - /Services/careproviders/LeaveReview/DefaultView.aspx?id=1-15977192724,0,0,,
Woodside Court Supported Living,,SCL,21 Lancaster Road,,,London,,SE25 4BJ,Tel: 02032520052,No ratings yet Rate it yourself - /Services/careproviders/LeaveReview/DefaultView.aspx?id=1-546365716,0,0,,
Warminster Road,,SCL,2 Warminster Road,South Norwood,,London,,SE25 4DZ,Tel: 02087716284,No ratings yet Rate it yourself - /Services/careproviders/LeaveReview/DefaultView.aspx?id=1-9672527284,0,0,,
Avenue Road,,SCL,14 Avenue Road,South Norwood,,London,,SE25 4EA,Tel: 02089163247,No ratings yet Rate it yourself - /Services/careproviders/LeaveReview/DefaultView.aspx?id=1-9649168827,0,0,,
Almond Care Providers Ltd,,SCL,31 Burgoyne Road,,,London,,SE25 6JT,Tel: 02030920575,2 ratings Rate it yourself - /Services/careproviders/LeaveReview/DefaultView.aspx?id=1-1191183747,,,,
Rooted Homecare,,SCL,1 Elmfield Park,,,Bromley,,BR1 1LU,,No ratings yet Rate it yourself - /Services/careproviders/LeaveReview/DefaultView.aspx?id=1-16371917836,0,0,,
London and South East Domiciliary Care Branch (Learning Disability),,SCL,"Office No. 29, Kingfisher House Business Centre",21-23 Elmfield Road,,Bromley,,BR1 1LT,Tel: 02085023933,No ratings yet Rate it yourself - /Services/careproviders/LeaveReview/DefaultView.aspx?id=1-1839972206,0,0,,
London & South East Domiciliary Care Branch (Mental Health),,SCL,"Office No. 29, Kingfisher House Business Centre",21-23 Elmfield Road,,Bromley,,BR1 1LT,Tel: 02083139725,No ratings yet Rate it yourself - /Services/careproviders/LeaveReview/DefaultView.aspx?id=1-3040078062,0,0,,
Gravel Hill,,SCL,6 Gravel Hill,,,Croydon,,CR0 5BB,Tel: 03332226699,No ratings yet Rate it yourself - /Services/careproviders/LeaveReview/DefaultView.aspx?id=1-15914396054,0,0,,
KJD Care,,SCL,97 Whitehorse Lane,,,London,,SE25 6RA,Tel: 02071014360,No ratings yet Rate it yourself - /Services/careproviders/LeaveReview/DefaultView.aspx?id=1-5153664905,0,0,,
Hazelhurst Court,,SCL,Hazelhurst Court,Melfield Gardens,,London,,SE6 3DT,Tel: 02080175525,No ratings yet Rate it yourself - /Services/careproviders/LeaveReview/DefaultView.aspx?id=1-15123326371,0,0,,
Enriched Lives Limited - Main Office,,SCL,Commercial House,2/2a Newman Road,,Bromley,,BR1 1RJ,,No ratings yet Rate it yourself - /Services/careproviders/LeaveReview/DefaultView.aspx?id=1-18392555751,0,0,,
Supported Living,,SCL,397 Sydenham Road,,,Croydon,,CR0 2EH,Tel: 02086112597,No ratings yet Rate it yourself - /Services/careproviders/LeaveReview/DefaultView.aspx?id=1-8827294716,0,0,,
London DCA,,SCL,"7th Floor, Knollys House",17 Addiscombe Road,,Croydon,,CR0 6SR,Tel: 07540671634,No ratings yet Rate it yourself - /Services/careproviders/LeaveReview/DefaultView.aspx?id=1-8042793237,0,0,,
He Reigns Healthcare Services Ltd,,SCL,EasyHub,22 Addiscombe Road,,Croydon,,CR0 5PE,Tel: 02038837974,No ratings yet Rate it yourself - /Services/careproviders/LeaveReview/DefaultView.aspx?id=1-6386290326,0,0,,
Life Work Solutions,,SCL,22 Addiscombe Road,,,Croydon,,CR0 5PE,Tel: 01883412549,No ratings yet Rate it yourself - /Services/careproviders/LeaveReview/DefaultView.aspx?id=1-15506905821,0,0,,
Homesdale Supported Living,,SCL,30 Homesdale Road,,,Bromley,,BR2 9LD,Tel: 02082492902,No ratings yet Rate it yourself - /Services/careproviders/LeaveReview/DefaultView.aspx?id=1-11296003795,0,0,,
Voug Care,,SCL,40,Homesdale Road,,Bromley,,BR2 9LD,Tel: 02084607468,No ratings yet Rate it yourself - /Services/careproviders/LeaveReview/DefaultView.aspx?id=1-14808116929,0,0,,
Salutem Supported Living Central,,SCL,Flat 9 Speakers Court,St Jamess Road,,Croydon,Surrey,CR0 2AU,Tel: 02086650745,No ratings yet Rate it yourself - /Services/careproviders/LeaveReview/DefaultView.aspx?id=1-4695602276,0,0,,
Josak Care and Recruitment Ltd,,SCL,Square Root Business Centre,102-116 Windmill Road,,Croydon,Surrey,CR0 2XQ,Tel: 07803771001,No ratings yet Rate it yourself - /Services/careproviders/LeaveReview/DefaultView.aspx?id=1-9882724195,0,0,,
Alliance Care Professionals Ltd,,SCL,Square Root Business Centre,102-116 Windmill Road,,Croydon,Surrey,CR0 2XQ,,No ratings yet Rate it yourself - /Services/careproviders/LeaveReview/DefaultView.aspx?id=1-15524269934,0,0,,
Faith Health Care Agency Ltd,,SCL,102-116,Windmill Road,,Croydon,,CR0 2XQ,Tel: 02031373942,No ratings yet Rate it yourself - /Services/careproviders/LeaveReview/DefaultView.aspx?id=1-12154762757,0,0,,
Phebdan HealthCare Services Limited,,SCL,10 Smock Walk,,,Croydon,,CR0 2UP,Tel: 07903832504,No ratings yet Rate it yourself - /Services/careproviders/LeaveReview/DefaultView.aspx?id=1-6340940895,0,0,,
Ceibraxs Care Agency,,SCL,108 Waddington Way,,,London,,SE19 3UA,Tel: 02037949599,3 ratings Rate it yourself - /Services/careproviders/LeaveReview/DefaultView.aspx?id=1-12578509617,,,,
Wecare Housing & Support Limited,,SCL,41 South Park Hill Road,,,South Croydon,,CR2 7DZ,Tel: 02086862073,No ratings yet Rate it yourself - /Services/careproviders/LeaveReview/DefaultView.aspx?id=1-12611148369,0,0,,
PJ's Community Service Limited,,SCL,CVA Resource Centre,82 London Road,,Croydon,Surrey,CR0 2TB,Tel: 02082531275,No ratings yet Rate it yourself - /Services/careproviders/LeaveReview/DefaultView.aspx?id=1-216501869,0,0,,
Norbury Avenue,,SCL,4 Norbury Avenue,,,Thornton Heath,Surrey,CR7 8AA,Tel: 02086537134,No ratings yet Rate it yourself - /Services/careproviders/LeaveReview/DefaultView.aspx?id=1-9668348970,0,0,,
Care Connexions UK Limited,,SCL,10 Brent Road,,,South Croydon,,CR2 7NR,Tel: 07960595854,No ratings yet Rate it yourself - /Services/careproviders/LeaveReview/DefaultView.aspx?id=1-7492180791,0,0,,
Comfort Care Recruitment and Training Limited,,SCL,310 High Street,,,Croydon,,CR0 1NG,Tel: 07538722071,1 rating Rate it yourself - /Services/careproviders/LeaveReview/DefaultView.aspx?id=1-4677718030,,,,
Supreme Care Services Limited,,SCL,43 Southend,South Croydon,,Croydon,Surrey,CR0 1BF,Tel: 02082534310,1 rating Rate it yourself - /Services/careproviders/LeaveReview/DefaultView.aspx?id=1-122095760,,,,
Kosicare Ltd,,SCL,37 Tamworth Road,,,Croydon,,CR0 1XU,Tel: 02039728972,No ratings yet Rate it yourself - /Services/careproviders/LeaveReview/DefaultView.aspx?id=1-3668655501,0,0,,
Perfect Quality Care Ltd,,SCL,Southbridge House,Southbridge Place,,Croydon,Surrey,CR0 4HA,Tel: 02084070641,No ratings yet Rate it yourself - /Services/careproviders/LeaveReview/DefaultView.aspx?id=1-4493026196,0,0,,
Novo Healthcare Limited,,SCL,Southbridge House,Southbridge Place,,Croydon,Surrey,CR0 4HA,Tel: 02081877840,No ratings yet Rate it yourself - /Services/careproviders/LeaveReview/DefaultView.aspx?id=1-9731954629,0,0,,
Alma Care (UK),,SCL,9-19 Southbridge House,Southbridge Place,,Croydon,Surrey,CR0 4HA,Tel: 02082404457,No ratings yet Rate it yourself - /Services/careproviders/LeaveReview/DefaultView.aspx?id=1-422054425,0,0,,
Myrtle Healthcare,,SCL,Southbridge House,Southbridge Place,,Croydon,Surrey,CR0 4HA,,1 rating Rate it yourself - /Services/careproviders/LeaveReview/DefaultView.aspx?id=1-10682549062,,,,
Belleview,,SCL,167 Brigstock Road,Thornton Heath,,Croydon,Surrey,CR7 7JP,Tel: 02086658228,No ratings yet Rate it yourself - /Services/careproviders/LeaveReview/DefaultView.aspx?id=1-479248171,0,0,,
Frontier Support Services Limited - 27-29 Brighton Road,,SCL,27-29 Brighton Road,,,South Croydon,Surrey,CR2 6EB,Tel: 02086037230,No ratings yet Rate it yourself - /Services/careproviders/LeaveReview/DefaultView.aspx?id=1-113459307,0,0,,
Comfort Living Care Office,,SCL,7 Upper Selsdon Road,,,South Croydon,,CR2 8DD,Tel: 07950239011,No ratings yet Rate it yourself - /Services/careproviders/LeaveReview/DefaultView.aspx?id=1-8861299624,0,0,,
Solving Homes Limited,,SCL,The Beechwood Centre,40 Lower Gravel Road,,Bromley,,BR2 8GP,Tel: 02037709382,No ratings yet Rate it yourself - /Services/careproviders/LeaveReview/DefaultView.aspx?id=1-12331943788,0,0,,
Care Advocates LTD Head Office,,SCL,Unit 11c,"Capital Business Centre, 22 Carlton Road",,South Croydon,,CR2 0BS,Tel: 03451168290,No ratings yet Rate it yourself - /Services/careproviders/LeaveReview/DefaultView.aspx?id=1-10485050472,0,0,,
Simply Care Partners,,SCL,70 Napier Road,,,South Croydon,,CR2 6HG,Tel: 02086671399,No ratings yet Rate it yourself - /Services/careproviders/LeaveReview/DefaultView.aspx?id=1-1179705679,0,0,,
Klearwater Adult Services Limited,,SCL,43 Leander Road,,,Thornton Heath,Surrey,CR7 6JY,Tel: 02086832960,No ratings yet Rate it yourself - /Services/careproviders/LeaveReview/DefaultView.aspx?id=1-304292774,0,0,,
Enigma Care and Support Ltd,,SCL,"Weatherill House, New South Quarter",23 Whitestone Way,,Croydon,Surrey,CR0 4WF,,No ratings yet Rate it yourself - /Services/careproviders/LeaveReview/DefaultView.aspx?id=1-15886888770,0,0,,
Acerta24,,SCL,"Weatherill House, New South Quarter",23 Whitestone Way,,Croydon,Surrey,CR0 4WF,Tel: 03455483300,No ratings yet Rate it yourself - /Services/careproviders/LeaveReview/DefaultView.aspx?id=1-1607433452,0,0,,
Opal Carers Ltd,,SCL,40 Thorpe Close,New Addington,,Croydon,,CR0 0SG,Tel: 07914020327,No ratings yet Rate it yourself - /Services/careproviders/LeaveReview/DefaultView.aspx?id=1-9791482096,0,0,,
Domiciliary Care Croydon,,SCL,27 Stafford Road,,,Croydon,,CR0 4NG,Tel: 02039043651,No ratings yet Rate it yourself - /Services/careproviders/LeaveReview/DefaultView.aspx?id=1-11378160053,0,0,,
Lewisham Nexus Service,,SCL,84-86 Rushey Green,Catford,,London,,SE6 4HW,Tel: 02086139965,No ratings yet Rate it yourself - /Services/careproviders/LeaveReview/DefaultView.aspx?id=1-123154158,0,0,,
Nomase Care Ltd,,SCL,"Ivy House, First Floor",Bradgate Road,,London,,SE6 4TT,Tel: 02037509722,3 ratings Rate it yourself - /Services/careproviders/LeaveReview/DefaultView.aspx?id=1-2418462505,,,,
"Brockley, London",,SCL,95 Ewhurst Road,"Crofton Park, Brockley",,London,,SE4 1SD,,No ratings yet Rate it yourself - /Services/careproviders/LeaveReview/DefaultView.aspx?id=1-9595952459,0,0,,
Hands of Hope Health Care Limited,,SCL,616 Mitcham Road,,,Croydon,,CR0 3AA,Tel: 07837969001,No ratings yet Rate it yourself - /Services/careproviders/LeaveReview/DefaultView.aspx?id=1-5271460306,0,0,,
Recovery Palace Ltd,,SCL,"Challenge House, 109B",616 Mitcham Road,,Croydon,,CR0 3AA,Tel: 07950761885,No ratings yet Rate it yourself - /Services/careproviders/LeaveReview/DefaultView.aspx?id=1-15525261805,0,0,,
L'Arche London,,SCL,9-13 Norwood High Street,West Norwood,,London,,SE27 9JU,Tel: 02086706714,No ratings yet Rate it yourself - /Services/careproviders/LeaveReview/DefaultView.aspx?id=1-3984596263,0,0,,
CareTech South East Supported Living,,SCL,44 Chestnut Road,,,London,,SE27 9LF,,No ratings yet Rate it yourself - /Services/careproviders/LeaveReview/DefaultView.aspx?id=1-7059929908,0,0,,
Caring Homecare Ltd,,SCL,Airport House,Purley Way,,Croydon,Surrey,CR0 0XZ,Tel: 02080220332,No ratings yet Rate it yourself - /Services/careproviders/LeaveReview/DefaultView.aspx?id=1-11719172090,0,0,,
Rathbone Outreach Service,,SCL,8 Chatsworth Way,8 Chatsworth Way,,London,,SE27 9HR,,No ratings yet Rate it yourself - /Services/careproviders/LeaveReview/DefaultView.aspx?id=1-109913358,0,0,,
Parkhill Support Services Brighton Road,,SCL,851 Brighton Road,,,Purley,Surrey,CR8 2BL,Tel: 02035381311,No ratings yet Rate it yourself - /Services/careproviders/LeaveReview/DefaultView.aspx?id=1-8495598432,0,0,,
Access for Living,,SCL,Unit 9 Southbrook Mews,"Southbrook Road, Lee",,London,,SE12 8LG,Tel: 02082976659,No ratings yet Rate it yourself - /Services/careproviders/LeaveReview/DefaultView.aspx?id=1-112291724,0,0,,
Bluefield Care Services,,SCL,282 Lewisham High Street,,,London,,SE13 6JZ,Tel: 02086900005,1 rating Rate it yourself - /Services/careproviders/LeaveReview/DefaultView.aspx?id=1-3492776865,,,,
Overhill,,SCL,1A Overhill Road,,,Purley,Surrey,CR8 2JD,Tel: 02087631067,No ratings yet Rate it yourself - /Services/careproviders/LeaveReview/DefaultView.aspx?id=1-9736920019,0,0,,
National Care Holdings Limited,,SCL,10 The Mound,,,London,,SE9 3AZ,Tel: 07572333293,No ratings yet Rate it yourself - /Services/careproviders/LeaveReview/DefaultView.aspx?id=1-6875309146,0,0,,
Townley Road,,SCL,2-3 Townley Road,,,London,,SE22 8SW,Tel: 02086935449,No ratings yet Rate it yourself - /Services/careproviders/LeaveReview/DefaultView.aspx?id=1-9672526789,0,0,,
Streatham,,SCL,223 Streatham High Road,,,London,,SW16 6EN,Tel: 02086773333,No ratings yet Rate it yourself - /Services/careproviders/LeaveReview/DefaultView.aspx?id=1-5605130305,0,0,,
Careessence,,SCL,919 Brighton Road,,,Purley,Surrey,CR8 2BP,Tel: 02086602665,No ratings yet Rate it yourself - /Services/careproviders/LeaveReview/DefaultView.aspx?id=1-2827913274,0,0,,
Mawii Home Care Limited,,SCL,Romer House,132 Lewisham High Street,,London,,SE13 6EE,Tel: 02039848477,No ratings yet Rate it yourself - /Services/careproviders/LeaveReview/DefaultView.aspx?id=1-6193098257,0,0,,
HDH Care and Support,,SCL,"Romer House, Ist Floor",132 Lewisham High Street,,London,,SE13 6EE,Tel: 02030924845,No ratings yet Rate it yourself - /Services/careproviders/LeaveReview/DefaultView.aspx?id=1-10153499805,0,0,,
Jome Healthcare,,SCL,Romer House,132 Lewisham High Street,,London,,SE13 6EE,Tel: 02030924672,No ratings yet Rate it yourself - /Services/careproviders/LeaveReview/DefaultView.aspx?id=1-11915657295,0,0,,
Advanced Care and Support in the Community,,SCL,18 Boone Street,Lee High Road,,London,,SE13 5SB,Tel: 02083189107,No ratings yet Rate it yourself - /Services/careproviders/LeaveReview/DefaultView.aspx?id=1-122655443,0,0,,
Elite CarePlus Ltd,,SCL,135 Stafford Road,,,London,,SM6 9BN,Tel: 0207 998 7860,No ratings yet Rate it yourself - /Services/careproviders/LeaveReview/DefaultView.aspx?id=1-2598387969,0,0,,
Carlene Home Care Services,,SCL,17 Woodcote Valley Road,,,Purley,Surrey,CR8 3AL,Tel: 02086607685,No ratings yet Rate it yourself - /Services/careproviders/LeaveReview/DefaultView.aspx?id=1-124563388,0,0,,
Colkara Care and Support Ltd,,SCL,"Unit 2, Room 11","Sutton Business Park, Restmor Way",,Wallington,,SM6 7AH,Tel: 07523989546,No ratings yet Rate it yourself - /Services/careproviders/LeaveReview/DefaultView.aspx?id=1-11432801695,0,0,,
QH Care Services Limited,,SCL,Unit 1,"Sutton Business Park, Restmor Way",,Wallington,,SM6 7AH,,1 rating Rate it yourself - /Services/careproviders/LeaveReview/DefaultView.aspx?id=1-14830310040,,,,
Consensus Community Support - Surrey,,SCL,38 Grovelands Road,,,Purley,Surrey,CR8 4LA,,No ratings yet Rate it yourself - /Services/careproviders/LeaveReview/DefaultView.aspx?id=1-18445005636,0,0,,
Beechcroft Care Ltd,,SCL,182A Denmark Hill,,,London,,SE5 8EE,Tel: 07367067572,No ratings yet Rate it yourself - /Services/careproviders/LeaveReview/DefaultView.aspx?id=1-18026916935,0,0,,
Brockwell Care,,SCL,1-4 Brixton Hill Place,,,London,,SW2 1HJ,Tel: 02086785944,No ratings yet Rate it yourself - /Services/careproviders/LeaveReview/DefaultView.aspx?id=1-996882727,0,0,,
Rapid Improvement Care Agency,,SCL,34-38 Upper Green East,,,Mitcham,Surrey,CR4 2PB,Tel: 02086480395,No ratings yet Rate it yourself - /Services/careproviders/LeaveReview/DefaultView.aspx?id=1-1968546002,0,0,,
Diagrama Supported Living,,SCL,3A Healy Drive,,,Orpington,Kent,BR6 9LB,Tel: 01689891401,No ratings yet Rate it yourself - /Services/careproviders/LeaveReview/DefaultView.aspx?id=1-10631728583,0,0,,
Aurora Options,,SCL,Unit 3 California Building,Deals Gateway,,London,,SE13 7SB,Tel: 0208498103,No ratings yet Rate it yourself - /Services/careproviders/LeaveReview/DefaultView.aspx?id=1-13420339116,0,0,,
First Connect Healthcare Ltd,,SCL,1 Hooks Close,,,London,,SE15 2TP,,No ratings yet Rate it yourself - /Services/careproviders/LeaveReview/DefaultView.aspx?id=1-16378409964,0,0,,
Parkhill Support Services Main Road,,SCL,263 Main Road,,,Sidcup,Kent,DA14 6QL,Tel: 02083025848,No ratings yet Rate it yourself - /Services/careproviders/LeaveReview/DefaultView.aspx?id=1-8495598391,0,0,,
Ramah Ker Services Ltd,,SCL,Unit BB46,"The Link, 49 Effra Road",,London,,SW2 1BZ,Tel: 07735479207,No ratings yet Rate it yourself - /Services/careproviders/LeaveReview/DefaultView.aspx?id=1-14684729467,0,0,,
St Nicholas Glebe,,SCL,6 St. Nicholas Glebe,Rectory Lane,,London,,SW17 9QH,Tel: 02087670071,No ratings yet Rate it yourself - /Services/careproviders/LeaveReview/DefaultView.aspx?id=1-9671158985,0,0,,
Marigold Care Group Ltd,,SCL,14 Little Dimocks,,,London,,SW12 9JJ,Tel: 07446323937,No ratings yet Rate it yourself - /Services/careproviders/LeaveReview/DefaultView.aspx?id=1-13513401606,0,0,,
"Brandon Trust Supported Living - Trident Business Centre, Tooting",,SCL,89 Bickersteth Road,Tooting,,London,,SW17 9SH,Tel: 01452886307,No ratings yet Rate it yourself - /Services/careproviders/LeaveReview/DefaultView.aspx?id=1-4305903260,0,0,,
Always Inclusive Outreach,,SCL,T M S House,Cray Avenue,,Orpington,,BR5 3QB,Tel: 01689885040,No ratings yet Rate it yourself - /Services/careproviders/LeaveReview/DefaultView.aspx?id=1-12642181724,0,0,,
Anjel Direct (Recruitment) Solutions Ltd,,SCL,T M S House,Cray Avenue,,Orpington,,BR5 3QB,Tel: 02088521622,No ratings yet Rate it yourself - /Services/careproviders/LeaveReview/DefaultView.aspx?id=1-10728971317,0,0,,
Mountsview Homes,,SCL,47 Desmond Street,,,London,,SE14 6JA,,No ratings yet Rate it yourself - /Services/careproviders/LeaveReview/DefaultView.aspx?id=1-18243575099,0,0,,
MF Care and Housing,,SCL,Suite 12A Kennedy House,Murray Road,,Orpington,,BR5 3QY,Tel: 07828189646,No ratings yet Rate it yourself - /Services/careproviders/LeaveReview/DefaultView.aspx?id=1-13056911845,0,0,,
Assured Healthcare Limited,,SCL,30 Wagner Street,,,London,,SE15 1NN,Tel: 07985373246,No ratings yet Rate it yourself - /Services/careproviders/LeaveReview/DefaultView.aspx?id=1-15321217985,0,0,,
Southside Partnership Domiciliary Care Agency,,SCL,31-33 Lumiere Court,209 Balham High Road,,London,,SW17 7BQ,Tel: 02087726222,No ratings yet Rate it yourself - /Services/careproviders/LeaveReview/DefaultView.aspx?id=1-117373860,0,0,,
Yarrow Domiciliary Care Agency,,SCL,31-33 Lumiere Court,209 Balham High Road,,London,,SW17 7BQ,Tel: 02087354600,No ratings yet Rate it yourself - /Services/careproviders/LeaveReview/DefaultView.aspx?id=1-136010893,0,0,,
Hervey Road,,SCL,66 Hervey Road,,,London,,SE3 8BS,Tel: 02088564553,No ratings yet Rate it yourself - /Services/careproviders/LeaveReview/DefaultView.aspx?id=1-9661628327,0,0,,
Three C's Support,,SCL,Unit 4,"82-84, Childers Street",,London,,SE8 5FS,,No ratings yet Rate it yourself - /Services/careproviders/LeaveReview/DefaultView.aspx?id=1-4826424113,0,0,,
Living Spring Solutions (Care & Training) Ltd,,SCL,"River View Office, Unit 1",Greenwich Quay,,London,,SE8 3EY,Tel: 020 3417 0405,No ratings yet Rate it yourself - /Services/careproviders/LeaveReview/DefaultView.aspx?id=1-2491149075,0,0,,
Curans Care,,SCL,173 Tooting High Street,,,London,,SW17 0SZ,Tel: 02086720240,No ratings yet Rate it yourself - /Services/careproviders/LeaveReview/DefaultView.aspx?id=1-5764206241,0,0,,
Bramley Avenue,,SCL,40 Bramley Avenue,,,Coulsdon,,CR5 2DP,Tel: 07437015616,No ratings yet Rate it yourself - /Services/careproviders/LeaveReview/DefaultView.aspx?id=1-9524039848,0,0,,
New Beginnings Care Services Limited,,SCL,4 Charlton Dene,,,London,,SE7 7BZ,Tel: 02088569991,No ratings yet Rate it yourself - /Services/careproviders/LeaveReview/DefaultView.aspx?id=1-11680033807,0,0,,
Parkhill Support Services Ltd,,SCL,32 Greenwood Close,,,Sidcup,Kent,DA15 9AD,Tel: 02083025848,No ratings yet Rate it yourself - /Services/careproviders/LeaveReview/DefaultView.aspx?id=1-8495597646,0,0,,
Enamoured Care Ltd,,SCL,109 Star Lane,,,Orpington,,BR5 3LN,,No ratings yet Rate it yourself - /Services/careproviders/LeaveReview/DefaultView.aspx?id=1-18977050914,0,0,,
Live & Learn,,SCL,131 Woodmansterne Road,Carshalton Beeches,,Carshalton,Surrey,SM5 4AF,Tel: 02082559347,No ratings yet Rate it yourself - /Services/careproviders/LeaveReview/DefaultView.aspx?id=1-144505415,0,0,,
Versacare Limited (Head Office),,SCL,2 Church Path,,,Coulsdon,Surrey,CR5 1HA,,No ratings yet Rate it yourself - /Services/careproviders/LeaveReview/DefaultView.aspx?id=1-139043195,0,0,,
A24 Group Ltd - Sutton,,SCL,Group House,92-96 Lind Road,,Sutton,Surrey,SM1 4PL,Tel: 08454523344,No ratings yet Rate it yourself - /Services/careproviders/LeaveReview/DefaultView.aspx?id=1-132798477,0,0,,
Caterham Domiciliary Care Agency,,SCL,86 Buxton Lane,,,Caterham,,CR3 5HH,Tel: 07779724862,No ratings yet Rate it yourself - /Services/careproviders/LeaveReview/DefaultView.aspx?id=1-125960146,0,0,,
Central Support Ltd,,SCL,2 Harbinger Road,,,London,,E14 3AA,Tel: 07984763353,No ratings yet Rate it yourself - /Services/careproviders/LeaveReview/DefaultView.aspx?id=1-18463657875,0,0,,
Avenues London (South),,SCL,1 River House,Maidstone Road,,Sidcup,Kent,DA14 5TA,,No ratings yet Rate it yourself - /Services/careproviders/LeaveReview/DefaultView.aspx?id=1-132159145,0,0,,
Royal Mencap Society - Domiciliary Care Services and Shared Lives - West London,,SCL,"Suite 207, Peel House",34 - 44 London Road,,Morden,,SM4 5BT,Tel: 02085456940,No ratings yet Rate it yourself - /Services/careproviders/LeaveReview/DefaultView.aspx?id=1-1644075468,0,0,,
Reddown Road,,SCL,39b Reddown Road,Reddown Road,,Coulsdon,,CR5 1AN,Tel: 01737555497,No ratings yet Rate it yourself - /Services/careproviders/LeaveReview/DefaultView.aspx?id=1-9737173503,0,0,,
Nightingale Holistic Services,,SCL,85 Whyteleafe Road,,,Caterham,Surrey,CR3 5EJ,Tel: 01883332961,No ratings yet Rate it yourself - /Services/careproviders/LeaveReview/DefaultView.aspx?id=1-112349897,0,0,,
Larkrise,,SCL,50 The Gallop,,,Sutton,Surrey,SM2 5RY,Tel: 02035838979,No ratings yet Rate it yourself - /Services/careproviders/LeaveReview/DefaultView.aspx?id=1-3012597847,0,0,,
London Borough of Merton - Supported Living Service,,SCL,Merton Civic Centre,London Road,,Morden,Surrey,SM4 5DX,Tel: 02085453676,No ratings yet Rate it yourself - /Services/careproviders/LeaveReview/DefaultView.aspx?id=1-444694474,0,0,,
Heathcotes Sutton Supported Living,,SCL,Sutton Court Road,,,Sutton,,SM1 4SY,,No ratings yet Rate it yourself - /Services/careproviders/LeaveReview/DefaultView.aspx?id=1-12719277421,0,0,,
Croft Willow House,,SCL,45 Stayton Road,,,Sutton,,SM1 1QY,Tel: 07812698442,No ratings yet Rate it yourself - /Services/careproviders/LeaveReview/DefaultView.aspx?id=1-6115453456,0,0,,
Kisimul Supported Living Surrey,,SCL,City House,Sutton Park Road,,Sutton,,SM1 2AE,Tel: 02083984367,No ratings yet Rate it yourself - /Services/careproviders/LeaveReview/DefaultView.aspx?id=1-12108867571,0,0,,
Bio Luminuex Health Care Limited,,SCL,Docklands Business Centre,10-16 Tiller Road,,London,,E14 8PX,Tel: 02032913906,No ratings yet Rate it yourself - /Services/careproviders/LeaveReview/DefaultView.aspx?id=1-4054170060,0,0,,
J.C.Michael Groups Ltd Wandsworth,,SCL,182 The Broadway,,,London,,SW19 1RY,Tel: 02085408441,No ratings yet Rate it yourself - /Services/careproviders/LeaveReview/DefaultView.aspx?id=1-2193075496,0,0,,
Health Personnel,,SCL,"Office C116, Meridian Trading Estate",20 Bugsby's Way,,London,,SE7 7SJ,Tel: 03335771755,No ratings yet Rate it yourself - /Services/careproviders/LeaveReview/DefaultView.aspx?id=1-2385182469,0,0,,