Organisation Name,NACS Code,Organisation Type,Address1,Address2,Address3,Address4,Address5,PostCode,Telephone Number,NHS.UK users rating,Value  (NHS.UK users rating),Banding Classification  (NHS.UK users rating),Car parking (Is there car parking at this organisation?),Disabled access (Disabled access)
Professional Nursing Services Limited - 25A White Horse Court,,SCL,North Street,,,Bishops Stortford,Hertfordshire,CM23 2LD,Tel: 01279507077,No ratings yet Rate it yourself - /Services/careproviders/LeaveReview/DefaultView.aspx?id=1-121013201,0,0,,
Consensus Community Support - Harlow,,SCL,St. Marys Court,Momples Road,,Harlow,,CM20 3BY,Tel: 01279454801,No ratings yet Rate it yourself - /Services/careproviders/LeaveReview/DefaultView.aspx?id=1-16957137050,0,0,,
Adico Care,,SCL,"Suite 1, Unit 13 Centurion House","New Horizon Business Centre, Barrows Road",,Harlow,,CM19 5FN,Tel: 01992469540,1 rating Rate it yourself - /Services/careproviders/LeaveReview/DefaultView.aspx?id=1-1707739724,,,,
Ready Care Services Limited,,SCL,Unit 76 Greenway Business Centre,Harlow Business Park,,Harlow,,CM19 5QE,Tel: 03335774445,No ratings yet Rate it yourself - /Services/careproviders/LeaveReview/DefaultView.aspx?id=1-5624060401,0,0,,
Hope Homecare Services Limited,,SCL,"Unit 82, Greenway Business Centre,","Greenway, Harlow Business Park",,Harlow,,CM19 5QE,Tel: 07961583393,No ratings yet Rate it yourself - /Services/careproviders/LeaveReview/DefaultView.aspx?id=1-11164398275,0,0,,
ivolve West Essex & Hertfordshire Supported Living,,SCL,4 Popis Gardens,King George Road,,Ware,,SG12 7DU,Tel: 07813405067,No ratings yet Rate it yourself - /Services/careproviders/LeaveReview/DefaultView.aspx?id=1-15521798263,0,0,,
Hillside,,SCL,3 & 4 Hillside Crescent,Stanstead Abbotts,,Ware,,SG12 8BQ,Tel: 02073915174,No ratings yet Rate it yourself - /Services/careproviders/LeaveReview/DefaultView.aspx?id=1-6915965688,0,0,,
Buntingford,,SCL,62 Vicarage Road,,,Buntingford,Hertfordshire,SG9 9BA,Tel: 01763273191,No ratings yet Rate it yourself - /Services/careproviders/LeaveReview/DefaultView.aspx?id=1-1829473970,0,0,,
Blossom HCG Ltd,,SCL,2nd Floor,27 High Street,,Hoddesdon,,EN11 8SX,Tel: 01992899222,No ratings yet Rate it yourself - /Services/careproviders/LeaveReview/DefaultView.aspx?id=1-4391463226,0,0,,
Eureka Care Services Limited,,SCL,15 Bull Plain,,,Hertford,,SG14 1DX,Tel: 01992472975,No ratings yet Rate it yourself - /Services/careproviders/LeaveReview/DefaultView.aspx?id=1-4390168127,0,0,,
C&O SLS Limited,,SCL,Suite 2B Paddon House,12 Stortford Road,,Dunmow,Essex,CM6 1DA,Tel: 01371238188,No ratings yet Rate it yourself - /Services/careproviders/LeaveReview/DefaultView.aspx?id=1-4183489452,0,0,,
SGSL Limited,,SCL,Pimlico House,Gascoyne Way,,Hertford,,SG13 8EA,Tel: 01992367246,No ratings yet Rate it yourself - /Services/careproviders/LeaveReview/DefaultView.aspx?id=1-18774009443,0,0,,
Herts at Home,,SCL,County Hall,,,Hertford,,SG13 8DE,Tel: 01438845220,1 rating Rate it yourself - /Services/careproviders/LeaveReview/DefaultView.aspx?id=1-6081792073,,,,
Myrtle Care Providers Limited,,SCL,"Suite 5, Broxbourne Business Centre","Fairways, Cheshunt",,Waltham Cross,,EN8 0NL,Tel: 02034883240,No ratings yet Rate it yourself - /Services/careproviders/LeaveReview/DefaultView.aspx?id=1-5182440271,0,0,,
Mandalay,,SCL,Flat 3 Everitt Road,,,Saffron Walden,,CB10 2YY,Tel: 03004569998,No ratings yet Rate it yourself - /Services/careproviders/LeaveReview/DefaultView.aspx?id=1-14369622089,0,0,,
Jurichez Ltd,,SCL,"Unit 25, Studio House","Delamare Road, Cheshunt",,Waltham Cross,,EN8 9SH,Tel: 07830887822,No ratings yet Rate it yourself - /Services/careproviders/LeaveReview/DefaultView.aspx?id=1-12510504448,0,0,,
Hope Homecare Services Limited,,SCL,"1st Floor, Studio House","Delamare Road, Chestnut",,Waltham Cross,Hertfordshire,EN8 9SH,Tel: 01992760520,No ratings yet Rate it yourself - /Services/careproviders/LeaveReview/DefaultView.aspx?id=1-2727097217,0,0,,
Dynamic Community Care Ltd,,SCL,206 Turners Hill,Cheshunt,,Waltham Cross,,EN8 9DE,Tel: 08454343434,3 ratings Rate it yourself - /Services/careproviders/LeaveReview/DefaultView.aspx?id=1-11851922555,,,,
Clay Brook Healthcare Ltd  -Elmsdown,,SCL,The Gladeway,Cheshunt,,Waltham Abbey,,EN9 1LL,,No ratings yet Rate it yourself - /Services/careproviders/LeaveReview/DefaultView.aspx?id=1-15633908035,0,0,,
Stevenage,,SCL,27 Brimstone Drive,,,Stevenage,,SG1 4FX,Tel: 07919382837,No ratings yet Rate it yourself - /Services/careproviders/LeaveReview/DefaultView.aspx?id=1-11295712832,0,0,,
Look Ahead Domiciliary Care (Hertfordshire),,SCL,Oak View,64-66 Hydean Way,,Stevenage,Hertfordshire,SG2 9XL,Tel: 01438740096,No ratings yet Rate it yourself - /Services/careproviders/LeaveReview/DefaultView.aspx?id=1-294441934,0,0,,
Hilton Community Services Limited,,SCL,Hampton House,100 Crossbrook Street,,Waltham Cross,Hertfordshire,EN8 8JJ,Tel: 01992638361,No ratings yet Rate it yourself - /Services/careproviders/LeaveReview/DefaultView.aspx?id=1-131216336,0,0,,
Accedo Care Head Office,,SCL,St Georges House,100 Crossbrook Street,,Waltham Cross,Hertfordshire,EN8 8JJ,Tel: 07590860442,No ratings yet Rate it yourself - /Services/careproviders/LeaveReview/DefaultView.aspx?id=1-3595875754,0,0,,
Care Fully Limited,,SCL,11 Broadview,,,Stevenage,Hertfordshire,SG1 3TT,Tel: 01438722665,No ratings yet Rate it yourself - /Services/careproviders/LeaveReview/DefaultView.aspx?id=1-2276468236,0,0,,
Lily Healthcare & Supported Living Limited,,SCL,55 Manchester Close,,,Stevenage,,SG1 4TQ,Tel: 07713912907,No ratings yet Rate it yourself - /Services/careproviders/LeaveReview/DefaultView.aspx?id=1-14567398596,0,0,,
Etrum Healthcare Services Ltd,,SCL,Unit 2,"Falcon Gate, Falcon Way, Shire Park",,Welwyn Garden City,,AL7 1TW,,No ratings yet Rate it yourself - /Services/careproviders/LeaveReview/DefaultView.aspx?id=1-13090141860,0,0,,
Welwyn Garden City,,SCL,2 Falcon Gate,Shire Park,,Welwyn Garden City,,AL7 1TW,Tel: 07920391969,No ratings yet Rate it yourself - /Services/careproviders/LeaveReview/DefaultView.aspx?id=1-11608364948,0,0,,
Shadz Care,,SCL,Unit 2,"Falcon Gate, Falcon Way, Shire Park",,Welwyn Garden City,,AL7 1TW,Tel: 07792748972,No ratings yet Rate it yourself - /Services/careproviders/LeaveReview/DefaultView.aspx?id=1-9017766332,0,0,,
Total Care and Compliance Services,,SCL,26 Bridge Road East,,,Welwyn Garden City,,AL7 1HL,Tel: 07576745894,No ratings yet Rate it yourself - /Services/careproviders/LeaveReview/DefaultView.aspx?id=1-13675882876,0,0,,
Vinea Care Limited,,SCL,53 The Vineyard,,,Welwyn Garden City,,AL8 7PY,,No ratings yet Rate it yourself - /Services/careproviders/LeaveReview/DefaultView.aspx?id=1-12390544741,0,0,,
Knightingles Healthcare Limited,,SCL,2a,Letchmore Road,,Stevenage,,SG1 3HU,Tel: 07717064436,No ratings yet Rate it yourself - /Services/careproviders/LeaveReview/DefaultView.aspx?id=1-4606227581,0,0,,
Vincent Place,,SCL,Flat 42 Vincent Place,42 Townsend Mews,,Stevenage,,SG1 3AT,Tel: 01438729845,No ratings yet Rate it yourself - /Services/careproviders/LeaveReview/DefaultView.aspx?id=1-9140100470,0,0,,
GreyInsights,,SCL,Cuffley Place,"Sopers Road,",,Cuffley,,EN6 4SG,Tel: 02080872301,No ratings yet Rate it yourself - /Services/careproviders/LeaveReview/DefaultView.aspx?id=1-18482189240,0,0,,
Natgab Care,,SCL,33 Island Centre Way,,,Enfield,Middlesex,EN3 6GS,Tel: 01992769483,1 rating Rate it yourself - /Services/careproviders/LeaveReview/DefaultView.aspx?id=1-977317273,,,,
Domiciliary Care Service,,SCL,SFAR008 Farnham House,6 Hills Way,,Stevenage,Hertfordshire,SG1 2FQ,Tel: 01438843575,No ratings yet Rate it yourself - /Services/careproviders/LeaveReview/DefaultView.aspx?id=1-145992032,0,0,,
Joy Caring Services Limited,,SCL,"Suite B, Mindenhall Court","R/017 High Street, Old Town",,Stevenage,Hertfordshire,SG1 3BG,Tel: 01438311704,1 rating Rate it yourself - /Services/careproviders/LeaveReview/DefaultView.aspx?id=1-2057631160,,,,
Wellbeing Living,,SCL,109 Ordnance Road,,,Enfield,,EN3 6AG,Tel: 02070315628,No ratings yet Rate it yourself - /Services/careproviders/LeaveReview/DefaultView.aspx?id=1-11852882885,0,0,,
New Hope Community Healthcare,,SCL,Business & Technology Centre,Bessemer Drive,,Stevenage,Hertfordshire,SG1 2DX,Tel: 01438310000,No ratings yet Rate it yourself - /Services/careproviders/LeaveReview/DefaultView.aspx?id=1-6715233778,0,0,,
Lead Care Services Limited,,SCL,Business & Technology Centre,Bessemer Drive,,Stevenage,Hertfordshire,SG1 2DX,Tel: 01438419888,No ratings yet Rate it yourself - /Services/careproviders/LeaveReview/DefaultView.aspx?id=1-3727275725,0,0,,
Fortis Care Hertfordshire,,SCL,"Fortis Care, Caxton Point",Caxton Way,,Stevenage,,SG1 2XU,Tel: 01438487270,3 ratings Rate it yourself - /Services/careproviders/LeaveReview/DefaultView.aspx?id=1-5234926702,,,,
Bridgecare Solutions Ltd,,SCL,Caxton Point Business Centre,Caxton Way,,Stevenage,,SG1 2XU,,No ratings yet Rate it yourself - /Services/careproviders/LeaveReview/DefaultView.aspx?id=1-12105644620,0,0,,
Sandton Healthcare Limited,,SCL,Unit 41 Caxton Point,Caxton Way,,Stevenage,,SG1 2XU,Tel: 07983615783,No ratings yet Rate it yourself - /Services/careproviders/LeaveReview/DefaultView.aspx?id=1-12637866785,0,0,,
Priority Plus Care Ltd,,SCL,13 Caxton Point Business Centre,Caxton Way,,Stevenage,,SG1 2XU,Tel: 01438553105,No ratings yet Rate it yourself - /Services/careproviders/LeaveReview/DefaultView.aspx?id=1-18687969493,0,0,,
Alina Homecare Specialist Care - Hertfordshire,,SCL,"6a Meadway Court,",Rutherford Close,,Stevenage,,SG1 2EF,Tel: 01707443933,No ratings yet Rate it yourself - /Services/careproviders/LeaveReview/DefaultView.aspx?id=1-5842997881,0,0,,
Partners in Support,,SCL,11 Meadway Court,Rutherford Close,,Stevenage,Hertfordshire,SG1 2EF,Tel: 01438746243,No ratings yet Rate it yourself - /Services/careproviders/LeaveReview/DefaultView.aspx?id=1-455374011,0,0,,
98-100 Pembroke Avenue,,SCL,98 Pembroke Avenue,,,Enfield,Middlesex,EN1 4EY,Tel: 02083647427,No ratings yet Rate it yourself - /Services/careproviders/LeaveReview/DefaultView.aspx?id=1-9642538194,0,0,,
Direct2U Care Ltd,,SCL,309 Hertford Road,,,Enfield,,EN3 5JN,Tel: 07394616696,1 rating Rate it yourself - /Services/careproviders/LeaveReview/DefaultView.aspx?id=1-14922119305,,,,
Hightrees,,SCL,24 Clay Hill,,,Enfield,Middlesex,EN2 9AA,Tel: 02083633850,No ratings yet Rate it yourself - /Services/careproviders/LeaveReview/DefaultView.aspx?id=1-5477094647,0,0,,
Eden Quality Care (Headquarters),,SCL,3,"Potash House, 1 Canning Square",,Enfield,,EN1 4BP,Tel: 07985672043,No ratings yet Rate it yourself - /Services/careproviders/LeaveReview/DefaultView.aspx?id=1-5765395217,0,0,,
WHC Offices,,SCL,Parkview Nursery,Theobalds Park Road,,Enfield,,EN2 9BQ,Tel: 01992442244,No ratings yet Rate it yourself - /Services/careproviders/LeaveReview/DefaultView.aspx?id=1-8598940377,0,0,,
Kalm Care Ltd,,SCL,27 Hunts Mead,,,Enfield,Middlesex,EN3 7LX,Tel: 02084430915,No ratings yet Rate it yourself - /Services/careproviders/LeaveReview/DefaultView.aspx?id=1-3299317235,0,0,,
Carterhatch Supported Living Services,,SCL,104 Linwood Crescent,,,Enfield,Middlesex,EN1 4UR,Tel: 02083668600,No ratings yet Rate it yourself - /Services/careproviders/LeaveReview/DefaultView.aspx?id=1-6452606148,0,0,,
Exclusive Care Ltd,,SCL,"Suite F, 15 Royston Road",,,Baldock,,SG7 6NW,Tel: 01438310108,No ratings yet Rate it yourself - /Services/careproviders/LeaveReview/DefaultView.aspx?id=1-6510507259,0,0,,
Cherish Social Care Ltd,,SCL,GNBC,82 Great North Road,,Hatfield,,AL9 5BL,Tel: 07746387909,No ratings yet Rate it yourself - /Services/careproviders/LeaveReview/DefaultView.aspx?id=1-6447842680,0,0,,
Access All Care And Training Solutions,,SCL,71 Boardman Avenue,,,London,,E4 7QB,Tel: 07495881198,No ratings yet Rate it yourself - /Services/careproviders/LeaveReview/DefaultView.aspx?id=1-11585321622,0,0,,
Lynn Care Service Limited,,SCL,Gorray House,"758, Great Cambridge Road",,Enfield,,EN1 3GN,Tel: 02045669344,No ratings yet Rate it yourself - /Services/careproviders/LeaveReview/DefaultView.aspx?id=1-11314310858,0,0,,
Felicity Care,,SCL,"Unit 2, 60 Alexandra Road",,,Enfield,Middlesex,EN3 7EH,Tel: 07961172086,3 ratings Rate it yourself - /Services/careproviders/LeaveReview/DefaultView.aspx?id=1-319483623,,,,
DHR Support Services Ltd,,SCL,24 Chailey Avenue,,,Enfield,Middlesex,EN1 3LY,,No ratings yet Rate it yourself - /Services/careproviders/LeaveReview/DefaultView.aspx?id=1-2664780806,0,0,,
Filey Care and Support LTD,,SCL,78a,Lancaster Road,,Enfield,,EN2 0BX,Tel: 07984818399,3 ratings Rate it yourself - /Services/careproviders/LeaveReview/DefaultView.aspx?id=1-2452188241,,,,
Meadows,,SCL,Fairy Hall Lane,Rayne,,Braintree,Essex,CM77 6SZ,Tel: 01376340714,No ratings yet Rate it yourself - /Services/careproviders/LeaveReview/DefaultView.aspx?id=1-1193424342,0,0,,
DX Caring Services,,SCL,"608 Jubilee Trading Estate, Jubilee Road",,,Letchworth Garden City,,SG6 1NE,Tel: 01462677770,No ratings yet Rate it yourself - /Services/careproviders/LeaveReview/DefaultView.aspx?id=1-9676435907,0,0,,
Class (UK) Limited,,SCL,33 Maltese Road,,,Chelmsford,Essex,CM1 2PB,Tel: 01245600022,No ratings yet Rate it yourself - /Services/careproviders/LeaveReview/DefaultView.aspx?id=1-585371870,0,0,,
Royal Mencap Society - Domiciliary Care Services - North London,,SCL,Unit 16 East Lodge Village,East Lodge Lane,,Enfield,,EN2 8AS,Tel: 020 7454 0454,No ratings yet Rate it yourself - /Services/careproviders/LeaveReview/DefaultView.aspx?id=1-527027054,0,0,,
North London Home Care & Support Limited Enfield,,SCL,"Units 43-47 & 49, 26-28 Queensway",Ponders End,,Enfield,Middlesex,EN3 4SA,,No ratings yet Rate it yourself - /Services/careproviders/LeaveReview/DefaultView.aspx?id=1-130581211,0,0,,
SAFE CARE SERVICES LTD,,SCL,"Unit 28, Enfield Enterprise Centre",26-28 Queensway,,Enfield,,EN3 4SA,Tel: 07418015013,No ratings yet Rate it yourself - /Services/careproviders/LeaveReview/DefaultView.aspx?id=1-11035172585,0,0,,
Next Step Support Limited,,SCL,159A Chase Side,,,Enfield,Middlesex,EN2 0PW,Tel: 02083601240,2 ratings Rate it yourself - /Services/careproviders/LeaveReview/DefaultView.aspx?id=1-358218108,,,,
Angel Support Living (UK) Limited,,SCL,159A Chase Side,,,Enfield,Middlesex,EN2 0PW,Tel: 01707240869,No ratings yet Rate it yourself - /Services/careproviders/LeaveReview/DefaultView.aspx?id=1-9611068105,0,0,,
Person Centred Care Homes,,SCL,Holtwhites House (Care Of Holtwhites Hotel),92 Chase Side,,Enfield,,EN2 0QN,Tel: 02083667557,No ratings yet Rate it yourself - /Services/careproviders/LeaveReview/DefaultView.aspx?id=1-2163480404,0,0,,
Hand in Hands,,SCL,"Unit 5, Devonshire Business Centre",Works Road,,Letchworth,Hertfordshire,SG6 1GJ,Tel: 01462222400,No ratings yet Rate it yourself - /Services/careproviders/LeaveReview/DefaultView.aspx?id=1-1724411627,0,0,,
Abacus Care & Support,,SCL,"Head Office, Devonshire Business Centre",Works Road,,Letchworth Garden City,,SG6 1GJ,Tel: 02071001680,No ratings yet Rate it yourself - /Services/careproviders/LeaveReview/DefaultView.aspx?id=1-8809577412,0,0,,
Compassion PLUS Healthcare,,SCL,Devonshire Business Centre,Works Road,,Letchworth Garden City,Hertfordshire,SG6 1GJ,Tel: 01462416101,No ratings yet Rate it yourself - /Services/careproviders/LeaveReview/DefaultView.aspx?id=1-5937564351,0,0,,
Palm 2 Palm Care Services - Enfield,,SCL,"Office 5, Ground Floor West","Nicholas House, Riverfront",,Enfield,,EN1 3TF,Tel: 02038244303,No ratings yet Rate it yourself - /Services/careproviders/LeaveReview/DefaultView.aspx?id=1-12388975925,0,0,,
The Ridgeway,,SCL,82,The Ridgeway,,Enfield,,EN2 8JQ,,No ratings yet Rate it yourself - /Services/careproviders/LeaveReview/DefaultView.aspx?id=1-15520892465,0,0,,
Care By Us - North London & West Hertfordshire,,SCL,"Ground Floor Office Suite, Brent House","Travellers Lane, Welham Green",,Hatfield,,AL9 7HF,Tel: 02080998276,1 rating Rate it yourself - /Services/careproviders/LeaveReview/DefaultView.aspx?id=1-2176818564,,,,
Maison Moti Head Office,,SCL,8a Southbury Road,,,Enfield,Middlesex,EN1 1YT,Tel: 02083666464,No ratings yet Rate it yourself - /Services/careproviders/LeaveReview/DefaultView.aspx?id=1-11718069330,0,0,,
Marego Limited,,SCL,120A Burleigh Road,,,Enfield,Middlesex,EN1 1NU,Tel: 02072541903,No ratings yet Rate it yourself - /Services/careproviders/LeaveReview/DefaultView.aspx?id=1-2825673435,0,0,,
Your Care Nursing Ltd,,SCL,54 Chase Green Avenue,,,Enfield,,EN2 8EN,Tel: 02083749807,No ratings yet Rate it yourself - /Services/careproviders/LeaveReview/DefaultView.aspx?id=1-15642971295,0,0,,
SSA Star Care Ltd,,SCL,Lumina Business Centre,32 Lumina Way,,Enfield,,EN1 1FS,Tel: 02088260183,No ratings yet Rate it yourself - /Services/careproviders/LeaveReview/DefaultView.aspx?id=1-11958460326,0,0,,
All4One Care Services Ltd,,SCL,Office 4,9a High Street,,Ingatestone,,CM4 9ED,Tel: 01708987738,No ratings yet Rate it yourself - /Services/careproviders/LeaveReview/DefaultView.aspx?id=1-15752390847,0,0,,
St Michaels Support & Care,,SCL,"2nd Floor, 1 Crossfield Chambers",Gladbeck Way,,Enfield,,EN2 7HT,Tel: 02083678229,No ratings yet Rate it yourself - /Services/careproviders/LeaveReview/DefaultView.aspx?id=1-4859046869,0,0,,
Essex Road,,SCL,6-8 Essex Road,,,Enfield,Middlesex,EN2 6TZ,Tel: 02083672731,No ratings yet Rate it yourself - /Services/careproviders/LeaveReview/DefaultView.aspx?id=1-9736920291,0,0,,
142 St Marks Road,,SCL,Bush Hill Park,,,Enfield,Middlesex,EN1 1BJ,Tel: 02083668131,No ratings yet Rate it yourself - /Services/careproviders/LeaveReview/DefaultView.aspx?id=1-152808241,0,0,,
Transition and Laterlife Matter Head Office,,SCL,393 Hertford Road,,,London,,N9 7BN,Tel: 07717016192,No ratings yet Rate it yourself - /Services/careproviders/LeaveReview/DefaultView.aspx?id=1-3194664526,0,0,,
Tekhnicon House,,SCL,Springwood Drive,,,Braintree,,CM7 2GB,Tel: 03003032642,No ratings yet Rate it yourself - /Services/careproviders/LeaveReview/DefaultView.aspx?id=1-6340830555,0,0,,
Spectra Care Ltd,,SCL,Office 16 Burney House,"11-17 Fowler Road, Hainault Business Park",,Ilford,,IG6 3UJ,Tel: 07565817062,No ratings yet Rate it yourself - /Services/careproviders/LeaveReview/DefaultView.aspx?id=1-8289529173,0,0,,
Alpha supported Living Ltd,,SCL,8 Heathfield,,,London,,E4 6SE,Tel: 07984065165,No ratings yet Rate it yourself - /Services/careproviders/LeaveReview/DefaultView.aspx?id=1-11823059229,0,0,,
Social Care Solutions Ltd (Herts & Bucks),,SCL,43 Filbert Close,,,Hatfield,,AL10 9SH,Tel: 02072026300,No ratings yet Rate it yourself - /Services/careproviders/LeaveReview/DefaultView.aspx?id=1-4617238417,0,0,,
Luna Care Services,,SCL,"Acorn Suite 10, Greenleaf House",Darkes Lane,,Potters Bar,,EN6 1AE,Tel: 01707502004,No ratings yet Rate it yourself - /Services/careproviders/LeaveReview/DefaultView.aspx?id=1-8181112485,0,0,,
Kayoski Care Ltd,,SCL,71 Copperfield,,,Chigwell,Essex,IG7 5NH,Tel: 02085001971,No ratings yet Rate it yourself - /Services/careproviders/LeaveReview/DefaultView.aspx?id=1-9250173205,0,0,,
Livability East Anglia,,SCL,Northwing Offices,Ingatestone Hall,,Ingatestone,Essex,CM4 9NS,Tel: 01277355646,No ratings yet Rate it yourself - /Services/careproviders/LeaveReview/DefaultView.aspx?id=1-119324790,0,0,,
One Step Domiciliary Care,,SCL,Metropolitan House,3 Darkes Lane,,Potters Bar,Hertfordshire,EN6 1AG,,No ratings yet Rate it yourself - /Services/careproviders/LeaveReview/DefaultView.aspx?id=1-18315230676,0,0,,
Carefield - Supported Living,,SCL,"Suite 8, 81 Old Church Road",Chingford,,London,,E4 6ST,Tel: 07742104000,No ratings yet Rate it yourself - /Services/careproviders/LeaveReview/DefaultView.aspx?id=1-9775155364,0,0,,
Normanshire-Supported Living Services,,SCL,87a,Old Church Road,,London,,E4 6ST,Tel: 07852714484,No ratings yet Rate it yourself - /Services/careproviders/LeaveReview/DefaultView.aspx?id=1-8175761325,0,0,,
Essex Community Support,,SCL,Moulsham Lodge - office,26 Waltham Glen,,Chelmsford,,CM2 9EL,Tel: 07909230835,No ratings yet Rate it yourself - /Services/careproviders/LeaveReview/DefaultView.aspx?id=1-9230038573,0,0,,
Open World 2 Limited,,SCL,28 Daventry Road,,,Romford,,RM3 7QT,Tel: 07957347493,No ratings yet Rate it yourself - /Services/careproviders/LeaveReview/DefaultView.aspx?id=1-9662052788,0,0,,
Proace Ltd,,SCL,22 Cleves Walk,,,Ilford,,IG6 2NQ,,No ratings yet Rate it yourself - /Services/careproviders/LeaveReview/DefaultView.aspx?id=1-15224626715,0,0,,
Adekams Care Services,,SCL,27 North Road,,,Brentwood,,CM14 4UZ,,No ratings yet Rate it yourself - /Services/careproviders/LeaveReview/DefaultView.aspx?id=1-10210092155,0,0,,
151 Chatteris Avenue,,SCL,151 Chatteris Avenue,,,Romford,,RM3 8JY,Tel: 01708532297,No ratings yet Rate it yourself - /Services/careproviders/LeaveReview/DefaultView.aspx?id=1-6610033143,0,0,,
Empress Social Care,,SCL,"Intech House, Suite 3B",Wilbury Way,,Hitchin,,SG4 0TW,Tel: 08000096432,No ratings yet Rate it yourself - /Services/careproviders/LeaveReview/DefaultView.aspx?id=1-9293460558,0,0,,
My Health Care Support Ltd,,SCL,40 The Market Square,,,London,,N9 0TZ,Tel: 07404524317,1 rating Rate it yourself - /Services/careproviders/LeaveReview/DefaultView.aspx?id=1-7263399026,,,,
Global North London Business School Limited,,SCL,Suite 8 3rd Floor St Georges Chambers,Edmonton,,London,,N9 0TZ,Tel: 02088878928,No ratings yet Rate it yourself - /Services/careproviders/LeaveReview/DefaultView.aspx?id=1-3827602563,0,0,,
Beehive Lane,,SCL,113-115 Beehive Lane,,,Chelmsford,,CM2 9RP,Tel: 01245490692,No ratings yet Rate it yourself - /Services/careproviders/LeaveReview/DefaultView.aspx?id=1-7226767154,0,0,,
Blak Diamond Main Office,,SCL,5 Lucerne Way,,,Romford,,RM3 8BS,Tel: 07491237921,No ratings yet Rate it yourself - /Services/careproviders/LeaveReview/DefaultView.aspx?id=1-14931108985,0,0,,
KADESH CARE LTD,,SCL,4 Pegamoid Road,,,London,,N18 2NG,Tel: 02033075025,No ratings yet Rate it yourself - /Services/careproviders/LeaveReview/DefaultView.aspx?id=1-12451798413,0,0,,
Blessday House,,SCL,4 Heaton Avenue,,,Romford,Essex,RM3 7HR,Tel: 01708500968,No ratings yet Rate it yourself - /Services/careproviders/LeaveReview/DefaultView.aspx?id=1-4831785897,0,0,,
Heaton Lodge,,SCL,17 Heaton Avenue,,,Romford,Essex,RM3 7HB,Tel: 01708941033,No ratings yet Rate it yourself - /Services/careproviders/LeaveReview/DefaultView.aspx?id=1-2582571675,0,0,,
Task Health Care,,SCL,45 Forest Road,,,Ilford,,IG6 3HA,Tel: 07841907091,No ratings yet Rate it yourself - /Services/careproviders/LeaveReview/DefaultView.aspx?id=1-13376159979,0,0,,
OP Recruitment Ltd,,SCL,248 Haselbury Road,,,London,,N9 9TR,Tel: 07720561290,No ratings yet Rate it yourself - /Services/careproviders/LeaveReview/DefaultView.aspx?id=1-6740828860,0,0,,
SBH Dunspring Lane,,SCL,51 Dunspring Lane,,,Ilford,,IG5 0UA,Tel: 07405995979,1 rating Rate it yourself - /Services/careproviders/LeaveReview/DefaultView.aspx?id=1-12508883712,,,,
Protecthand Care Limited,,SCL,"8B (7A) Elms House, Elms Industrial Estate","Church Road, Harold Wood",,Romford,,RM3 0JU,,No ratings yet Rate it yourself - /Services/careproviders/LeaveReview/DefaultView.aspx?id=1-6691951734,0,0,,
DE DIVINE SERVICE LIMITED,,SCL,,120 Kingston Hill Ave,,Romford,,RM6 5QP,Tel: 07482770482,No ratings yet Rate it yourself - /Services/careproviders/LeaveReview/DefaultView.aspx?id=1-4955656673,0,0,,
Stepping Stone Court,,SCL,76 Morley Avenue,,,London,,N18 2QT,,No ratings yet Rate it yourself - /Services/careproviders/LeaveReview/DefaultView.aspx?id=1-3983202318,0,0,,
Clayhall House,,SCL,60 Ewellhurst Road,,,Ilford,,IG5 0PB,Tel: 02035650483,No ratings yet Rate it yourself - /Services/careproviders/LeaveReview/DefaultView.aspx?id=1-5324242130,0,0,,