Organisation Name,NACS Code,Organisation Type,Address1,Address2,Address3,Address4,Address5,PostCode,Telephone Number,NHS.UK users rating,Value  (NHS.UK users rating),Banding Classification  (NHS.UK users rating),Car parking (Is there car parking at this organisation?),Disabled access (Disabled access)
Midlands Domicillary Branch,,SCL,"Office 36, Anglesey Business Centre",Anglesey Road,,Burton-on-trent,,DE14 3NT,,No ratings yet Rate it yourself - /Services/careproviders/LeaveReview/DefaultView.aspx?id=1-6432803200,0,0,,
Home Comfort Healthcare Ltd,,SCL,30 Curzon Street,,,Burton-on-trent,,DE14 2DH,Tel: 01536291907,No ratings yet Rate it yourself - /Services/careproviders/LeaveReview/DefaultView.aspx?id=1-13000424744,0,0,,
G&C HEALTHCARE LTD,,SCL,1 & 5 Borough Road,,,Burton-on-trent,,DE14 2DA,Tel: 01283904040,5 ratings Rate it yourself - /Services/careproviders/LeaveReview/DefaultView.aspx?id=1-9788362669,,,,
Sherratts Wood Cares Ltd,,SCL,"Registered Managers Office Accommodation, Burton Day Services",Byrkley Street,,Burton-on-trent,,DE14 2EG,Tel: 01283565909,No ratings yet Rate it yourself - /Services/careproviders/LeaveReview/DefaultView.aspx?id=1-11391389209,0,0,,
Horninglow Bungalows,,SCL,Horninglow Road,,,Burton on Trent,Staffordshire,DE14 2PY,Tel: 01283563509,No ratings yet Rate it yourself - /Services/careproviders/LeaveReview/DefaultView.aspx?id=1-135551812,0,0,,
Sanctuary Supported Living - Epworth House,,SCL,Wyndham Crescent,Winshill,,Burton-on-Trent,Staffordshire,DE15 0DG,Tel: 01283517617,No ratings yet Rate it yourself - /Services/careproviders/LeaveReview/DefaultView.aspx?id=1-2481117134,0,0,,
Godfrey Barnes Care SL Limited,,SCL,"G43A, Bretby Business Park, Ashby Road",Bretby,,Burton-on-trent,,DE15 0YZ,Tel: 01283553086,No ratings yet Rate it yourself - /Services/careproviders/LeaveReview/DefaultView.aspx?id=1-10295187305,0,0,,
Lymlight Healthcare Solutions Ltd,,SCL,5 Schofield Court,,,Ashby-de-la-zouch,,LE65 2RU,Tel: 07914396024,No ratings yet Rate it yourself - /Services/careproviders/LeaveReview/DefaultView.aspx?id=1-15351123694,0,0,,
Bayliss and Wilcox Community Support Ltd,,SCL,10 Amersham Way,Measham,,Swadlincote,Derbyshire,DE12 7PD,Tel: 01530271492,1 rating Rate it yourself - /Services/careproviders/LeaveReview/DefaultView.aspx?id=1-2292469976,,,,
St Mary's House,,SCL,19 Church Street,,,Uttoxeter,Staffordshire,ST14 8AG,Tel: 01889567360,No ratings yet Rate it yourself - /Services/careproviders/LeaveReview/DefaultView.aspx?id=1-9105732265,0,0,,
New Hope Care Leicester,,SCL,70-72 Market Street,,,Ashby-de-la-zouch,,LE65 1AN,Tel: 01162886974,No ratings yet Rate it yourself - /Services/careproviders/LeaveReview/DefaultView.aspx?id=1-13727045295,0,0,,
Brighter Days Staffordshire Ltd,,SCL,15 Lichfield Crescent,Hopwas,,Tamworth,Staffordshire,B78 3AJ,Tel: 0182767779,No ratings yet Rate it yourself - /Services/careproviders/LeaveReview/DefaultView.aspx?id=1-1709858453,0,0,,
Committed2Care Ltd,,SCL,Albert House,21 Albert Road,,Tamworth,,B79 7JS,Tel: 0182764499,No ratings yet Rate it yourself - /Services/careproviders/LeaveReview/DefaultView.aspx?id=1-4172124006,0,0,,
Gain Healthcare Tamworth,,SCL,14 Victoria Road,,,Tamworth,,B79 7HL,Tel: 01785331165,No ratings yet Rate it yourself - /Services/careproviders/LeaveReview/DefaultView.aspx?id=1-14279869257,0,0,,
Radis Community Care (Live-in Services),,SCL,Mercia House,15 Galena Close,,Tamworth,Staffordshire,B77 4AS,Tel: 03301008150,1 rating Rate it yourself - /Services/careproviders/LeaveReview/DefaultView.aspx?id=1-3505252215,,,,
Right Care Service Ltd,,SCL,Unit 17-20,"The Brian Clough Business Centre 200-222, Cotton Lane",,Derby,,DE24 8GJ,Tel: 01332650797,No ratings yet Rate it yourself - /Services/careproviders/LeaveReview/DefaultView.aspx?id=1-15167704505,0,0,,
The College Business Centre,,SCL,"Office 34, College Business Centre",Uttoxeter New Road,,Derby,,DE22 3WZ,Tel: 07879457654,No ratings yet Rate it yourself - /Services/careproviders/LeaveReview/DefaultView.aspx?id=1-18534809695,0,0,,
Shiloh Healthcare Services Ltd,,SCL,Office 12 Marble Hall,80 Nightingale Road,,Derby,,DE24 8BF,Tel: 01332742661,1 rating Rate it yourself - /Services/careproviders/LeaveReview/DefaultView.aspx?id=1-7279545954,,,,
ORC Care,,SCL,Office 24 Rosehill Business Centre,Normanton Road,,Derby,,DE23 6RH,Tel: 07843603083,No ratings yet Rate it yourself - /Services/careproviders/LeaveReview/DefaultView.aspx?id=1-17126178031,0,0,,
"Unit 22, Rosehill Business Centre",,SCL,Room 22 Rosehill Business Centre,Normanton Road,,Derby,,DE23 6RH,Tel: 01332295147,No ratings yet Rate it yourself - /Services/careproviders/LeaveReview/DefaultView.aspx?id=1-5233303631,0,0,,
Fosse Healthcare - Derby,,SCL,Suites 1.1 & 1.2 Southgate Business Innovation Centre,"Southgate Retail Park, Normanton Road",,Derby,,DE23 6UQ,Tel: 01332492026,No ratings yet Rate it yourself - /Services/careproviders/LeaveReview/DefaultView.aspx?id=1-2868596705,0,0,,
Creative Support - Derby Service,,SCL,"Flat 11, St. Judiths Court",34 South Street,,Derby,Derbyshire,DE1 1DB,Tel: 01332291083,No ratings yet Rate it yourself - /Services/careproviders/LeaveReview/DefaultView.aspx?id=1-133366827,0,0,,
"Prosper, Polesworth",,SCL,1 Orton Drive,Polesworth,,Tamworth,,B78 1DX,,No ratings yet Rate it yourself - /Services/careproviders/LeaveReview/DefaultView.aspx?id=1-18283403482,0,0,,
FINETOUCH CARE SUPPORTED LIVING,,SCL,101a,Normanton Road,,Derby,,DE1 2GG,Tel: 07956554345,No ratings yet Rate it yourself - /Services/careproviders/LeaveReview/DefaultView.aspx?id=1-14526843441,0,0,,
Chestnut House,,SCL,65a Friar Gate,,,Derby,,DE1 1DJ,Tel: 01332289933,No ratings yet Rate it yourself - /Services/careproviders/LeaveReview/DefaultView.aspx?id=1-6302607730,0,0,,
LAM Care 24 - Derby,,SCL,The Town House,123-125 Green Lane,,Derby,,DE1 1RZ,Tel: 07789553412,No ratings yet Rate it yourself - /Services/careproviders/LeaveReview/DefaultView.aspx?id=1-4301570822,0,0,,
S& K Care24,,SCL,Suite 5,Wetherby business park Road,,Derby,,DE24 8HL,,No ratings yet Rate it yourself - /Services/careproviders/LeaveReview/DefaultView.aspx?id=1-15104699376,0,0,,
Solace Care Solutions Limited,,SCL,,3 Milford Drive,,Ilkeston,Derbyshire,DE1 1LA,Tel: 07914543045,No ratings yet Rate it yourself - /Services/careproviders/LeaveReview/DefaultView.aspx?id=1-5271832254,0,0,,
Acts Health Care Ltd,,SCL,Suite 2.2 Litchurch Plaza,Litchurch Lane,,Derby,,DE24 8AA,Tel: 01332480165,No ratings yet Rate it yourself - /Services/careproviders/LeaveReview/DefaultView.aspx?id=1-5387771761,0,0,,
GAIN Care Limited - Derby,,SCL,Office 1. 1F,"Litchurch Plaza, Litchurch Lane",,Derby,,DE24 8AA,Tel: 01332331794,No ratings yet Rate it yourself - /Services/careproviders/LeaveReview/DefaultView.aspx?id=1-10895362125,0,0,,
Fairest Care Ltd,,SCL,"Office 4, Bemrose Chambers",38 St. Peters Churchyard,,Derby,,DE1 1NN,Tel: 07848443810,1 rating Rate it yourself - /Services/careproviders/LeaveReview/DefaultView.aspx?id=1-12789294922,,,,
Walton Out Care,,SCL,The Old Courthouse,18-20 St. Peters Churchyard,,Derby,,DE1 1NN,Tel: 01332986485,No ratings yet Rate it yourself - /Services/careproviders/LeaveReview/DefaultView.aspx?id=1-4894228894,0,0,,
Evolving Care Ltd,,SCL,"Lanner Suite, Unit 4, Falcon Park",Tame Valley Industrial Estate,,Tamworth,,B77 5DQ,Tel: 01827930690,No ratings yet Rate it yourself - /Services/careproviders/LeaveReview/DefaultView.aspx?id=1-13580766591,0,0,,
NASSH HEALTHCARE LTD,,SCL,Kings Chambers,34 Queen Street,,Derby,Derbyshire,DE1 3DS,Tel: 01332417977,2 ratings Rate it yourself - /Services/careproviders/LeaveReview/DefaultView.aspx?id=1-6983285464,,,,
LifeCome Plus,,SCL,Kings Chambers,34 Queen Street,,Derby,Derbyshire,DE1 3DS,Tel: 07828758048,1 rating Rate it yourself - /Services/careproviders/LeaveReview/DefaultView.aspx?id=1-600190466,,,,
Global Support & Care LTD,,SCL,24 Thorndike Avenue,Alvaston,,Derby,,DE24 8NZ,Tel: 07733154783,1 rating Rate it yourself - /Services/careproviders/LeaveReview/DefaultView.aspx?id=1-12637293459,,,,
Empowering U (East Midlands),,SCL,10 Mallard Way,Pride Park,,Derby,,DE24 8GX,Tel: 01332985600,No ratings yet Rate it yourself - /Services/careproviders/LeaveReview/DefaultView.aspx?id=1-6824732125,0,0,,
Creative Support - Pine Court,,SCL,60 Shardlow Road,Alvaston,,Derby,,DE24 0JL,Tel: 01332571960,No ratings yet Rate it yourself - /Services/careproviders/LeaveReview/DefaultView.aspx?id=1-9084438719,0,0,,
Mercy Care Centre,,SCL,310 Highfields Park Drive,,,Derby,Derbyshire,DE22 1JX,Tel: 01332553466,No ratings yet Rate it yourself - /Services/careproviders/LeaveReview/DefaultView.aspx?id=1-1141632173,0,0,,
Ebenezer (Stone of Help) Ltd,,SCL,1313 London Road,Alvaston,,Derby,,DE24 8QN,Tel: 01332572999,No ratings yet Rate it yourself - /Services/careproviders/LeaveReview/DefaultView.aspx?id=1-2902581748,0,0,,
Derby DCA,,SCL,24 St Marks Road,,,Derby,Derbyshire,DE21 6AH,Tel: 01332242798,No ratings yet Rate it yourself - /Services/careproviders/LeaveReview/DefaultView.aspx?id=1-1434777809,0,0,,
Commit2Care Services Ltd,,SCL,Parker House,"Parker Centre, Mansfield Road",,Derby,,DE21 4SZ,Tel: 03333551213,No ratings yet Rate it yourself - /Services/careproviders/LeaveReview/DefaultView.aspx?id=1-3088190527,0,0,,
Catherine Care,,SCL,Unit 13A,"Norton Canes Business Park, Jerome Road, Norton Canes",,Cannock,,WS11 9UE,Tel: 01922415888,No ratings yet Rate it yourself - /Services/careproviders/LeaveReview/DefaultView.aspx?id=1-16378242005,0,0,,
Enabling Others Limited,,SCL,"Unit 3, Martins Court","Telford Way, Stephenson Industrial Estate",,Coalville,,LE67 3HD,Tel: 01283553072,No ratings yet Rate it yourself - /Services/careproviders/LeaveReview/DefaultView.aspx?id=1-11759868345,0,0,,
Arreta Care Limited,,SCL,78A Bond Way,Hednesford,,Cannock,,WS12 4SN,,No ratings yet Rate it yourself - /Services/careproviders/LeaveReview/DefaultView.aspx?id=1-8417838965,0,0,,
Community Links,,SCL,The Old Exchange,"21 Nottingham Road, Spondon",,Derby,,DE21 7NF,Tel: 0133226565,No ratings yet Rate it yourself - /Services/careproviders/LeaveReview/DefaultView.aspx?id=1-16363166629,0,0,,
Kitcare Supported Living,,SCL,21a Ellendale Road,Chaddesden,,Derby,,DE21 6UE,Tel: 07570928359,No ratings yet Rate it yourself - /Services/careproviders/LeaveReview/DefaultView.aspx?id=1-6510904644,0,0,,
Affinity Trust - Domicilary Care Agency - West Midlands,,SCL,Flat 7,"Parrys Court, Woodside Place",,Cannock,,WS11 4AA,Tel: 01215533502,No ratings yet Rate it yourself - /Services/careproviders/LeaveReview/DefaultView.aspx?id=1-1420150690,0,0,,
Derby City Supported Living,,SCL,1 & 2 Broadstone Close,Chaddesden,,Derby,,DE21 4PE,Tel: 01332665307,No ratings yet Rate it yourself - /Services/careproviders/LeaveReview/DefaultView.aspx?id=1-10770581990,0,0,,
Better Care Services Ltd,,SCL,"4 Kingston Court Shopping Arcade, Walsall Road",,,Cannock,,WS11 0HQ,Tel: 07888271213,No ratings yet Rate it yourself - /Services/careproviders/LeaveReview/DefaultView.aspx?id=1-16566708152,0,0,,
Mayfield House,,SCL,11 Queen Street,,,Cannock,,WS11 1AE,Tel: 03335777830,No ratings yet Rate it yourself - /Services/careproviders/LeaveReview/DefaultView.aspx?id=1-11608156262,0,0,,
Hadet Healthcare,,SCL,180 Walsall Road,,,Cannock,,WS11 0JL,Tel: 01543220340,No ratings yet Rate it yourself - /Services/careproviders/LeaveReview/DefaultView.aspx?id=1-8923499278,0,0,,
Rose Meadow Care - Main Office,,SCL,Watling Court,Orbital Plaza,,Cannock,Staffordshire,WS11 0EL,Tel: 07984842957,No ratings yet Rate it yourself - /Services/careproviders/LeaveReview/DefaultView.aspx?id=1-15762860085,0,0,,
ECHO Support Ltd,,SCL,"126 Regus, Watling Court",Orbital Plaza,,Cannock,,WS11 0EL,Tel: 01543404682,No ratings yet Rate it yourself - /Services/careproviders/LeaveReview/DefaultView.aspx?id=1-15683424142,0,0,,
Empowerment Care Ltd,,SCL,Regus Orbit Plaza,Watling Street,,Cannock,,WS11 0EL,Tel: 07906164708,1 rating Rate it yourself - /Services/careproviders/LeaveReview/DefaultView.aspx?id=1-3012563794,,,,
Excellence Care Stafford,,SCL,"Suite No. 14, Darwin House","Lakhpur Court, Staffordshire Technology Park, Beaconside",,Stafford,,ST18 0FX,Tel: 07500894719,No ratings yet Rate it yourself - /Services/careproviders/LeaveReview/DefaultView.aspx?id=1-15749898642,0,0,,
Turning Point - Staffordshire Learning Disabilities Supported Living,,SCL,5 Rutherford Court,Staffordshire Technology Park,,Stafford,,ST18 0GP,Tel: 01785225071,No ratings yet Rate it yourself - /Services/careproviders/LeaveReview/DefaultView.aspx?id=1-8451142366,0,0,,
Saddlebrook Healthcare Services Ltd,,SCL,3 Poplar Lane,,,Cannock,,WS11 1NQ,,No ratings yet Rate it yourself - /Services/careproviders/LeaveReview/DefaultView.aspx?id=1-16373569495,0,0,,
The Moat House,,SCL,The Moat House,24 Lichfield Road,,Sutton Coldfield,,B74 2NJ,Tel: 03301336642,No ratings yet Rate it yourself - /Services/careproviders/LeaveReview/DefaultView.aspx?id=1-17714121931,0,0,,
Pooleview Support Services,,SCL,36 Kings Road,,,Walsall,,WS4 1JB,Tel: 07342959720,No ratings yet Rate it yourself - /Services/careproviders/LeaveReview/DefaultView.aspx?id=1-7464191702,0,0,,
Wisteria Care Agency Ltd,,SCL,38a High Street,,,Sutton Coldfield,West Midlands,B72 1UP,Tel: 07957582683,No ratings yet Rate it yourself - /Services/careproviders/LeaveReview/DefaultView.aspx?id=1-674490404,0,0,,
NDH Care (LEICESTER),,SCL,"Office 2, Stirchley House",21 Reddicap Trading Estate,,Sutton Coldfield,,B75 7BU,Tel: 01163090111,4 ratings Rate it yourself - /Services/careproviders/LeaveReview/DefaultView.aspx?id=1-10437669514,,,,
Harmony Care - Little Bloxwich Community Hub,,SCL,Stoney Lane,,,Walsall,West Midlands,WS3 3DW,Tel: 01922694412,No ratings yet Rate it yourself - /Services/careproviders/LeaveReview/DefaultView.aspx?id=1-6624088635,0,0,,
Real PCS Warwickshire,,SCL,"Suite 2 & 3, Carlyon Group House",Carlyon Road Industrial Estate,,Atherstone,,CV9 1LQ,Tel: 01827715544,No ratings yet Rate it yourself - /Services/careproviders/LeaveReview/DefaultView.aspx?id=1-8231722960,0,0,,
Support4U,,SCL,62,Buxton Road,,Walsall,,WS3 3QJ,Tel: 01922612104,No ratings yet Rate it yourself - /Services/careproviders/LeaveReview/DefaultView.aspx?id=1-8220138653,0,0,,
One Touch Quality Kare,,SCL,"Bramcote Way, 3 Bramcote Way",Rushall,,Walsall,,WS4 1DG,Tel: 01216040218,No ratings yet Rate it yourself - /Services/careproviders/LeaveReview/DefaultView.aspx?id=1-6367824093,0,0,,
Empower Care and Support Limited,,SCL,32 Bluebell Crescent,,,Walsall,,WS3 1FE,Tel: 07825751521,No ratings yet Rate it yourself - /Services/careproviders/LeaveReview/DefaultView.aspx?id=1-18386662797,0,0,,
110 Exeter Street,,SCL,110 Exeter Street,,,Stafford,,ST17 4EB,,No ratings yet Rate it yourself - /Services/careproviders/LeaveReview/DefaultView.aspx?id=1-16466023134,0,0,,
Aspirations Staffordshire,,SCL,"Door No.8, Unit 2B, Dunston Business Village Park",Stafford Road,,Stafford,,ST18 9AB,Tel: 01785450381,No ratings yet Rate it yourself - /Services/careproviders/LeaveReview/DefaultView.aspx?id=1-15526020978,0,0,,
Bosworth Homecare Administrative Offices,,SCL,7a Main Street,Market Bosworth,,Nuneaton,Warwickshire,CV13 0JN,Tel: 01455292648,1 rating Rate it yourself - /Services/careproviders/LeaveReview/DefaultView.aspx?id=1-180165893,,,,
Linfield Care Limited - 37a-38a Eastgate Street,,SCL,37a-38a Eastgate Street,,,Stafford,Staffordshire,ST16 2LZ,,No ratings yet Rate it yourself - /Services/careproviders/LeaveReview/DefaultView.aspx?id=1-123852028,0,0,,
Forever Care,,SCL,228 Lichfield Road,Rushall,,Walsall,,WS4 1SA,Tel: 01922642777,No ratings yet Rate it yourself - /Services/careproviders/LeaveReview/DefaultView.aspx?id=1-8687203641,0,0,,
SYNC ALLIANCE HEALTHCARE,,SCL,3 Brundard Close,,,Walsall,West Midlands,WS3 1AR,Tel: 02037800056,No ratings yet Rate it yourself - /Services/careproviders/LeaveReview/DefaultView.aspx?id=1-5059844390,0,0,,
Kare Plus Loughborough,,SCL,1 Queen Street,Shepshed,,Loughborough,Leicestershire,LE12 9RZ,Tel: 01509642070,No ratings yet Rate it yourself - /Services/careproviders/LeaveReview/DefaultView.aspx?id=1-4543912721,0,0,,
STAFFORDSHIRE,,SCL,36 Whateley Road,,,Walsall,West Midlands,WS3 1QU,Tel: 07392346554,No ratings yet Rate it yourself - /Services/careproviders/LeaveReview/DefaultView.aspx?id=1-12604070679,0,0,,
Starlight Healthcare Ltd,,SCL,St. Albans House Enterprise Centre,St. Albans Road,,Stafford,,ST16 3DP,,No ratings yet Rate it yourself - /Services/careproviders/LeaveReview/DefaultView.aspx?id=1-10314225733,0,0,,
Affinity Trust Specialist Division South,,SCL,1 Copton Ash,18 Billa Barra Lane,,Markfield,,LE67 9PD,Tel: 01530249120,No ratings yet Rate it yourself - /Services/careproviders/LeaveReview/DefaultView.aspx?id=1-14206536166,0,0,,
Supported Living Staffordshire,,SCL,Unit D,Hunters Row shopping Centre,,Stafford,,ST16 2AD,Tel: 01785337999,No ratings yet Rate it yourself - /Services/careproviders/LeaveReview/DefaultView.aspx?id=1-4899173407,0,0,,
Divine Healthcare Solutions - Main Office,,SCL,47,Field Road,,Walsall,,WS3 3JD,Tel: 03335770655,1 rating Rate it yourself - /Services/careproviders/LeaveReview/DefaultView.aspx?id=1-11866602277,,,,
Limelight,,SCL,4 Allen Street,,,Cheadle,Staffordshire,ST10 1HJ,Tel: 01538756736,No ratings yet Rate it yourself - /Services/careproviders/LeaveReview/DefaultView.aspx?id=1-309691783,0,0,,
Wesleycare Limited,,SCL,Unit 8,"Hollins Business Centre, Rowley Street",,Stafford,Staffordshire,ST16 2RH,,No ratings yet Rate it yourself - /Services/careproviders/LeaveReview/DefaultView.aspx?id=1-2238549582,0,0,,
Five Star Support,,SCL,Sandbank,Bloxwich,,Walsall,,WS3 2HL,Tel: 07525816813,No ratings yet Rate it yourself - /Services/careproviders/LeaveReview/DefaultView.aspx?id=1-4773068254,0,0,,
Universal Care Services,,SCL,Apartment 3,"60, Warren House Walk",,Sutton Coldfield,West Midlands,B76 1TS,Tel: 01213130612,No ratings yet Rate it yourself - /Services/careproviders/LeaveReview/DefaultView.aspx?id=1-312531784,0,0,,
Regal Care Services Limited,,SCL,"Jen Shoes Building, Castlefields",Newport Road,,Stafford,,ST16 1BQ,Tel: 01785501468,No ratings yet Rate it yourself - /Services/careproviders/LeaveReview/DefaultView.aspx?id=1-11271888564,0,0,,
Freedom Support Ltd,,SCL,Staffordshire House,96 Stone Road,,Stafford,Staffordshire,ST16 2RS,Tel: 01785600240,No ratings yet Rate it yourself - /Services/careproviders/LeaveReview/DefaultView.aspx?id=1-481979937,0,0,,
Gracious Healthcare Services Ltd,,SCL,592 Bloxwich Road,,,Walsall,,WS3 2XE,Tel: 01922669797,No ratings yet Rate it yourself - /Services/careproviders/LeaveReview/DefaultView.aspx?id=1-10272518016,0,0,,
Upward Care Limited,,SCL,Bloxwich Hall,"Elmore Court, Elmore Green Road",,"Bloxwich, Walsall",West Midlands,WS3 2QW,,No ratings yet Rate it yourself - /Services/careproviders/LeaveReview/DefaultView.aspx?id=1-2204416917,0,0,,
Elderberry Mews and Mulberry Court,,SCL,80 Kings Road,,,Sutton Coldfield,West Midlands,B73 5AE,Tel: 01213926935,No ratings yet Rate it yourself - /Services/careproviders/LeaveReview/DefaultView.aspx?id=1-6614657376,0,0,,
Inmind community Support Services Limited,,SCL,The Rock Center,27-31 Lichfield Street,,Walsall,West Midlands,WS1 1TJ,Tel: 01922611315,No ratings yet Rate it yourself - /Services/careproviders/LeaveReview/DefaultView.aspx?id=1-4704543143,0,0,,
Essence Health Ltd,,SCL,Lichfield House 27-31,Lichfield Street,,Walsall,,WS1 1TJ,Tel: 01922640333,No ratings yet Rate it yourself - /Services/careproviders/LeaveReview/DefaultView.aspx?id=1-5208790400,0,0,,
ECHO Supported Living Services Limited,,SCL,Suite 117 The Rock Centre,27-31 Lichfield Street,,Walsall,,WS1 1TJ,,2 ratings Rate it yourself - /Services/careproviders/LeaveReview/DefaultView.aspx?id=1-8026516958,,,,
Harmony Revival Supported Living Services Limited,,SCL,"The Rock Centre, 27-31 Lichfield House",Lichfield Street,,Walsall,,WS1 1TJ,Tel: 07805219843,1 rating Rate it yourself - /Services/careproviders/LeaveReview/DefaultView.aspx?id=1-12815736066,,,,
CHAREY CARE UK LTD,,SCL,"The Rock House, Lichfield House",27-31 Lichfield Street,,Walsall,,WS1 1TJ,Tel: 01922276973,No ratings yet Rate it yourself - /Services/careproviders/LeaveReview/DefaultView.aspx?id=1-15520381141,0,0,,
Dignus Support,,SCL,10 Hatherton Road,,,Walsall,,WS1 1XS,Tel: 01213575049,No ratings yet Rate it yourself - /Services/careproviders/LeaveReview/DefaultView.aspx?id=1-2823384014,0,0,,
My Pillar Limited,,SCL,77 Bridge Street,,,Walsall,,WS1 1JQ,,No ratings yet Rate it yourself - /Services/careproviders/LeaveReview/DefaultView.aspx?id=1-3584279621,0,0,,
Supported Living West Midlands,,SCL,1 Florence Drive,,,Sutton Coldfield,,B73 5NH,Tel: 01162215545,No ratings yet Rate it yourself - /Services/careproviders/LeaveReview/DefaultView.aspx?id=1-13007717583,0,0,,
Hendre Care,,SCL,11 Finchley Road,Kingstanding,,Birmingham,West midlands,B44 0LD,Tel: 07980123565,No ratings yet Rate it yourself - /Services/careproviders/LeaveReview/DefaultView.aspx?id=1-352229484,0,0,,
Mediservices Care Ltd,,SCL,5J Townend House,,,Walsall,,WS1 1NS,Tel: 07928635455,No ratings yet Rate it yourself - /Services/careproviders/LeaveReview/DefaultView.aspx?id=1-13938633149,0,0,,
Kinver Care Ltd,,SCL,"Townend House, 4th Floor North",Park Street,,Walsall,,WS1 1NS,Tel: 01902238777,6 ratings Rate it yourself - /Services/careproviders/LeaveReview/DefaultView.aspx?id=1-6857717176,,,,
MK Executive Care Midlands,,SCL,"7th Floor, Townend House",Park Street,,Walsall,,WS1 1NS,Tel: 07931359586,No ratings yet Rate it yourself - /Services/careproviders/LeaveReview/DefaultView.aspx?id=1-8821157299,0,0,,
JayasCare,,SCL,6 Comsey Road,,,Birmingham,,B43 7RG,Tel: 07493878610,No ratings yet Rate it yourself - /Services/careproviders/LeaveReview/DefaultView.aspx?id=1-14143157178,0,0,,
3D Healthcare Solutions Limited,,SCL,180 Plants Brook Road,,,Sutton Coldfield,West Midlands,B76 1HL,Tel: 01212203184,No ratings yet Rate it yourself - /Services/careproviders/LeaveReview/DefaultView.aspx?id=1-3844276590,0,0,,
Nationwide Care Services (Erdington),,SCL,704 Chester Road,Erdington,,Birmingham,West Midlands,B23 5TE,Tel: 01212710300,No ratings yet Rate it yourself - /Services/careproviders/LeaveReview/DefaultView.aspx?id=1-3959898570,0,0,,
Sandiacre Lodge,,SCL,280 Derby Road,Sandiacre,,Nottingham,,NG10 5HE,Tel: 07478653701,No ratings yet Rate it yourself - /Services/careproviders/LeaveReview/DefaultView.aspx?id=1-11680865223,0,0,,
Mech Healthcare Limited,,SCL,19-20 Vicarage Place (Mwanaka Shop),,,Walsall,,WS1 3NA,Tel: 07402168788,No ratings yet Rate it yourself - /Services/careproviders/LeaveReview/DefaultView.aspx?id=1-12324929900,0,0,,
Mencap Derbyshire and Derby City Domiciliary Care Agency,,SCL,96a Douglas Road,Long Eaton,,Nottingham,Nottinghamshire,NG10 4BD,Tel: 01159835731,1 rating Rate it yourself - /Services/careproviders/LeaveReview/DefaultView.aspx?id=1-119189036,,,,
Mencap South Notts Services,,SCL,96A Douglas Road,Long Eaton,,Nottingham,Nottinghamshire,NG10 4BD,Tel: 01159835731,No ratings yet Rate it yourself - /Services/careproviders/LeaveReview/DefaultView.aspx?id=1-1326722605,0,0,,
Birmingham Supported Living Service,,SCL,"Unit 1, Chipstead Road",,,Birmingham,,B23 5HD,Tel: 07790609241,No ratings yet Rate it yourself - /Services/careproviders/LeaveReview/DefaultView.aspx?id=1-10877394806,0,0,,
Passion 4 Care,,SCL,"Stuart House, 1st Floor","97 Station Road, Erdington",,Birmingham,,B23 6UG,Tel: 01213843035,1 rating Rate it yourself - /Services/careproviders/LeaveReview/DefaultView.aspx?id=1-7089203561,,,,
Zanta Healthcare,,SCL,16 Edwards Road,,,Birmingham,,B24 9EW,Tel: 01384913223,2 ratings Rate it yourself - /Services/careproviders/LeaveReview/DefaultView.aspx?id=1-1764201580,,,,