Organisation Name,NACS Code,Organisation Type,Address1,Address2,Address3,Address4,Address5,PostCode,Telephone Number,NHS.UK users rating,Value  (NHS.UK users rating),Banding Classification  (NHS.UK users rating),Car parking (Is there car parking at this organisation?),Disabled access (Disabled access)
Kreative Care Ltd,,SCL,1 Cawdron Close,Dalton,,Rotherham,,S65 3HH,Tel: 07868211672,No ratings yet Rate it yourself - /Services/careproviders/LeaveReview/DefaultView.aspx?id=1-15062897960,0,0,,
RMBC-Supported Living,,SCL,220 Badsley Moor Lane,,,Rotherham,South Yorkshire,S65 2QU,Tel: 07584174911,No ratings yet Rate it yourself - /Services/careproviders/LeaveReview/DefaultView.aspx?id=1-18820503095,0,0,,
The Cornerstone,,SCL,115 Doncaster Road,,,Rotherham,South Yorkshire,S65 2BN,Tel: 01709365387,No ratings yet Rate it yourself - /Services/careproviders/LeaveReview/DefaultView.aspx?id=1-110177515,0,0,,
Rotherham Regional Office,,SCL,228-230 Wellgate,,,Rotherham,South Yorkshire,S60 2PB,Tel: 07483087714,No ratings yet Rate it yourself - /Services/careproviders/LeaveReview/DefaultView.aspx?id=1-243588196,0,0,,
Bradford Regional Office,,SCL,228-230 Wellgate,,,Rotherham,South Yorkshire,S60 2PB,Tel: 07342036616,No ratings yet Rate it yourself - /Services/careproviders/LeaveReview/DefaultView.aspx?id=1-3535163728,0,0,,
Ariya Neuro Care (Supported Living) Limited,,SCL,10 Percy Street,,,Rotherham,,S65 1ED,Tel: 07891429690,No ratings yet Rate it yourself - /Services/careproviders/LeaveReview/DefaultView.aspx?id=1-7453848959,0,0,,
Sense- Community Services and Supported Living Services (North),,SCL,Unit 4,"Ashley Court Business Centre, Rawmarsh Road",,Rotherham,,S60 1RU,Tel: 07841620577,No ratings yet Rate it yourself - /Services/careproviders/LeaveReview/DefaultView.aspx?id=1-11686273345,0,0,,
Voyage (DCA) Rotherham,,SCL,Moorgate Croft Business Centre,South Grove,,Rotherham,South Yorkshire,S60 2DH,Tel: 01709331245,No ratings yet Rate it yourself - /Services/careproviders/LeaveReview/DefaultView.aspx?id=1-2243820240,0,0,,
Rubies Limited,,SCL,Thornbank House,38 Moorgate Road,,Rotherham,,S60 2AG,Tel: 07824443870,No ratings yet Rate it yourself - /Services/careproviders/LeaveReview/DefaultView.aspx?id=1-9843753825,0,0,,
Hope In Care Services Ltd,,SCL,Peak House,Greaves Road,,Rotherham,,S61 1SZ,Tel: 03301201607,No ratings yet Rate it yourself - /Services/careproviders/LeaveReview/DefaultView.aspx?id=1-13043824785,0,0,,
Royal Mencap Society - Rotherham and Sheffield Domiciliary Care Agency,,SCL,Units 1 & 2 Fullerton Court,Fullerton Road,,Rotherham,,S60 1DH,Tel: 01709388440,No ratings yet Rate it yourself - /Services/careproviders/LeaveReview/DefaultView.aspx?id=1-6924363192,0,0,,
10 Wood Road,,SCL,10 Wood Road,Kimberworth Park,,Rotherham,,S61 3RQ,,No ratings yet Rate it yourself - /Services/careproviders/LeaveReview/DefaultView.aspx?id=1-10750825967,0,0,,
hcs Supported Living,,SCL,"The Lodge, Off Tickhill Square",Denaby Main,,Doncaster,,DN12 4AR,,No ratings yet Rate it yourself - /Services/careproviders/LeaveReview/DefaultView.aspx?id=1-15825978278,0,0,,
Hamilton Court,,SCL,Off Elm Green Lane,Conisbrough,,Doncaster,South Yorkshire,DN12 3JD,Tel: 01709865449,No ratings yet Rate it yourself - /Services/careproviders/LeaveReview/DefaultView.aspx?id=1-2367994336,0,0,,
The Wesley Centre,,SCL,Blyth Road,Maltby,,Rotherham,South Yorkshire,S66 8JD,Tel: 01709811171,No ratings yet Rate it yourself - /Services/careproviders/LeaveReview/DefaultView.aspx?id=1-4616330106,0,0,,
Amethyst Care & Support Group Limited,,SCL,Unit 34,"Century Business Centre, Century Park, Manvers",,Rotherham,,S63 5DA,Tel: 01709437760,No ratings yet Rate it yourself - /Services/careproviders/LeaveReview/DefaultView.aspx?id=1-14444691120,0,0,,
Station House,,SCL,23 Station Road,Laughton Common,,Dinnington,South Yorkshire,S25 3RW,Tel: 01909561917,No ratings yet Rate it yourself - /Services/careproviders/LeaveReview/DefaultView.aspx?id=1-111631428,0,0,,
Holistic Care 4U,,SCL,Edlington Lane,Edlington,,Doncaster,,DN12 1AB,Tel: 01709206450,No ratings yet Rate it yourself - /Services/careproviders/LeaveReview/DefaultView.aspx?id=1-5990200024,0,0,,
Newdon Care Services Limited,,SCL,Unit 2-3,"Edlington Lane, Edlington",,Doncaster,South Yorkshire,DN12 1BS,Tel: 01302957582,No ratings yet Rate it yourself - /Services/careproviders/LeaveReview/DefaultView.aspx?id=1-1547222466,0,0,,
In Safe Hands Care and Support Ltd,,SCL,Khepera Business Centre,9 Orgreave Road,,Sheffield,South Yorkshire,S13 9LQ,Tel: 01142992388,No ratings yet Rate it yourself - /Services/careproviders/LeaveReview/DefaultView.aspx?id=1-10199400837,0,0,,
Bell House Mews,,SCL,Bell House Road,Shiregreen,,Sheffield,South Yorkshire,S5 0PL,Tel: 01142467031,No ratings yet Rate it yourself - /Services/careproviders/LeaveReview/DefaultView.aspx?id=1-1202564574,0,0,,
Lynx Care(UK) Ltd,,SCL,Gateway Business Centre,"Unit 5, Leeds Road",,Sheffield,South Yorkshire,S9 3TY,Tel: 01142431624,No ratings yet Rate it yourself - /Services/careproviders/LeaveReview/DefaultView.aspx?id=1-2164228070,0,0,,
Real life options - Derbyshire and Sheffield Supported Living and Outreach,,SCL,10 Leeds Road,,,Sheffield,,S9 3TY,Tel: 07557868934,No ratings yet Rate it yourself - /Services/careproviders/LeaveReview/DefaultView.aspx?id=1-18054733642,0,0,,
Optimum Healthcare Limited,,SCL,X M P House,"2 Starnhill Close, Ecclesfield",,Sheffield,,S35 9TG,Tel: 01143863340,No ratings yet Rate it yourself - /Services/careproviders/LeaveReview/DefaultView.aspx?id=1-3983084638,0,0,,
Unique Options + Limited,,SCL,68 Beaver Hill Road,,,Sheffield,,S13 7UD,Tel: 07925013714,No ratings yet Rate it yourself - /Services/careproviders/LeaveReview/DefaultView.aspx?id=1-8519822952,0,0,,
Sheffield Supported Living,,SCL,100 Beighton Road,,,Sheffield,,S13 7PS,Tel: 01142611934,No ratings yet Rate it yourself - /Services/careproviders/LeaveReview/DefaultView.aspx?id=1-2810093262,0,0,,
Adswad Ltd,,SCL,114 Colley Crescent,,,Sheffield,South Yorkshire,S5 9FS,Tel: 07590830616,No ratings yet Rate it yourself - /Services/careproviders/LeaveReview/DefaultView.aspx?id=1-462767022,0,0,,
Hallam24 Healthcare,,SCL,12B Station Road,Chapeltown,,Sheffield,South Yorkshire,S35 2XH,Tel: 01143494545,No ratings yet Rate it yourself - /Services/careproviders/LeaveReview/DefaultView.aspx?id=1-1457817223,0,0,,
Longley Hall Limited,,SCL,Longley Hall,Longley Lane,,Sheffield,South Yorkshire,S5 7JF,Tel: 01142423773,No ratings yet Rate it yourself - /Services/careproviders/LeaveReview/DefaultView.aspx?id=1-479579484,0,0,,
Delight Support Services - Main Office,,SCL,Unit E2,"G4 Business Centre, Carlisle Street East",,Sheffield,,S4 7QN,Tel: 01143218097,No ratings yet Rate it yourself - /Services/careproviders/LeaveReview/DefaultView.aspx?id=1-15060693355,0,0,,
Newfield View Supported Living,,SCL,Unit D18,"Alison Centre, 39 Alison Crescent",,Sheffield,,S2 1AS,Tel: 01142998933,No ratings yet Rate it yourself - /Services/careproviders/LeaveReview/DefaultView.aspx?id=1-12509114981,0,0,,
Advanced Caring (Doncaster) Limited,,SCL,Unit 14,"Clayfields Industrial Estate, Tickhill Road",,Doncaster,,DN4 8QG,Tel: 01302811843,No ratings yet Rate it yourself - /Services/careproviders/LeaveReview/DefaultView.aspx?id=1-10234713801,0,0,,
Voyage (DCA) Doncaster,,SCL,59 Warmsworth Road,,,Doncaster,,DN4 0RP,Tel: 07773734994,No ratings yet Rate it yourself - /Services/careproviders/LeaveReview/DefaultView.aspx?id=1-13166345562,0,0,,
Select Support Partnerships Yorkshire,,SCL,1a Dartree Walk,Darfield,,Barnsley,,S73 9NL,Tel: 07932988730,No ratings yet Rate it yourself - /Services/careproviders/LeaveReview/DefaultView.aspx?id=1-17594723965,0,0,,
Pennine View,,SCL,7 Ferrara Close,Darfield,,Barnsley,South Yorkshire,S73 9RB,Tel: 01226751613,No ratings yet Rate it yourself - /Services/careproviders/LeaveReview/DefaultView.aspx?id=1-111631385,0,0,,
Bridge to Care Housing Limited,,SCL,33 Burngreave Street,,,Sheffield,,S3 9DQ,,No ratings yet Rate it yourself - /Services/careproviders/LeaveReview/DefaultView.aspx?id=1-18616287396,0,0,,
Lifeways SIL Limited (North East),,SCL,High Road,Balby,,Doncaster,South Yorkshire,DN4 0AB,Tel: 0130 285 6457,No ratings yet Rate it yourself - /Services/careproviders/LeaveReview/DefaultView.aspx?id=1-2810586007,0,0,,
Creative Support - Sheffield Service,,SCL,11 Mansfield View,,,Sheffield,South Yorkshire,S12 2AW,Tel: 01142168946,No ratings yet Rate it yourself - /Services/careproviders/LeaveReview/DefaultView.aspx?id=1-4481328553,0,0,,
Stable Lives,,SCL,Office 12,"Neepsend House, 1 Percy Street",,Sheffield,,S3 8BT,Tel: 07803786924,No ratings yet Rate it yourself - /Services/careproviders/LeaveReview/DefaultView.aspx?id=1-2592826094,0,0,,
Light Health Care Ltd,,SCL,Courtwood House,Silver Street Head,,Sheffield,,S1 2DD,Tel: 07445058552,No ratings yet Rate it yourself - /Services/careproviders/LeaveReview/DefaultView.aspx?id=1-12413793078,0,0,,
Dimensions South Yorkshire (North) Domiciliary Care Office,,SCL,Unit G10,"Globe Works, Penistone Road",,Sheffield,,S6 3AE,Tel: 03003039003,No ratings yet Rate it yourself - /Services/careproviders/LeaveReview/DefaultView.aspx?id=1-11307219082,0,0,,
Citizenship First Ltd,,SCL,Workstation,15 Paternoster Row,,Sheffield,,S1 2BX,Tel: 01142798001,No ratings yet Rate it yourself - /Services/careproviders/LeaveReview/DefaultView.aspx?id=1-7614615059,0,0,,
PCR Healthcare Ltd,,SCL,The Balance,2 Pinfold Street,,Sheffield,,S1 2GU,,No ratings yet Rate it yourself - /Services/careproviders/LeaveReview/DefaultView.aspx?id=1-13742337292,0,0,,
Goodheart Plus Ltd,,SCL,"Office 37D, First Floor D Block, Balby Court Business Campus",Balby Carr Bank,,Doncaster,,DN4 8DE,Tel: 07454767814,No ratings yet Rate it yourself - /Services/careproviders/LeaveReview/DefaultView.aspx?id=1-13942878669,0,0,,
Deaf Solution Ltd,,SCL,"Office 3, Block D, Balby Court Business Campus",Balby Carr Bank Road,,Doncaster,,DN4 8DE,Tel: 01302244472,No ratings yet Rate it yourself - /Services/careproviders/LeaveReview/DefaultView.aspx?id=1-10065481825,0,0,,
Bespoke Care (Sheffield) Limited,,SCL,City Limits Building,607-613 Penistone Road,,Sheffield,,S6 2GA,Tel: 01144427949,No ratings yet Rate it yourself - /Services/careproviders/LeaveReview/DefaultView.aspx?id=1-4250292923,0,0,,
Dimensions South Yorkshire (South) Domiciliary Care Office,,SCL,458,East Bank Road,,Sheffield,,S2 2AD,,No ratings yet Rate it yourself - /Services/careproviders/LeaveReview/DefaultView.aspx?id=1-11546948561,0,0,,
Pillar Nursing Placements Limited,,SCL,139 Upperthorpe Road,,,Sheffield,South Yorkshire,S6 3EB,Tel: 01142995090,No ratings yet Rate it yourself - /Services/careproviders/LeaveReview/DefaultView.aspx?id=1-4908658182,0,0,,
Walsingham Support - Supported Living Doncaster,,SCL,"Room 11, Gresley House",Ten Pound Walk,,Doncaster,,DN4 5HX,Tel: 02083435600,No ratings yet Rate it yourself - /Services/careproviders/LeaveReview/DefaultView.aspx?id=1-7221753130,0,0,,
Cristal Care,,SCL,Proaktive House,Sidings Court,,Doncaster,,DN4 5NU,Tel: 01302857433,No ratings yet Rate it yourself - /Services/careproviders/LeaveReview/DefaultView.aspx?id=1-10488977631,0,0,,
Living Ambitions Limited (Doncaster),,SCL,"Unit 2, Don House, Richmond Business Park",Sidings Court,,Doncaster,South Yorkshire,DN4 5NL,Tel: 01302344255,No ratings yet Rate it yourself - /Services/careproviders/LeaveReview/DefaultView.aspx?id=1-2607493461,0,0,,
Lifeways Community Care (Doncaster),,SCL,"Unit 2, Don House","Richmond Business Park, Sidings Court",,Doncaster,South Yorkshire,DN4 5NL,Tel: 01302344255,No ratings yet Rate it yourself - /Services/careproviders/LeaveReview/DefaultView.aspx?id=1-2644164628,0,0,,
MB Healthcare Staffing Limited,,SCL,3 Nidd House,"Richmond Business Park, Sidings Court",,Doncaster,,DN4 5NL,Tel: 01302323957,No ratings yet Rate it yourself - /Services/careproviders/LeaveReview/DefaultView.aspx?id=1-18679007097,0,0,,
Hamilton Lodge,,SCL,Carr House Road,,,Doncaster,South Yorkshire,DN4 5HP,Tel: 01302556046,No ratings yet Rate it yourself - /Services/careproviders/LeaveReview/DefaultView.aspx?id=1-1470126058,0,0,,
Sanctuary Supported Living - Studfield Court,,SCL,17A Studfield Crescent,,,Sheffield,South Yorkshire,S6 4SP,Tel: 01142853563,No ratings yet Rate it yourself - /Services/careproviders/LeaveReview/DefaultView.aspx?id=1-1651829730,0,0,,
Barnsley Mencap,,SCL,"F1 Willow Suite, Oaks Business Park",Oaks Lane,,Barnsley,South Yorkshire,S71 1HT,Tel: 01226730241,No ratings yet Rate it yourself - /Services/careproviders/LeaveReview/DefaultView.aspx?id=1-119187505,0,0,,
Avalon Doncaster Services,,SCL,Avalon Offices (to the rear of),"113, Thorne Road",,Doncaster,,DN2 5BQ,,No ratings yet Rate it yourself - /Services/careproviders/LeaveReview/DefaultView.aspx?id=1-5300061691,0,0,,
Kingfield Supported Living,,SCL,The Link Building,24a St Andrews Road,,Sheffield,South Yorkshire,S11 9AL,Tel: 01142587557,No ratings yet Rate it yourself - /Services/careproviders/LeaveReview/DefaultView.aspx?id=1-2123947834,0,0,,
Wakefield Supported Living,,SCL,Dillington Mews,High Stone Road,,Barnsley,,S70 4DX,Tel: 01132883292,No ratings yet Rate it yourself - /Services/careproviders/LeaveReview/DefaultView.aspx?id=1-3116502076,0,0,,
Omnicare Service Limited,,SCL,Unit 18 Oakwell Business Centre,Oakwell View,,Barnsley,,S71 1HX,Tel: 01226395476,No ratings yet Rate it yourself - /Services/careproviders/LeaveReview/DefaultView.aspx?id=1-5922688233,0,0,,
Magnet Court,,SCL,1 Magnet Court,"Victoria Road, Bentley",,Doncaster,South Yorkshire,DN5 0HP,Tel: 01302 822522,No ratings yet Rate it yourself - /Services/careproviders/LeaveReview/DefaultView.aspx?id=1-2122625857,0,0,,
EMH Supported Living 1,,SCL,Cherry Tree House,"Off Cedar Close, Eckington",,Sheffield,,S21 4BA,Tel: 07817820934,No ratings yet Rate it yourself - /Services/careproviders/LeaveReview/DefaultView.aspx?id=1-13931025428,0,0,,
Just Homes Care,,SCL,"Westfield Centre, Westfield Lane,",South Elmsall,,Pontefract,West Yorkshire,WF9 2PQ,Tel: 01977640333,No ratings yet Rate it yourself - /Services/careproviders/LeaveReview/DefaultView.aspx?id=1-2693456515,0,0,,
Sun Health Care Domiciliary Care Services,,SCL,Cockerham Hall,Huddersfield Road,,Barnsley,South Yorkshire,S70 2LT,Tel: 01226323670,No ratings yet Rate it yourself - /Services/careproviders/LeaveReview/DefaultView.aspx?id=1-1745246451,0,0,,
Creative Support - Doncaster Personalised Services,,SCL,Unit 3 Shaw Wood Business Park,Shaw Wood Way,,Doncaster,,DN2 5TB,Tel: 01302320615,No ratings yet Rate it yourself - /Services/careproviders/LeaveReview/DefaultView.aspx?id=1-6373229687,0,0,,
Great Care Support Limited,,SCL,25 Walstow Crescent,Armthorpe,,Doncaster,,DN3 2FS,Tel: 07867011874,No ratings yet Rate it yourself - /Services/careproviders/LeaveReview/DefaultView.aspx?id=1-12590827203,0,0,,
Caring Stars Limited,,SCL,"Office G12, Longfield House",Longfield Court,,Barnsley,,S71 3HR,Tel: 07554181424,No ratings yet Rate it yourself - /Services/careproviders/LeaveReview/DefaultView.aspx?id=1-10564181876,0,0,,
LH Social Care Limited - Barnsley,,SCL,"BBIC, Innovation Way",Wilthorpe,,Barnsley,South Yorkshire,S75 1JL,Tel: 01226246822,No ratings yet Rate it yourself - /Services/careproviders/LeaveReview/DefaultView.aspx?id=1-130838062,0,0,,
Precedo Health Care Services - Sheffield,,SCL,Stubley Works,Wreakes Lane,,Dronfield,,S18 1PN,Tel: 01246299700,No ratings yet Rate it yourself - /Services/careproviders/LeaveReview/DefaultView.aspx?id=1-114982553,0,0,,
Worksop Supported Living Service,,SCL,Apartement 1 Old Bakery Yard,Newcastle Avenue,,Worksop,,S80 1NS,Tel: 07483087714,No ratings yet Rate it yourself - /Services/careproviders/LeaveReview/DefaultView.aspx?id=1-10631963207,0,0,,
Doncaster Community Support,,SCL,"Unit 5, Stonecross House","Doncaster Road, Kirk Sandall",,Doncaster,,DN3 1QS,Tel: 01733873700,No ratings yet Rate it yourself - /Services/careproviders/LeaveReview/DefaultView.aspx?id=1-341611699,0,0,,
Senescence Care Agency Ltd,,SCL,"Office 18-19, Staveley Hall",Staveley Hall Drive,,Chesterfield,Derbyshire,S43 3TN,Tel: 01246 474114,No ratings yet Rate it yourself - /Services/careproviders/LeaveReview/DefaultView.aspx?id=1-3632068256,0,0,,
Voyage (DCA) North Derbyshire,,SCL,1-8 Chapel Mews,"Wellington Street, New Whittington",,Chesterfield,,S43 2BG,Tel: 07872050339,No ratings yet Rate it yourself - /Services/careproviders/LeaveReview/DefaultView.aspx?id=1-7052948408,0,0,,
Future Home Care Nottinghamshire (South),,SCL,"Unit 17, Clocktower Business Centre","Works Road, Hollingwood",,Chesterfield,Derbyshire,S43 2PE,Tel: 01157530970,No ratings yet Rate it yourself - /Services/careproviders/LeaveReview/DefaultView.aspx?id=1-10870120790,0,0,,
Generations Care Agency Limited,,SCL,Unit 29-31 Clocktower Business Centre,"Works Road, Hollingwood",,Chesterfield,Derbyshire,S43 2PE,Tel: 01246471991,No ratings yet Rate it yourself - /Services/careproviders/LeaveReview/DefaultView.aspx?id=1-120052787,0,0,,
Lifeways Community Care (East Midlands),,SCL,"Unit 17, Clocktower Business Centre","Works Road, Hollingwood",,Chesterfield,Derbyshire,S43 2PE,Tel: 01246476073,No ratings yet Rate it yourself - /Services/careproviders/LeaveReview/DefaultView.aspx?id=1-2018486046,0,0,,
Mencap North Notts Services,,SCL,Dukeries Business Centre,31-33 Retford Road,,Worksop,Nottinghamshire,S80 2PU,Tel: 01909712255,No ratings yet Rate it yourself - /Services/careproviders/LeaveReview/DefaultView.aspx?id=1-119189009,0,0,,
United Response - Spire DCA,,SCL,28 Edensor Court,"Middlecroft, Staveley",,Chesterfield,Derbyshire,S43 3NW,Tel: 01246284440,No ratings yet Rate it yourself - /Services/careproviders/LeaveReview/DefaultView.aspx?id=1-123006890,0,0,,
Derby and Derbyshire Supported Living,,SCL,45 Paisley Close,Staveley,,Chesterfield,Derbyshire,S43 3NS,Tel: 01246470128,No ratings yet Rate it yourself - /Services/careproviders/LeaveReview/DefaultView.aspx?id=1-1829474200,0,0,,
Oice Support Services,,SCL,"Office 65, Dunston House",Dunston Road,,Chesterfield,,S41 9QD,Tel: 07875849127,No ratings yet Rate it yourself - /Services/careproviders/LeaveReview/DefaultView.aspx?id=1-15073581676,0,0,,
EMH Supported Living 3,,SCL,"Unit 208, Dunston Innovation Centre",,,Chesterfield,,S41 8NG,Tel: 01246599999,No ratings yet Rate it yourself - /Services/careproviders/LeaveReview/DefaultView.aspx?id=1-8600265340,0,0,,
Willowstone,,SCL,"321A,  Sheffield Road",,,Chesterfield,,S41 8LQ,Tel: 01246488712,No ratings yet Rate it yourself - /Services/careproviders/LeaveReview/DefaultView.aspx?id=1-11294881750,0,0,,
Eden Place Residential Home,,SCL,Pontefract Road,Ackworth,,Pontefract,West Yorkshire,WF7 7EE,Tel: 01977780278,No ratings yet Rate it yourself - /Services/careproviders/LeaveReview/DefaultView.aspx?id=1-2679848253,0,0,,
Millennium Support Ltd,,SCL,Wright Suite. The Brew House,The Nostell Estate Yard. Nostell,,Wakefield,,WF4 1AB,Tel: 01977602867,No ratings yet Rate it yourself - /Services/careproviders/LeaveReview/DefaultView.aspx?id=1-131355579,0,0,,
Ever Ready Medical,,SCL,Haven House,"Moss Road, Moss",,Doncaster,,DN6 0HP,Tel: 07919925827,No ratings yet Rate it yourself - /Services/careproviders/LeaveReview/DefaultView.aspx?id=1-13701095685,0,0,,
Daisy-Healthcare Ltd,,SCL,38 Rose Avenue,Calow,,Chesterfield,,S44 5TH,Tel: 07858459654,No ratings yet Rate it yourself - /Services/careproviders/LeaveReview/DefaultView.aspx?id=1-12298187215,0,0,,
The Baden Powell Centre,,SCL,Victoria Street,,,Chesterfield,Derbyshire,S41 7LP,Tel: 01246210910,No ratings yet Rate it yourself - /Services/careproviders/LeaveReview/DefaultView.aspx?id=1-496389311,0,0,,
Ivolve Derbyshire Supported Living,,SCL,Royal Court (2nd Floor),Basil Close,,Chesterfield,,S41 7SL,Tel: 01246556453,No ratings yet Rate it yourself - /Services/careproviders/LeaveReview/DefaultView.aspx?id=1-11378036259,0,0,,
Jubilee House,,SCL,6 Ashgate Road,,,Chesterfield,,S40 4AA,Tel: 01246959978,No ratings yet Rate it yourself - /Services/careproviders/LeaveReview/DefaultView.aspx?id=1-13173741536,0,0,,
Accede Support,,SCL,"Kyte Yorkshire Business Centre, Office 6","Great North Road, Darrington",,Pontefract,,WF8 3HR,Tel: 07423316068,No ratings yet Rate it yourself - /Services/careproviders/LeaveReview/DefaultView.aspx?id=1-14381913575,0,0,,
Ability Ash Lodge,,SCL,73 Old Road,,,Chesterfield,Derbyshire,S40 2RA,Tel: 01246231256,No ratings yet Rate it yourself - /Services/careproviders/LeaveReview/DefaultView.aspx?id=1-145602489,0,0,,
Total Healthcare Solutions PVT Ltd Limited,,SCL,"Office 18, Retford Enterprise Centre",Randall Way,,Retford,,DN22 7GR,,No ratings yet Rate it yourself - /Services/careproviders/LeaveReview/DefaultView.aspx?id=1-12242865885,0,0,,
Holistic Standard Care Services Limited,,SCL,Graphite House,"High Street, Crigglestone",,Wakefield,,WF4 3EF,,No ratings yet Rate it yourself - /Services/careproviders/LeaveReview/DefaultView.aspx?id=1-13654735703,0,0,,
Croft Healthcare Ltd,,SCL,Southgate Business Centre,32 Gillygate,,Pontefract,West Yorkshire,WF8 1PQ,Tel: 01138730470,No ratings yet Rate it yourself - /Services/careproviders/LeaveReview/DefaultView.aspx?id=1-12370432987,0,0,,
TOTAL HEALTH CARE SOLUTIONS PVT LTD LIMITED,,SCL,Office F29,"Rossingtons Business Park, West Carr Road",,Retford,,DN22 7SW,Tel: 07378393555,No ratings yet Rate it yourself - /Services/careproviders/LeaveReview/DefaultView.aspx?id=1-7419399814,0,0,,
Wakefield,,SCL,"Room 19, The Junction,","Charles Street, Horbury",,Wakefield,,WF4 5FH,Tel: 02072614100,No ratings yet Rate it yourself - /Services/careproviders/LeaveReview/DefaultView.aspx?id=1-15199313448,0,0,,
Theresa Care Limited,,SCL,Unit 6,"Headway Business Park, Denby Dale Road",,Wakefield,,WF2 7AZ,Tel: 07814194978,No ratings yet Rate it yourself - /Services/careproviders/LeaveReview/DefaultView.aspx?id=1-10676567675,0,0,,
Pinderfielde Healthcare Wakefield,,SCL,"Flexspace Business Unit, G10",Monckton Road,,Wakefield,,WF2 7AS,Tel: 01924728581,No ratings yet Rate it yourself - /Services/careproviders/LeaveReview/DefaultView.aspx?id=1-14159107172,0,0,,
Alternative Care Limited,,SCL,Unit 17,Monckton Road Industrial Estate,,Wakefield,West Yorkshire,WF2 7AL,Tel: 01924383388,No ratings yet Rate it yourself - /Services/careproviders/LeaveReview/DefaultView.aspx?id=1-965475922,0,0,,
Quick View Ltd,,SCL,"Suite 8, Langham House Business Centre",140-148 Westgate,,Wakefield,,WF2 9SR,Tel: 07463302303,No ratings yet Rate it yourself - /Services/careproviders/LeaveReview/DefaultView.aspx?id=1-7933259545,0,0,,
Blessed Hands Healthcare,,SCL,Unit G37b,Market Walk,,Wakefield,,WF1 1QR,Tel: 01924683565,No ratings yet Rate it yourself - /Services/careproviders/LeaveReview/DefaultView.aspx?id=1-6524619000,0,0,,
GT Care (Wakefield) Limited,,SCL,5 Homestead Drive,,,Wakefield,West Yorkshire,WF2 9PE,Tel: 01924374666,No ratings yet Rate it yourself - /Services/careproviders/LeaveReview/DefaultView.aspx?id=1-6405291926,0,0,,
Viable Care Services,,SCL,23 Blackwell Crescent,,,Wakefield,,WF1 4FZ,Tel: 07514537345,No ratings yet Rate it yourself - /Services/careproviders/LeaveReview/DefaultView.aspx?id=1-7946718765,0,0,,
Gabs Healthcare,,SCL,5 Cambridge Drive,Thorne,,Doncaster,,DN8 4FD,Tel: 01302496010,No ratings yet Rate it yourself - /Services/careproviders/LeaveReview/DefaultView.aspx?id=1-17716009483,0,0,,
North East,,SCL,"3A Gateway,",Fryers Way,,Ossett,,WF5 9TJ,Tel: 07776571896,No ratings yet Rate it yourself - /Services/careproviders/LeaveReview/DefaultView.aspx?id=1-12038962872,0,0,,
Agrade Community Care Services Limited,,SCL,"Unit 128, Coney Green Business Centre","Wingfield View, Clay Cross",,Chesterfield,Derbyshire,S45 9JW,,No ratings yet Rate it yourself - /Services/careproviders/LeaveReview/DefaultView.aspx?id=1-123454138,0,0,,