Organisation Name,NACS Code,Organisation Type,Address1,Address2,Address3,Address4,Address5,PostCode,Telephone Number,NHS.UK users rating,Value  (NHS.UK users rating),Banding Classification  (NHS.UK users rating),Car parking (Is there car parking at this organisation?),Disabled access (Disabled access)
Care Direct & support Solutions Limited,,SCL,Basepoint Innovation Centre,"110 Butterfield, Great Marlings",,Luton,,LU2 8DL,Tel: 01582433755,No ratings yet Rate it yourself - /Services/careproviders/LeaveReview/DefaultView.aspx?id=1-18226053179,0,0,,
Mid Shires Supported Living Service,,SCL,3 Lavender Fields,Lucas Lane,,Hitchin,Hertfordshire,SG5 2JB,Tel: 01234220050,No ratings yet Rate it yourself - /Services/careproviders/LeaveReview/DefaultView.aspx?id=1-2172579081,0,0,,
Supported Living Service,,SCL,562 Hitchin Road,,,Luton,,LU2 7UG,Tel: 01582548236,No ratings yet Rate it yourself - /Services/careproviders/LeaveReview/DefaultView.aspx?id=1-11773263575,0,0,,
Empress Social Care,,SCL,"Intech House, Suite 3B",Wilbury Way,,Hitchin,,SG4 0TW,Tel: 08000096432,No ratings yet Rate it yourself - /Services/careproviders/LeaveReview/DefaultView.aspx?id=1-9293460558,0,0,,
Advance Bedfordshire and Berkshire,,SCL,Bowls Court,11 Abigail Close,,Luton,Bedfordshire,LU3 1ND,Tel: 01582415797,No ratings yet Rate it yourself - /Services/careproviders/LeaveReview/DefaultView.aspx?id=1-17989751751,0,0,,
Westminster Homecare Limited (Luton),,SCL,"Suite 2, The Town House, 3 Park Terrace",Park Street,,Luton,,LU1 3HN,Tel: 01582733102,No ratings yet Rate it yourself - /Services/careproviders/LeaveReview/DefaultView.aspx?id=1-126215518,0,0,,
Join Hands Care,,SCL,4a Crystal House,New Bedford Road,,Luton,,LU1 1HS,Tel: 01582850605,No ratings yet Rate it yourself - /Services/careproviders/LeaveReview/DefaultView.aspx?id=1-12255459743,0,0,,
Distinct Care and Support,,SCL,56 Whitby Road,,,Luton,,LU3 1BQ,Tel: 07341111295,No ratings yet Rate it yourself - /Services/careproviders/LeaveReview/DefaultView.aspx?id=1-7540012479,0,0,,
AmberGreen Health & Social Care,,SCL,"AW House, 1st Floor,6-8 Stuart Street",Bedfordshire,,Luton,,LU1 2SJ,Tel: 01582283093,No ratings yet Rate it yourself - /Services/careproviders/LeaveReview/DefaultView.aspx?id=1-4646684845,0,0,,
Sahara Community Care Services - Luton,,SCL,"Suite 12, AW House",6-8 Stuart Street,,Luton,,LU1 2SJ,Tel: 07855472965,1 rating Rate it yourself - /Services/careproviders/LeaveReview/DefaultView.aspx?id=1-2464753876,,,,
T&S Healthcare Services Limited,,SCL,6-8 Stuart Street,,,Luton,Bedfordshire,LU1 2SJ,Tel: 07758557751,No ratings yet Rate it yourself - /Services/careproviders/LeaveReview/DefaultView.aspx?id=1-11959745429,0,0,,
Green Pastures Care Services,,SCL,13 Kershaw Close,,,Luton,,LU3 4AT,Tel: 07861718670,No ratings yet Rate it yourself - /Services/careproviders/LeaveReview/DefaultView.aspx?id=1-12879871979,0,0,,
Winray Care Housing - Luton,,SCL,Christchurch House,"Suite 101b, 40 Upper George Street",,Luton,,LU1 2RS,Tel: 01582564780,No ratings yet Rate it yourself - /Services/careproviders/LeaveReview/DefaultView.aspx?id=1-17947916312,0,0,,
Ruby 24hrCare,,SCL,110-112 Leagrave Road,,,Luton,,LU4 8HX,Tel: 01582391189,No ratings yet Rate it yourself - /Services/careproviders/LeaveReview/DefaultView.aspx?id=1-18217362678,0,0,,
Partners in Support,,SCL,11 Meadway Court,Rutherford Close,,Stevenage,Hertfordshire,SG1 2EF,Tel: 01438746243,No ratings yet Rate it yourself - /Services/careproviders/LeaveReview/DefaultView.aspx?id=1-455374011,0,0,,
Alina Homecare Specialist Care - Hertfordshire,,SCL,"6a Meadway Court,",Rutherford Close,,Stevenage,,SG1 2EF,Tel: 01707443933,No ratings yet Rate it yourself - /Services/careproviders/LeaveReview/DefaultView.aspx?id=1-5842997881,0,0,,
ABOBVO Links Ltd,,SCL,5 Viscount Close,,,Luton,,LU3 2PW,Tel: 07877787845,No ratings yet Rate it yourself - /Services/careproviders/LeaveReview/DefaultView.aspx?id=1-18392407519,0,0,,
"North Hants, Beds and Bucks Domiciliary Care Office",,SCL,Royal Mencap Society - 105A,960 Capability Green,,Luton,,LU1 3PE,Tel: 01733873700,No ratings yet Rate it yourself - /Services/careproviders/LeaveReview/DefaultView.aspx?id=1-13933556308,0,0,,
ASHLOTRIMCARE LTD,,SCL,960 Capability Green,,,Luton,Bedfordshire,LU1 3PE,Tel: 07546450674,No ratings yet Rate it yourself - /Services/careproviders/LeaveReview/DefaultView.aspx?id=1-12776305136,0,0,,
Woburn House,,SCL,"Room 112, 960 Capability Green",Bedfordshire,,Luton,,LU1 3PE,Tel: 01582635047,No ratings yet Rate it yourself - /Services/careproviders/LeaveReview/DefaultView.aspx?id=1-3809884921,0,0,,
Fortis Care Hertfordshire,,SCL,"Fortis Care, Caxton Point",Caxton Way,,Stevenage,,SG1 2XU,Tel: 01438487270,3 ratings Rate it yourself - /Services/careproviders/LeaveReview/DefaultView.aspx?id=1-5234926702,,,,
Sandton Healthcare Limited,,SCL,Unit 41 Caxton Point,Caxton Way,,Stevenage,,SG1 2XU,Tel: 07983615783,No ratings yet Rate it yourself - /Services/careproviders/LeaveReview/DefaultView.aspx?id=1-12637866785,0,0,,
Bridgecare Solutions Ltd,,SCL,Caxton Point Business Centre,Caxton Way,,Stevenage,,SG1 2XU,,No ratings yet Rate it yourself - /Services/careproviders/LeaveReview/DefaultView.aspx?id=1-12105644620,0,0,,
Priority Plus Care Ltd,,SCL,13 Caxton Point Business Centre,Caxton Way,,Stevenage,,SG1 2XU,Tel: 01438553105,No ratings yet Rate it yourself - /Services/careproviders/LeaveReview/DefaultView.aspx?id=1-18687969493,0,0,,
New Hope Community Healthcare,,SCL,Business & Technology Centre,Bessemer Drive,,Stevenage,Hertfordshire,SG1 2DX,Tel: 01438310000,No ratings yet Rate it yourself - /Services/careproviders/LeaveReview/DefaultView.aspx?id=1-6715233778,0,0,,
Lead Care Services Limited,,SCL,Business & Technology Centre,Bessemer Drive,,Stevenage,Hertfordshire,SG1 2DX,Tel: 01438419888,No ratings yet Rate it yourself - /Services/careproviders/LeaveReview/DefaultView.aspx?id=1-3727275725,0,0,,
Essential Services Direct,,SCL,"Unit 18B, Futures House","The Moakes, Marsh Farm",,Luton,,LU3 3QB,Tel: 07455972319,No ratings yet Rate it yourself - /Services/careproviders/LeaveReview/DefaultView.aspx?id=1-11829397532,0,0,,
Instant Homecare,,SCL,Instant Security ltd 95d,Marsh Road,,Luton,,LU3 2QG,Tel: 03333444313,No ratings yet Rate it yourself - /Services/careproviders/LeaveReview/DefaultView.aspx?id=1-11343414102,0,0,,
Joy Caring Services Limited,,SCL,"Suite B, Mindenhall Court","R/017 High Street, Old Town",,Stevenage,Hertfordshire,SG1 3BG,Tel: 01438311704,1 rating Rate it yourself - /Services/careproviders/LeaveReview/DefaultView.aspx?id=1-2057631160,,,,
Domiciliary Care Service,,SCL,SFAR008 Farnham House,6 Hills Way,,Stevenage,Hertfordshire,SG1 2FQ,Tel: 01438843575,No ratings yet Rate it yourself - /Services/careproviders/LeaveReview/DefaultView.aspx?id=1-145992032,0,0,,
Vincent Place,,SCL,Flat 42 Vincent Place,42 Townsend Mews,,Stevenage,,SG1 3AT,Tel: 01438729845,No ratings yet Rate it yourself - /Services/careproviders/LeaveReview/DefaultView.aspx?id=1-9140100470,0,0,,
Knightingles Healthcare Limited,,SCL,2a,Letchmore Road,,Stevenage,,SG1 3HU,Tel: 07717064436,No ratings yet Rate it yourself - /Services/careproviders/LeaveReview/DefaultView.aspx?id=1-4606227581,0,0,,
Care Fully Limited,,SCL,11 Broadview,,,Stevenage,Hertfordshire,SG1 3TT,Tel: 01438722665,No ratings yet Rate it yourself - /Services/careproviders/LeaveReview/DefaultView.aspx?id=1-2276468236,0,0,,
Lily Healthcare & Supported Living Limited,,SCL,55 Manchester Close,,,Stevenage,,SG1 4TQ,Tel: 07713912907,No ratings yet Rate it yourself - /Services/careproviders/LeaveReview/DefaultView.aspx?id=1-14567398596,0,0,,
Hand in Hands,,SCL,"Unit 5, Devonshire Business Centre",Works Road,,Letchworth,Hertfordshire,SG6 1GJ,Tel: 01462222400,No ratings yet Rate it yourself - /Services/careproviders/LeaveReview/DefaultView.aspx?id=1-1724411627,0,0,,
Compassion PLUS Healthcare,,SCL,Devonshire Business Centre,Works Road,,Letchworth Garden City,Hertfordshire,SG6 1GJ,Tel: 01462416101,No ratings yet Rate it yourself - /Services/careproviders/LeaveReview/DefaultView.aspx?id=1-5937564351,0,0,,
Abacus Care & Support,,SCL,"Head Office, Devonshire Business Centre",Works Road,,Letchworth Garden City,,SG6 1GJ,Tel: 02071001680,No ratings yet Rate it yourself - /Services/careproviders/LeaveReview/DefaultView.aspx?id=1-8809577412,0,0,,
Zach's Care,,SCL,"Wrest Park, Room 118 - first floor","Enterprise House, Silsoe",,Bedford,,MK45 4HR,Tel: 01525306740,2 ratings Rate it yourself - /Services/careproviders/LeaveReview/DefaultView.aspx?id=1-12630290304,,,,
Look Ahead Domiciliary Care (Hertfordshire),,SCL,Oak View,64-66 Hydean Way,,Stevenage,Hertfordshire,SG2 9XL,Tel: 01438740096,No ratings yet Rate it yourself - /Services/careproviders/LeaveReview/DefaultView.aspx?id=1-294441934,0,0,,
DX Caring Services,,SCL,"608 Jubilee Trading Estate, Jubilee Road",,,Letchworth Garden City,,SG6 1NE,Tel: 01462677770,No ratings yet Rate it yourself - /Services/careproviders/LeaveReview/DefaultView.aspx?id=1-9676435907,0,0,,
Stevenage,,SCL,27 Brimstone Drive,,,Stevenage,,SG1 4FX,Tel: 07919382837,No ratings yet Rate it yourself - /Services/careproviders/LeaveReview/DefaultView.aspx?id=1-11295712832,0,0,,
Stairways Supported Living Service,,SCL,19 Douglas Road,,,Harpenden,Hertfordshire,AL5 2EN,Tel: 01582460055,No ratings yet Rate it yourself - /Services/careproviders/LeaveReview/DefaultView.aspx?id=1-977766337,0,0,,
Frogmore Road,,SCL,23 Frogmore Road,,,Houghton Regis,Bedfordshire,LU5 5FX,Tel: 03003004299,No ratings yet Rate it yourself - /Services/careproviders/LeaveReview/DefaultView.aspx?id=1-344173032,0,0,,
Care Support Empower,,SCL,4 Evans Close,Houghton Regis,,Dunstable,,LU5 5TF,Tel: 07305563754,No ratings yet Rate it yourself - /Services/careproviders/LeaveReview/DefaultView.aspx?id=1-11780538979,0,0,,
Scope Care Services Ltd,,SCL,100 Aysgarth Close,,,Harpenden,,AL5 5UG,,No ratings yet Rate it yourself - /Services/careproviders/LeaveReview/DefaultView.aspx?id=1-13946638006,0,0,,
Precious Homes Bedfordshire,,SCL,Treow House,"Parkside Drive, Houghton Regis",,Dunstable,Bedfordshire,LU5 5QL,Tel: 01582863229,No ratings yet Rate it yourself - /Services/careproviders/LeaveReview/DefaultView.aspx?id=1-2679886188,0,0,,
Exclusive Care Ltd,,SCL,"Suite F, 15 Royston Road",,,Baldock,,SG7 6NW,Tel: 01438310108,No ratings yet Rate it yourself - /Services/careproviders/LeaveReview/DefaultView.aspx?id=1-6510507259,0,0,,
Rysvil Care Services Limited,,SCL,19 Apex Business Centre,,,Dunstable,,LU5 4SB,Tel: 01582450772,No ratings yet Rate it yourself - /Services/careproviders/LeaveReview/DefaultView.aspx?id=1-127830964,0,0,,
Walkers Close,,SCL,Domiciliary Care Agency,3-6 Walkers Close,,Shefford,Bedfordshire,SG17 5DE,Tel: 01462819112,1 rating Rate it yourself - /Services/careproviders/LeaveReview/DefaultView.aspx?id=1-130953666,,,,
Violets Homecare Services Limited,,SCL,Chiltern House,81 High Street North,,Dunstable,Bedfordshire,LU6 1JJ,Tel: 01582476044,No ratings yet Rate it yourself - /Services/careproviders/LeaveReview/DefaultView.aspx?id=1-122467385,0,0,,
Ascon Care Services Limited,,SCL,Room 38,81 - 83 High Street North,,Dunstable,,LU6 1JJ,Tel: 01582670049,1 rating Rate it yourself - /Services/careproviders/LeaveReview/DefaultView.aspx?id=1-9868219627,,,,
Delava Care,,SCL,3 Linden Road,Redbourn,,St Albans,Hertfordshire,AL3 7PL,Tel: 07867840629,No ratings yet Rate it yourself - /Services/careproviders/LeaveReview/DefaultView.aspx?id=1-2057654210,0,0,,
Salutem Supported Living East,,SCL,Office f38 - Quarry Walk,,,Dunstable,,LU6 3FN,Tel: 01872864337,No ratings yet Rate it yourself - /Services/careproviders/LeaveReview/DefaultView.aspx?id=1-14716345381,0,0,,
Vinea Care Limited,,SCL,53 The Vineyard,,,Welwyn Garden City,,AL8 7PY,,No ratings yet Rate it yourself - /Services/careproviders/LeaveReview/DefaultView.aspx?id=1-12390544741,0,0,,
Welwyn Garden City,,SCL,2 Falcon Gate,Shire Park,,Welwyn Garden City,,AL7 1TW,Tel: 07920391969,No ratings yet Rate it yourself - /Services/careproviders/LeaveReview/DefaultView.aspx?id=1-11608364948,0,0,,
Etrum Healthcare Services Ltd,,SCL,Unit 2,"Falcon Gate, Falcon Way, Shire Park",,Welwyn Garden City,,AL7 1TW,,No ratings yet Rate it yourself - /Services/careproviders/LeaveReview/DefaultView.aspx?id=1-13090141860,0,0,,
Shadz Care,,SCL,Unit 2,"Falcon Gate, Falcon Way, Shire Park",,Welwyn Garden City,,AL7 1TW,Tel: 07792748972,No ratings yet Rate it yourself - /Services/careproviders/LeaveReview/DefaultView.aspx?id=1-9017766332,0,0,,
Total Care and Compliance Services,,SCL,26 Bridge Road East,,,Welwyn Garden City,,AL7 1HL,Tel: 07576745894,No ratings yet Rate it yourself - /Services/careproviders/LeaveReview/DefaultView.aspx?id=1-13675882876,0,0,,
MacIntyre Ampthill Support,,SCL,The Old School House,Bedford Road,,Ampthill,Bedfordshire,MK45 2NB,Tel: 01525406501,No ratings yet Rate it yourself - /Services/careproviders/LeaveReview/DefaultView.aspx?id=1-119125988,0,0,,
Integrity Supported Living Ltd,,SCL,"Office 10, Maylands Business Centre",Redbourn Road,,Hemel Hempstead,,HP2 7ES,Tel: 01442508157,No ratings yet Rate it yourself - /Services/careproviders/LeaveReview/DefaultView.aspx?id=1-13167885718,0,0,,
Sodark Care,,SCL,"E9 IMex House, 575-599 Maxted Road",Hemel Hempstead Industrial Estate,,Hemel Hempstead,,HP2 7DX,Tel: 01442767394,No ratings yet Rate it yourself - /Services/careproviders/LeaveReview/DefaultView.aspx?id=1-5593158894,0,0,,
Knightingles Healthcare Bedfordshire Limited,,SCL,Bridge House,27-29 High Street,,Biggleswade,Bedfordshire,SG18 0JE,Tel: 07717064436,1 rating Rate it yourself - /Services/careproviders/LeaveReview/DefaultView.aspx?id=1-4606227639,,,,
Cherish Social Care Ltd,,SCL,GNBC,82 Great North Road,,Hatfield,,AL9 5BL,Tel: 07746387909,No ratings yet Rate it yourself - /Services/careproviders/LeaveReview/DefaultView.aspx?id=1-6447842680,0,0,,
Sylviancare St Albans,,SCL,"2 Fountain Court, Victoria Square",Victoria Street,,St. Albans,,AL1 3TF,Tel: 01727324619,No ratings yet Rate it yourself - /Services/careproviders/LeaveReview/DefaultView.aspx?id=1-15262051287,0,0,,
Sunrise Healthcare Solutions,,SCL,"Office 11B, Innovation House",39 Mark Road,,Hemel Hempstead,,HP2 7DN,Tel: 01442275300,No ratings yet Rate it yourself - /Services/careproviders/LeaveReview/DefaultView.aspx?id=1-12605093209,0,0,,
New Directions - Supported Living,,SCL,Office 5 The Maylands Building,"Maylands Avenue, Hemel Hempstead",,Hemel Hempstead,,HP2 7TG,Tel: 01727811906,No ratings yet Rate it yourself - /Services/careproviders/LeaveReview/DefaultView.aspx?id=1-11344287222,0,0,,
Aspirations Hertfordshire (Outreach),,SCL,"Office 6, Kylna Business Centre",Wood Lane End,,Hemel Hempstead,,HP2 4BF,Tel: 01442531171,No ratings yet Rate it yourself - /Services/careproviders/LeaveReview/DefaultView.aspx?id=1-3257756806,0,0,,
Vow Care Services Ltd,,SCL,30 Larchwood Road,,,Hemel Hempstead,,HP2 5NB,Tel: 01442462249,No ratings yet Rate it yourself - /Services/careproviders/LeaveReview/DefaultView.aspx?id=1-7088514685,0,0,,
NAS Community Services (Hertfordshire),,SCL,"Room G43, Regus Office Breakspear House",Breakspear Way,,Hemel Hempstead,,HP2 4TZ,Tel: 07990540084,No ratings yet Rate it yourself - /Services/careproviders/LeaveReview/DefaultView.aspx?id=1-18317356859,0,0,,
Valley House,,SCL,"Marston Road, Marston Moretaine",,,Bedford,Bedfordshire,MK43 0PP,Tel: 01525840785,No ratings yet Rate it yourself - /Services/careproviders/LeaveReview/DefaultView.aspx?id=1-4538935030,0,0,,
Social Care Solutions Ltd (Herts & Bucks),,SCL,43 Filbert Close,,,Hatfield,,AL10 9SH,Tel: 02072026300,No ratings yet Rate it yourself - /Services/careproviders/LeaveReview/DefaultView.aspx?id=1-4617238417,0,0,,
Zinnia Care Limited,,SCL,25 Marlowes,,,Hemel Hempstead,,HP1 1LA,Tel: 01442234780,No ratings yet Rate it yourself - /Services/careproviders/LeaveReview/DefaultView.aspx?id=1-6571415777,0,0,,
The Marlowes,,SCL,43 Marlowes,,,Hemel Hempstead,,HP1 1GQ,Tel: 01442979790,No ratings yet Rate it yourself - /Services/careproviders/LeaveReview/DefaultView.aspx?id=1-9140099902,0,0,,
Buntingford,,SCL,62 Vicarage Road,,,Buntingford,Hertfordshire,SG9 9BA,Tel: 01763273191,No ratings yet Rate it yourself - /Services/careproviders/LeaveReview/DefaultView.aspx?id=1-1829473970,0,0,,
Care By Us - North London & West Hertfordshire,,SCL,"Ground Floor Office Suite, Brent House","Travellers Lane, Welham Green",,Hatfield,,AL9 7HF,Tel: 02080998276,1 rating Rate it yourself - /Services/careproviders/LeaveReview/DefaultView.aspx?id=1-2176818564,,,,
Herts Homecare,,SCL,123 Lawn Lane,,,Hemel Hempstead,Hertfordshire,HP3 9HS,Tel: 01442213289,No ratings yet Rate it yourself - /Services/careproviders/LeaveReview/DefaultView.aspx?id=1-142623938,0,0,,
MacIntyre Hertfordshire,,SCL,3 Durrants Hill Road,,,Hemel Hempstead,,HP3 9QX,Tel: 01442767040,No ratings yet Rate it yourself - /Services/careproviders/LeaveReview/DefaultView.aspx?id=1-12478413965,0,0,,
Eureka Care Services Limited,,SCL,15 Bull Plain,,,Hertford,,SG14 1DX,Tel: 01992472975,No ratings yet Rate it yourself - /Services/careproviders/LeaveReview/DefaultView.aspx?id=1-4390168127,0,0,,
SGSL Limited,,SCL,Pimlico House,Gascoyne Way,,Hertford,,SG13 8EA,Tel: 01992367246,No ratings yet Rate it yourself - /Services/careproviders/LeaveReview/DefaultView.aspx?id=1-18774009443,0,0,,
Herts at Home,,SCL,County Hall,,,Hertford,,SG13 8DE,Tel: 01438845220,1 rating Rate it yourself - /Services/careproviders/LeaveReview/DefaultView.aspx?id=1-6081792073,,,,
High Street Sandy,,SCL,87 High Street,,,Sandy,Bedfordshire,SG19 1AL,Tel: 01767680325,No ratings yet Rate it yourself - /Services/careproviders/LeaveReview/DefaultView.aspx?id=1-344173174,0,0,,
Aliana House,,SCL,38 Barnet Road,London Colney,,St. Albans,,AL2 1BG,,No ratings yet Rate it yourself - /Services/careproviders/LeaveReview/DefaultView.aspx?id=1-15657407047,0,0,,
Creative Support - Bedford Services,,SCL,Unit B,"Bedford Business Centre, Mile Road",,Bedford,,MK42 9TW,Tel: 01612360829,No ratings yet Rate it yourself - /Services/careproviders/LeaveReview/DefaultView.aspx?id=1-6804247386,0,0,,
Elite Care Services Limited,,SCL,10c Stephenson Court,"Priory Business Park, Fraser Road",,Bedford,,MK44 3WH,Tel: 01234856979,No ratings yet Rate it yourself - /Services/careproviders/LeaveReview/DefaultView.aspx?id=1-1079419560,0,0,,
KS Care,,SCL,Safestore Offices,Elstow Road,,Bedford,,MK42 9QZ,Tel: 01234965583,No ratings yet Rate it yourself - /Services/careproviders/LeaveReview/DefaultView.aspx?id=1-3757447628,0,0,,
Kitec Supported Living,,SCL,"Office B, Elstow Road",Kempston,,Bedford,,MK42 9QZ,,No ratings yet Rate it yourself - /Services/careproviders/LeaveReview/DefaultView.aspx?id=1-16437635737,0,0,,
Lakesyde Care Limited,,SCL,12 Hilton Close,Kempston,,Bedford,,MK42 7FT,Tel: 07927053123,No ratings yet Rate it yourself - /Services/careproviders/LeaveReview/DefaultView.aspx?id=1-11855965974,0,0,,
Dimensions Hertfordshire Domiciliary Care Office,,SCL,Smug Oak House,"Drop Lane, Bricket Wood",,St. Albans,,AL2 3TX,Tel: 07384215578,No ratings yet Rate it yourself - /Services/careproviders/LeaveReview/DefaultView.aspx?id=1-11546163942,0,0,,
Lomack Healthcare,,SCL,162 Bedford Road,Kempston,,Bedford,Bedfordshire,MK42 8BH,Tel: 01234844034,No ratings yet Rate it yourself - /Services/careproviders/LeaveReview/DefaultView.aspx?id=1-108814630,0,0,,
JOINING HANDS HEALTHCARE,,SCL,38 Spring Road,Kempston,,Bedford,,MK42 8LP,Tel: 07501268720,No ratings yet Rate it yourself - /Services/careproviders/LeaveReview/DefaultView.aspx?id=1-11938602010,0,0,,
ivolve West Essex & Hertfordshire Supported Living,,SCL,4 Popis Gardens,King George Road,,Ware,,SG12 7DU,Tel: 07813405067,No ratings yet Rate it yourself - /Services/careproviders/LeaveReview/DefaultView.aspx?id=1-15521798263,0,0,,
FirstCare-Bedfordshire & MK,,SCL,"3rd Floor, Howard House 40-64",St. Johns Street,,Bedford,,MK42 0DJ,Tel: 07789925287,No ratings yet Rate it yourself - /Services/careproviders/LeaveReview/DefaultView.aspx?id=1-291683646,0,0,,
FÉ Care,,SCL,"5 Brickhill Manor Court, Watling Street",Little Brickhill,,Milton Keynes,,MK17 9LN,Tel: 07590019509,1 rating Rate it yourself - /Services/careproviders/LeaveReview/DefaultView.aspx?id=1-9414449474,,,,
Cordial Support Limited,,SCL,"Alperton House, 18 Hartwell Drive",Kempston,,Bedford,,MK42 8UY,Tel: 07400440865,No ratings yet Rate it yourself - /Services/careproviders/LeaveReview/DefaultView.aspx?id=1-12636378378,0,0,,
SGSL Limited,,SCL,Bedford Office,"Suite 5 Marks Mews2, Castle Lane",,Bedford,,MK40 3US,Tel: 07484090136,No ratings yet Rate it yourself - /Services/careproviders/LeaveReview/DefaultView.aspx?id=1-18774009091,0,0,,
Macadamia Support,,SCL,8 Ballinghall Close,,,Bedford,,MK41 0AB,Tel: 01234962689,No ratings yet Rate it yourself - /Services/careproviders/LeaveReview/DefaultView.aspx?id=1-2519058765,0,0,,
LightBulb Bespoke Care,,SCL,"Broadway House, First Floor B",4-6 The Broadway,,Bedford,,MK40 2TE,Tel: 07837870921,No ratings yet Rate it yourself - /Services/careproviders/LeaveReview/DefaultView.aspx?id=1-6786668958,0,0,,
Line Of Sight Care Limited,,SCL,Ground Floor,57 Harpur Street,,Bedford,,MK40 2SR,Tel: 01234 910030,2 ratings Rate it yourself - /Services/careproviders/LeaveReview/DefaultView.aspx?id=1-5412411727,,,,
Merit Support Solutions - Main Office,,SCL,44 Harpur Street,,,Bedford,Bedfordshire,MK40 2QT,,No ratings yet Rate it yourself - /Services/careproviders/LeaveReview/DefaultView.aspx?id=1-13910917399,0,0,,
Symbiosis House,,SCL,"Unit 3, Trinity Gardens",9-11 Bromham Road,,Bedford,,MK40 2BP,Tel: 03330144066,No ratings yet Rate it yourself - /Services/careproviders/LeaveReview/DefaultView.aspx?id=1-9116350495,0,0,,
Lillibet Court,,SCL,50 De Parys Avenue,,,Bedford,Bedfordshire,MK40 2TP,Tel: 01234212282,No ratings yet Rate it yourself - /Services/careproviders/LeaveReview/DefaultView.aspx?id=1-7048849778,0,0,,
Precious Homes Limited,,SCL,Unit 4,Bradbourne Drive,,Milton Keynes,,MK7 8BN,,No ratings yet Rate it yourself - /Services/careproviders/LeaveReview/DefaultView.aspx?id=1-14279108155,0,0,,
Hertfordshire Supported Living Services,,SCL,25 Cheshire Drive,Leavesden,,Watford,Hertfordshire,WD25 7GP,Tel: 01923662411,No ratings yet Rate it yourself - /Services/careproviders/LeaveReview/DefaultView.aspx?id=1-130597308,0,0,,
Woodhurst,,SCL,88 Woodhurst Avenue,,,Watford,Hertfordshire,WD25 9RW,Tel: 01923675546,No ratings yet Rate it yourself - /Services/careproviders/LeaveReview/DefaultView.aspx?id=1-1977199841,0,0,,
Warwick Manor,,SCL,101 Warwick Avenue,,,Bedford,,MK40 2DH,Tel: 01234630052,No ratings yet Rate it yourself - /Services/careproviders/LeaveReview/DefaultView.aspx?id=1-9018323988,0,0,,
Luna Care Services,,SCL,"Acorn Suite 10, Greenleaf House",Darkes Lane,,Potters Bar,,EN6 1AE,Tel: 01707502004,No ratings yet Rate it yourself - /Services/careproviders/LeaveReview/DefaultView.aspx?id=1-8181112485,0,0,,
One Step Domiciliary Care,,SCL,Metropolitan House,3 Darkes Lane,,Potters Bar,Hertfordshire,EN6 1AG,,No ratings yet Rate it yourself - /Services/careproviders/LeaveReview/DefaultView.aspx?id=1-18315230676,0,0,,
Hillside,,SCL,3 & 4 Hillside Crescent,Stanstead Abbotts,,Ware,,SG12 8BQ,Tel: 02073915174,No ratings yet Rate it yourself - /Services/careproviders/LeaveReview/DefaultView.aspx?id=1-6915965688,0,0,,
Careville Limited,,SCL,UNIT 328 Bedford Heights,Brickhill Drive,,Bedford,,MK41 7PH,Tel: 03335773351,No ratings yet Rate it yourself - /Services/careproviders/LeaveReview/DefaultView.aspx?id=1-5579596853,0,0,,
Social Care Solutions Ltd (Bedfordshire),,SCL,"Unit 303, Bedford Heights",Manton Lane,,Bedford,Bedfordshire,MK41 7PH,Tel: 01234262650,No ratings yet Rate it yourself - /Services/careproviders/LeaveReview/DefaultView.aspx?id=1-4202089220,0,0,,