Organisation Name,NACS Code,Organisation Type,Address1,Address2,Address3,Address4,Address5,PostCode,Telephone Number,NHS.UK users rating,Value  (NHS.UK users rating),Banding Classification  (NHS.UK users rating),Car parking (Is there car parking at this organisation?),Disabled access (Disabled access)
Mountsview Homes,,SCL,47 Desmond Street,,,London,,SE14 6JA,,No ratings yet Rate it yourself - /Services/careproviders/LeaveReview/DefaultView.aspx?id=1-18243575099,0,0,,
Three C's Support,,SCL,Unit 4,"82-84, Childers Street",,London,,SE8 5FS,,No ratings yet Rate it yourself - /Services/careproviders/LeaveReview/DefaultView.aspx?id=1-4826424113,0,0,,
Assured Healthcare Limited,,SCL,30 Wagner Street,,,London,,SE15 1NN,Tel: 07985373246,No ratings yet Rate it yourself - /Services/careproviders/LeaveReview/DefaultView.aspx?id=1-15321217985,0,0,,
Aurora Options,,SCL,Unit 3 California Building,Deals Gateway,,London,,SE13 7SB,Tel: 0208498103,No ratings yet Rate it yourself - /Services/careproviders/LeaveReview/DefaultView.aspx?id=1-13420339116,0,0,,
First Connect Healthcare Ltd,,SCL,1 Hooks Close,,,London,,SE15 2TP,,No ratings yet Rate it yourself - /Services/careproviders/LeaveReview/DefaultView.aspx?id=1-16378409964,0,0,,
Living Spring Solutions (Care & Training) Ltd,,SCL,"River View Office, Unit 1",Greenwich Quay,,London,,SE8 3EY,Tel: 020 3417 0405,No ratings yet Rate it yourself - /Services/careproviders/LeaveReview/DefaultView.aspx?id=1-2491149075,0,0,,
Mawii Home Care Limited,,SCL,Romer House,132 Lewisham High Street,,London,,SE13 6EE,Tel: 02039848477,No ratings yet Rate it yourself - /Services/careproviders/LeaveReview/DefaultView.aspx?id=1-6193098257,0,0,,
HDH Care and Support,,SCL,"Romer House, Ist Floor",132 Lewisham High Street,,London,,SE13 6EE,Tel: 02030924845,No ratings yet Rate it yourself - /Services/careproviders/LeaveReview/DefaultView.aspx?id=1-10153499805,0,0,,
Jome Healthcare,,SCL,Romer House,132 Lewisham High Street,,London,,SE13 6EE,Tel: 02030924672,No ratings yet Rate it yourself - /Services/careproviders/LeaveReview/DefaultView.aspx?id=1-11915657295,0,0,,
Bluefield Care Services,,SCL,282 Lewisham High Street,,,London,,SE13 6JZ,Tel: 02086900005,1 rating Rate it yourself - /Services/careproviders/LeaveReview/DefaultView.aspx?id=1-3492776865,,,,
"Brockley, London",,SCL,95 Ewhurst Road,"Crofton Park, Brockley",,London,,SE4 1SD,,No ratings yet Rate it yourself - /Services/careproviders/LeaveReview/DefaultView.aspx?id=1-9595952459,0,0,,
Central Support Ltd,,SCL,2 Harbinger Road,,,London,,E14 3AA,Tel: 07984763353,No ratings yet Rate it yourself - /Services/careproviders/LeaveReview/DefaultView.aspx?id=1-18463657875,0,0,,
Nomase Care Ltd,,SCL,"Ivy House, First Floor",Bradgate Road,,London,,SE6 4TT,Tel: 02037509722,3 ratings Rate it yourself - /Services/careproviders/LeaveReview/DefaultView.aspx?id=1-2418462505,,,,
Bio Luminuex Health Care Limited,,SCL,Docklands Business Centre,10-16 Tiller Road,,London,,E14 8PX,Tel: 02032913906,No ratings yet Rate it yourself - /Services/careproviders/LeaveReview/DefaultView.aspx?id=1-4054170060,0,0,,
Lewisham Nexus Service,,SCL,84-86 Rushey Green,Catford,,London,,SE6 4HW,Tel: 02086139965,No ratings yet Rate it yourself - /Services/careproviders/LeaveReview/DefaultView.aspx?id=1-123154158,0,0,,
Advanced Care and Support in the Community,,SCL,18 Boone Street,Lee High Road,,London,,SE13 5SB,Tel: 02083189107,No ratings yet Rate it yourself - /Services/careproviders/LeaveReview/DefaultView.aspx?id=1-122655443,0,0,,
Townley Road,,SCL,2-3 Townley Road,,,London,,SE22 8SW,Tel: 02086935449,No ratings yet Rate it yourself - /Services/careproviders/LeaveReview/DefaultView.aspx?id=1-9672526789,0,0,,
Verve Homecare Ltd,,SCL,Exchange Tower,1 Harbour Exchange Square,,London,,E14 9GE,Tel: 02072230000,No ratings yet Rate it yourself - /Services/careproviders/LeaveReview/DefaultView.aspx?id=1-13886269735,0,0,,
Beechcroft Care Ltd,,SCL,182A Denmark Hill,,,London,,SE5 8EE,Tel: 07367067572,No ratings yet Rate it yourself - /Services/careproviders/LeaveReview/DefaultView.aspx?id=1-18026916935,0,0,,
Bleep 360 Care Canary Wharf,,SCL,30 Churchill Place,We Work,,London,,E14 5RE,,No ratings yet Rate it yourself - /Services/careproviders/LeaveReview/DefaultView.aspx?id=1-13038295800,0,0,,
Access for Living,,SCL,Unit 9 Southbrook Mews,"Southbrook Road, Lee",,London,,SE12 8LG,Tel: 02082976659,No ratings yet Rate it yourself - /Services/careproviders/LeaveReview/DefaultView.aspx?id=1-112291724,0,0,,
Mary Jones Court,,SCL,6 Garford Street,Westferry,,London,,E14 8JQ,Tel: 02075157300,No ratings yet Rate it yourself - /Services/careproviders/LeaveReview/DefaultView.aspx?id=1-347806712,0,0,,
VIDA Supported Living - London,,SCL,3 More,London Riverside,,London,,SE1 2RE,Tel: 02039101460,No ratings yet Rate it yourself - /Services/careproviders/LeaveReview/DefaultView.aspx?id=1-17716386282,0,0,,
Hervey Road,,SCL,66 Hervey Road,,,London,,SE3 8BS,Tel: 02088564553,No ratings yet Rate it yourself - /Services/careproviders/LeaveReview/DefaultView.aspx?id=1-9661628327,0,0,,
Creative Support - Sue Starkey House & Shipton House,,SCL,Sue Starkey House,6 West Arbour Street,,London,,E1 0FB,Tel: 07817460325,No ratings yet Rate it yourself - /Services/careproviders/LeaveReview/DefaultView.aspx?id=1-2326318021,0,0,,
The Tower Project - Indigo Mews,,SCL,"13 Indigo Mews, Ashton Street",,,London,,E14 9PN,,No ratings yet Rate it yourself - /Services/careproviders/LeaveReview/DefaultView.aspx?id=1-15539615205,0,0,,
Transforming Support (Coulsdon),,SCL,New City Court,20 St. Thomas Street,,London,,SE1 9RS,Tel: 03033003000,No ratings yet Rate it yourself - /Services/careproviders/LeaveReview/DefaultView.aspx?id=1-18174788241,0,0,,
Secure Care London Ltd,,SCL,Alpha House,100 Borough High Street,,London,,SE1 1LB,Tel: 07939369898,No ratings yet Rate it yourself - /Services/careproviders/LeaveReview/DefaultView.aspx?id=1-17411315387,0,0,,
Serenity Integrated Care,,SCL,"Nile Business Centre, Second Floor, Room No. 214",60 Nelson Street,,London,,E1 2DE,Tel: 07957565164,No ratings yet Rate it yourself - /Services/careproviders/LeaveReview/DefaultView.aspx?id=1-3783795171,0,0,,
Health Personnel,,SCL,"Office C116, Meridian Trading Estate",20 Bugsby's Way,,London,,SE7 7SJ,Tel: 03335771755,No ratings yet Rate it yourself - /Services/careproviders/LeaveReview/DefaultView.aspx?id=1-2385182469,0,0,,
Garland Lodge,,SCL,"Unit 1, Meridian Trading Estate",20 Bugsby's Way,,London,,SE7 7SJ,,No ratings yet Rate it yourself - /Services/careproviders/LeaveReview/DefaultView.aspx?id=1-7608868802,0,0,,
New Beginnings Care Services Limited,,SCL,4 Charlton Dene,,,London,,SE7 7BZ,Tel: 02088569991,No ratings yet Rate it yourself - /Services/careproviders/LeaveReview/DefaultView.aspx?id=1-11680033807,0,0,,
Global Healthcare Limited,,SCL,"Unit 6, 80a Ashfield Street",,,London,,E1 2BJ,Tel: 02034881059,No ratings yet Rate it yourself - /Services/careproviders/LeaveReview/DefaultView.aspx?id=1-17715492184,0,0,,
Golden Key Support Ltd,,SCL,93-101 Greenfield Road,,,London,,E1 1EJ,Tel: 02036897015,No ratings yet Rate it yourself - /Services/careproviders/LeaveReview/DefaultView.aspx?id=1-2420902049,0,0,,
Ramah Ker Services Ltd,,SCL,Unit BB46,"The Link, 49 Effra Road",,London,,SW2 1BZ,Tel: 07735479207,No ratings yet Rate it yourself - /Services/careproviders/LeaveReview/DefaultView.aspx?id=1-14684729467,0,0,,
Hazelhurst Court,,SCL,Hazelhurst Court,Melfield Gardens,,London,,SE6 3DT,Tel: 02080175525,No ratings yet Rate it yourself - /Services/careproviders/LeaveReview/DefaultView.aspx?id=1-15123326371,0,0,,
Yellowstone Healthcare Ltd,,SCL,"Unit G12, Waterfront Studios Business Centre",1 Dock Road,,London,,E16 1AG,Tel: 02038769258,No ratings yet Rate it yourself - /Services/careproviders/LeaveReview/DefaultView.aspx?id=1-4341131778,0,0,,
JS Care Agency,,SCL,G30b Expressway,1 Dock Road,,London,,E16 1AH,Tel: 02084704219,No ratings yet Rate it yourself - /Services/careproviders/LeaveReview/DefaultView.aspx?id=1-4726779082,0,0,,
Creative Support - Duncan Court,,SCL,88 Teviot Street,,,London,,E14 6PX,Tel: 02075380297,No ratings yet Rate it yourself - /Services/careproviders/LeaveReview/DefaultView.aspx?id=1-2634727056,0,0,,
Clarion Health Ltd,,SCL,63 St. Mary Axe,,,London,,EC3A 8AA,Tel: 07533371155,No ratings yet Rate it yourself - /Services/careproviders/LeaveReview/DefaultView.aspx?id=1-16465962094,0,0,,
Together for Mental Wellbeing Supported Living Branch,,SCL,52 Walnut Tree Walk,,,London,,SE11 6DN,Tel: 02077807300,No ratings yet Rate it yourself - /Services/careproviders/LeaveReview/DefaultView.aspx?id=1-368178527,0,0,,
Devoted Butterfly Ltd,,SCL,Unit 27 Links Yard,Spelman Street,,London,,E1 5LX,Tel: 07961795534,No ratings yet Rate it yourself - /Services/careproviders/LeaveReview/DefaultView.aspx?id=1-14334842334,0,0,,
Westminster Bridge Road,,SCL,Ground Floor,100 Westminster Bridge Road,,London,,SE1 7XA,Tel: 02072614100,No ratings yet Rate it yourself - /Services/careproviders/LeaveReview/DefaultView.aspx?id=1-15199313488,0,0,,
CareTech South East Supported Living,,SCL,44 Chestnut Road,,,London,,SE27 9LF,,No ratings yet Rate it yourself - /Services/careproviders/LeaveReview/DefaultView.aspx?id=1-7059929908,0,0,,
Rathbone Outreach Service,,SCL,8 Chatsworth Way,8 Chatsworth Way,,London,,SE27 9HR,,No ratings yet Rate it yourself - /Services/careproviders/LeaveReview/DefaultView.aspx?id=1-109913358,0,0,,
Transforming Support (South London),,SCL,36-37 Albert Embankment,,,London,,SE1 7TL,Tel: 03033003000,No ratings yet Rate it yourself - /Services/careproviders/LeaveReview/DefaultView.aspx?id=1-18174111815,0,0,,
L'Arche London,,SCL,9-13 Norwood High Street,West Norwood,,London,,SE27 9JU,Tel: 02086706714,No ratings yet Rate it yourself - /Services/careproviders/LeaveReview/DefaultView.aspx?id=1-3984596263,0,0,,
Inspire Support Workers,,SCL,New Charlton Community Centre,217 Maryon Road,,London,,SE7 8DB,Tel: 02030048488,No ratings yet Rate it yourself - /Services/careproviders/LeaveReview/DefaultView.aspx?id=1-4236756354,0,0,,
Lester Court,,SCL,27 Bruce Road,,,London,,E3 3HN,Tel: 02034864226,No ratings yet Rate it yourself - /Services/careproviders/LeaveReview/DefaultView.aspx?id=1-6915425867,0,0,,
Brockwell Care,,SCL,1-4 Brixton Hill Place,,,London,,SW2 1HJ,Tel: 02086785944,No ratings yet Rate it yourself - /Services/careproviders/LeaveReview/DefaultView.aspx?id=1-996882727,0,0,,
Nimrod House Supported Living,,SCL,11 Vanguard Close,Butchers Road,,London,,E16 1PN,Tel: 02070554833,No ratings yet Rate it yourself - /Services/careproviders/LeaveReview/DefaultView.aspx?id=1-2702323158,0,0,,
Sutton,,SCL,243-247 Beckenham Road,,,Beckenham,Kent,BR3 4RP,Tel: 01622722400,No ratings yet Rate it yourself - /Services/careproviders/LeaveReview/DefaultView.aspx?id=1-15199313358,0,0,,
Edward Gibbons House,,SCL,Flat 1 Edward Gibbons House,Parmiter Street,,London,,E2 9NG,Tel: 020 8983 1983,2 ratings Rate it yourself - /Services/careproviders/LeaveReview/DefaultView.aspx?id=1-1162640335,,,,
Top-Notch Healthcare Services Limited,,SCL,25 Croombs Road,,,London,,E16 3RN,Tel: 07733404144,No ratings yet Rate it yourself - /Services/careproviders/LeaveReview/DefaultView.aspx?id=1-8600541701,0,0,,
Provider24/7 Limited,,SCL,25 Croombs Road,,,London,,E16 3RN,,No ratings yet Rate it yourself - /Services/careproviders/LeaveReview/DefaultView.aspx?id=1-15075915721,0,0,,
Tower Project,,SCL,79 Fulmer Road,,,London,,E16 3TE,Tel: 02075117579,No ratings yet Rate it yourself - /Services/careproviders/LeaveReview/DefaultView.aspx?id=1-8463586395,0,0,,
Ceibraxs Care Agency,,SCL,108 Waddington Way,,,London,,SE19 3UA,Tel: 02037949599,3 ratings Rate it yourself - /Services/careproviders/LeaveReview/DefaultView.aspx?id=1-12578509617,,,,
Bluedrive Care Homes,,SCL,18-36 Wellington Street,Woolwich,,London,,SE18 6PF,Tel: 07787176638,No ratings yet Rate it yourself - /Services/careproviders/LeaveReview/DefaultView.aspx?id=1-6051818728,0,0,,
Warminster Road,,SCL,2 Warminster Road,South Norwood,,London,,SE25 4DZ,Tel: 02087716284,No ratings yet Rate it yourself - /Services/careproviders/LeaveReview/DefaultView.aspx?id=1-9672527284,0,0,,
21 Hartsworth Close,,SCL,21 Hartsworth Close,,,London,,E13 0TD,Tel: 07305885806,No ratings yet Rate it yourself - /Services/careproviders/LeaveReview/DefaultView.aspx?id=1-15357785654,0,0,,
Avenue Road,,SCL,14 Avenue Road,South Norwood,,London,,SE25 4EA,Tel: 02089163247,No ratings yet Rate it yourself - /Services/careproviders/LeaveReview/DefaultView.aspx?id=1-9649168827,0,0,,
Liaise (London) Supported Living,,SCL,69 Bloomfield Road,,,London,,SE18 7JN,,No ratings yet Rate it yourself - /Services/careproviders/LeaveReview/DefaultView.aspx?id=1-4826754539,0,0,,
Newlink Care Services,,SCL,"Equitable House, Ground Floor","Unit 6, 7 General Gordon Square",,London,,SE18 6FH,,No ratings yet Rate it yourself - /Services/careproviders/LeaveReview/DefaultView.aspx?id=1-8828212947,0,0,,
Alters Recruitment Limited t/a Alters Nursing - London,,SCL,4 Church Street,Stratford,,London,,E15 3HX,Tel: 02082791515,No ratings yet Rate it yourself - /Services/careproviders/LeaveReview/DefaultView.aspx?id=1-127105530,0,0,,
Islington Council Supported Living Service for Adults with Learning Disabilities,,SCL,14A Arlington Square,,,London,,N1 7DR,Tel: 02075271811,No ratings yet Rate it yourself - /Services/careproviders/LeaveReview/DefaultView.aspx?id=1-4678566272,0,0,,
Woodside Court Supported Living,,SCL,21 Lancaster Road,,,London,,SE25 4BJ,Tel: 02032520052,No ratings yet Rate it yourself - /Services/careproviders/LeaveReview/DefaultView.aspx?id=1-546365716,0,0,,
Streatham,,SCL,223 Streatham High Road,,,London,,SW16 6EN,Tel: 02086773333,No ratings yet Rate it yourself - /Services/careproviders/LeaveReview/DefaultView.aspx?id=1-5605130305,0,0,,
St Martins of Tours Housing - 158-162 New North Road,,SCL,158-162 New North Road,,,London,,N1 7BH,Tel: 02077049786,No ratings yet Rate it yourself - /Services/careproviders/LeaveReview/DefaultView.aspx?id=1-112849219,0,0,,
Enriched Lives Limited - Main Office,,SCL,Commercial House,2/2a Newman Road,,Bromley,,BR1 1RJ,,No ratings yet Rate it yourself - /Services/careproviders/LeaveReview/DefaultView.aspx?id=1-18392555751,0,0,,
National Care Holdings Limited,,SCL,10 The Mound,,,London,,SE9 3AZ,Tel: 07572333293,No ratings yet Rate it yourself - /Services/careproviders/LeaveReview/DefaultView.aspx?id=1-6875309146,0,0,,
Marigold Care Group Ltd,,SCL,14 Little Dimocks,,,London,,SW12 9JJ,Tel: 07446323937,No ratings yet Rate it yourself - /Services/careproviders/LeaveReview/DefaultView.aspx?id=1-13513401606,0,0,,
CarePlus Healthcare Services,,SCL,Citibase,"9-11 Gunnery Terrace,",,London,,SE18 6SW,Tel: 08006696712,No ratings yet Rate it yourself - /Services/careproviders/LeaveReview/DefaultView.aspx?id=1-13330595475,0,0,,
Avant-Garde Services Limited,,SCL,9-11 Gunnery Terrace,Cornwallis Road,,London,,SE18 6SW,Tel: 02039252764,No ratings yet Rate it yourself - /Services/careproviders/LeaveReview/DefaultView.aspx?id=1-8582929885,0,0,,
Bridge Cross Care Ltd,,SCL,"First Floor, 9-11 Gunnery Terrace Royal Arsenal",Woolwich,,London,,SE18 6SW,Tel: 02039257951,No ratings yet Rate it yourself - /Services/careproviders/LeaveReview/DefaultView.aspx?id=1-7264103394,0,0,,
Prime & Passionate Healthcare Ltd,,SCL,9-11 Gunnery Terrace,Cornwallis Road,,London,,SE18 6SW,Tel: 02037730583,No ratings yet Rate it yourself - /Services/careproviders/LeaveReview/DefaultView.aspx?id=1-8774214555,0,0,,
J.C.Michael Groups Ltd Stratford,,SCL,65 Broadway,,,London,,E15 4BQ,Tel: 02085144462,1 rating Rate it yourself - /Services/careproviders/LeaveReview/DefaultView.aspx?id=1-2223386681,,,,
"London Borough of Hackney, Housing with Care",,SCL,Hackney Service Centre,"1 Hillman Street, Hackney",,London,,E8 1DY,Tel: 02083564864,No ratings yet Rate it yourself - /Services/careproviders/LeaveReview/DefaultView.aspx?id=1-136277108,0,0,,
Immediate Social Care Limited,,SCL,30C Acton Street,,,London,,WC1X 9NE,Tel: 02086380778,No ratings yet Rate it yourself - /Services/careproviders/LeaveReview/DefaultView.aspx?id=1-650238255,0,0,,
SENSE - South East Supported Living Services,,SCL,101 Pentonville Road,Kings Cross,,London,,N1 9LG,Tel: 03003309250,No ratings yet Rate it yourself - /Services/careproviders/LeaveReview/DefaultView.aspx?id=1-1648725751,0,0,,
Akos Care Limited,,SCL,82b,Eastway,,London,,E9 5JF,Tel: 07961751566,No ratings yet Rate it yourself - /Services/careproviders/LeaveReview/DefaultView.aspx?id=1-12471853830,0,0,,
Mondonovo Care Limited,,SCL,"Unit B2, 62 Beechwood Road",Hackney,,London,,E8 3DY,Tel: 07467710336,No ratings yet Rate it yourself - /Services/careproviders/LeaveReview/DefaultView.aspx?id=1-6383116359,0,0,,
Almond Care Providers Ltd,,SCL,31 Burgoyne Road,,,London,,SE25 6JT,Tel: 02030920575,2 ratings Rate it yourself - /Services/careproviders/LeaveReview/DefaultView.aspx?id=1-1191183747,,,,
London and South East Domiciliary Care Branch (Learning Disability),,SCL,"Office No. 29, Kingfisher House Business Centre",21-23 Elmfield Road,,Bromley,,BR1 1LT,Tel: 02085023933,No ratings yet Rate it yourself - /Services/careproviders/LeaveReview/DefaultView.aspx?id=1-1839972206,0,0,,
London & South East Domiciliary Care Branch (Mental Health),,SCL,"Office No. 29, Kingfisher House Business Centre",21-23 Elmfield Road,,Bromley,,BR1 1LT,Tel: 02083139725,No ratings yet Rate it yourself - /Services/careproviders/LeaveReview/DefaultView.aspx?id=1-3040078062,0,0,,
Southside Partnership Domiciliary Care Agency,,SCL,31-33 Lumiere Court,209 Balham High Road,,London,,SW17 7BQ,Tel: 02087726222,No ratings yet Rate it yourself - /Services/careproviders/LeaveReview/DefaultView.aspx?id=1-117373860,0,0,,
Yarrow Domiciliary Care Agency,,SCL,31-33 Lumiere Court,209 Balham High Road,,London,,SW17 7BQ,Tel: 02087354600,No ratings yet Rate it yourself - /Services/careproviders/LeaveReview/DefaultView.aspx?id=1-136010893,0,0,,
Rooted Homecare,,SCL,1 Elmfield Park,,,Bromley,,BR1 1LU,,No ratings yet Rate it yourself - /Services/careproviders/LeaveReview/DefaultView.aspx?id=1-16371917836,0,0,,
KJD Care,,SCL,97 Whitehorse Lane,,,London,,SE25 6RA,Tel: 02071014360,No ratings yet Rate it yourself - /Services/careproviders/LeaveReview/DefaultView.aspx?id=1-5153664905,0,0,,
Battersea Place Retirement Village Limited,,SCL,73 Albert Bridge Road,Battersea,,London,,SW11 4DS,Tel: 07745649051,No ratings yet Rate it yourself - /Services/careproviders/LeaveReview/DefaultView.aspx?id=1-2525654037,0,0,,
Vista Care,,SCL,Suite 3,119 The Grove,,London,,E15 1EN,Tel: 02033276431,No ratings yet Rate it yourself - /Services/careproviders/LeaveReview/DefaultView.aspx?id=1-12155847617,0,0,,
Norbury Avenue,,SCL,4 Norbury Avenue,,,Thornton Heath,Surrey,CR7 8AA,Tel: 02086537134,No ratings yet Rate it yourself - /Services/careproviders/LeaveReview/DefaultView.aspx?id=1-9668348970,0,0,,
SLS Outreach,,SCL,49 Waddington Road,,,London,,E15 1QL,Tel: 02036377590,1 rating Rate it yourself - /Services/careproviders/LeaveReview/DefaultView.aspx?id=1-12562379517,,,,
Social Care 4U,,SCL,4 Downs Court Parade,Amhurst Road,,London,,E8 2AQ,Tel: 02089867722,No ratings yet Rate it yourself - /Services/careproviders/LeaveReview/DefaultView.aspx?id=1-128649142,0,0,,
Niorgrey Health Care Limited,,SCL,"Ibex House, Unit 7","1C Maryland Park, Stratford",,London,,E15 1HR,Tel: 07904603217,No ratings yet Rate it yourself - /Services/careproviders/LeaveReview/DefaultView.aspx?id=1-15069672235,0,0,,
Transform,,SCL,44,Plumstead High Street,,London,,SE18 1SL,Tel: 07472531133,No ratings yet Rate it yourself - /Services/careproviders/LeaveReview/DefaultView.aspx?id=1-13775130357,0,0,,
Divine Care And Services Limited,,SCL,Unit 1-106,106 Plumstead High Street,,London,,SE18 1DU,Tel: 02030917044,No ratings yet Rate it yourself - /Services/careproviders/LeaveReview/DefaultView.aspx?id=1-13394864094,0,0,,
London Supported Living Services,,SCL,St. Richards House,110 Eversholt Street,,London,,NW1 1BS,Tel: 02072845450,No ratings yet Rate it yourself - /Services/careproviders/LeaveReview/DefaultView.aspx?id=1-130597324,0,0,,
ASTONISHING CARE LIMITED,,SCL,246-250,Romford Road,,London,,E7 9HZ,Tel: 02036336980,No ratings yet Rate it yourself - /Services/careproviders/LeaveReview/DefaultView.aspx?id=1-18444135880,0,0,,
D&M Supported Living Limited,,SCL,4 Ruddington Close,,,London,,E5 0SR,Tel: 07438789671,No ratings yet Rate it yourself - /Services/careproviders/LeaveReview/DefaultView.aspx?id=1-16408570137,0,0,,
Advance Newham Domiciliary Care and Supported Living Services,,SCL,Flat 1,"Springtail Court 94d, Earlham Grove",,London,,E7 9AR,Tel: 07882100602,No ratings yet Rate it yourself - /Services/careproviders/LeaveReview/DefaultView.aspx?id=1-14857824503,0,0,,
Voug Care,,SCL,40,Homesdale Road,,Bromley,,BR2 9LD,Tel: 02084607468,No ratings yet Rate it yourself - /Services/careproviders/LeaveReview/DefaultView.aspx?id=1-14808116929,0,0,,
Homesdale Supported Living,,SCL,30 Homesdale Road,,,Bromley,,BR2 9LD,Tel: 02082492902,No ratings yet Rate it yourself - /Services/careproviders/LeaveReview/DefaultView.aspx?id=1-11296003795,0,0,,
Klearwater Adult Services Limited,,SCL,43 Leander Road,,,Thornton Heath,Surrey,CR7 6JY,Tel: 02086832960,No ratings yet Rate it yourself - /Services/careproviders/LeaveReview/DefaultView.aspx?id=1-304292774,0,0,,
Gordon Care Services Limited,,SCL,Heron House,2 Heigham Road,,London,,E6 2JG,Tel: 07951950183,No ratings yet Rate it yourself - /Services/careproviders/LeaveReview/DefaultView.aspx?id=1-2274402758,0,0,,
Domiciliary Care Agency Surrey,,SCL,John Morris House Community Centre,"164 St Johns Hill, Battersea",,London,,SW11 1SW,Tel: 07458127283,No ratings yet Rate it yourself - /Services/careproviders/LeaveReview/DefaultView.aspx?id=1-13562441189,0,0,,
Parkhill Support Services Main Road,,SCL,263 Main Road,,,Sidcup,Kent,DA14 6QL,Tel: 02083025848,No ratings yet Rate it yourself - /Services/careproviders/LeaveReview/DefaultView.aspx?id=1-8495598391,0,0,,
St Nicholas Glebe,,SCL,6 St. Nicholas Glebe,Rectory Lane,,London,,SW17 9QH,Tel: 02087670071,No ratings yet Rate it yourself - /Services/careproviders/LeaveReview/DefaultView.aspx?id=1-9671158985,0,0,,
Supported Living,,SCL,397 Sydenham Road,,,Croydon,,CR0 2EH,Tel: 02086112597,No ratings yet Rate it yourself - /Services/careproviders/LeaveReview/DefaultView.aspx?id=1-8827294716,0,0,,
Gideon Supported Housing Limited,,SCL,2 High Tor View,,,London,,SE28 0LN,Tel: 02037236067,No ratings yet Rate it yourself - /Services/careproviders/LeaveReview/DefaultView.aspx?id=1-1916394453,0,0,,
Belleview,,SCL,167 Brigstock Road,Thornton Heath,,Croydon,Surrey,CR7 7JP,Tel: 02086658228,No ratings yet Rate it yourself - /Services/careproviders/LeaveReview/DefaultView.aspx?id=1-479248171,0,0,,
"Brandon Trust Supported Living - Trident Business Centre, Tooting",,SCL,89 Bickersteth Road,Tooting,,London,,SW17 9SH,Tel: 01452886307,No ratings yet Rate it yourself - /Services/careproviders/LeaveReview/DefaultView.aspx?id=1-4305903260,0,0,,
Creative Support - Melody Road,,SCL,Poplar House,"126a, Melody Road",,London,,SW18 2BF,Tel: 07976915989,No ratings yet Rate it yourself - /Services/careproviders/LeaveReview/DefaultView.aspx?id=1-9554124815,0,0,,
Trinity Community Centre,,SCL,East Avenue,,,London,,E12 6SG,,No ratings yet Rate it yourself - /Services/careproviders/LeaveReview/DefaultView.aspx?id=1-643383866,0,0,,
Phebdan HealthCare Services Limited,,SCL,10 Smock Walk,,,Croydon,,CR0 2UP,Tel: 07903832504,No ratings yet Rate it yourself - /Services/careproviders/LeaveReview/DefaultView.aspx?id=1-6340940895,0,0,,
Josak Care and Recruitment Ltd,,SCL,Square Root Business Centre,102-116 Windmill Road,,Croydon,Surrey,CR0 2XQ,Tel: 07803771001,No ratings yet Rate it yourself - /Services/careproviders/LeaveReview/DefaultView.aspx?id=1-9882724195,0,0,,