Organisation Name,NACS Code,Organisation Type,Address1,Address2,Address3,Address4,Address5,PostCode,Telephone Number,NHS.UK users rating,Value  (NHS.UK users rating),Banding Classification  (NHS.UK users rating),Car parking (Is there car parking at this organisation?),Disabled access (Disabled access)
Support for Living Domiciliary Care Agency,,SCL,8th Floor CP House,97-107 Uxbridge Road,,London,,W5 5TL,Tel: 02087726222,No ratings yet Rate it yourself - /Services/careproviders/LeaveReview/DefaultView.aspx?id=1-299438034,0,0,,
Ealing Service,,SCL,71-75 Uxbridge Road,,,London,,W5 5SL,Tel: 07498591420,No ratings yet Rate it yourself - /Services/careproviders/LeaveReview/DefaultView.aspx?id=1-17841000025,0,0,,
Ascend Support (Ealing),,SCL,Aurora House 71-75,Uxbridge Road,,London,,W5 5SL,Tel: 03304706115,No ratings yet Rate it yourself - /Services/careproviders/LeaveReview/DefaultView.aspx?id=1-18175820296,0,0,,
Betham Support Living Ltd,,SCL,64 Betham Road,,,Greenford,,UB6 8RZ,Tel: 02045375769,No ratings yet Rate it yourself - /Services/careproviders/LeaveReview/DefaultView.aspx?id=1-16121092397,0,0,,
Lotus Community Care Service,,SCL,193 Somerset Road,,,Southall,,UB1 2UQ,Tel: 07884488873,2 ratings Rate it yourself - /Services/careproviders/LeaveReview/DefaultView.aspx?id=1-7880376745,,,,
Nisacraftcare,,SCL,27 - 28 Continental House,497 Sunleigh Road,,Wembley,,HA0 4LY,Tel: 02087338227,No ratings yet Rate it yourself - /Services/careproviders/LeaveReview/DefaultView.aspx?id=1-6386783869,0,0,,
1st Healthcare Ltd,,SCL,1000 Great West Road,,,Brentford,,TW8 9DW,Tel: 02086595576,No ratings yet Rate it yourself - /Services/careproviders/LeaveReview/DefaultView.aspx?id=1-2871345800,0,0,,
"Ealing, London",,SCL,"Unit 513, Crown House",North Circular Road,,London,,NW10 7PN,Tel: 02089657209,No ratings yet Rate it yourself - /Services/careproviders/LeaveReview/DefaultView.aspx?id=1-1080036731,0,0,,
Westminster Homecare Limited (West London),,SCL,Westlink House (Suites 103 and 118),981 Great West Road,,Brentford,,TW8 9DN,Tel: 02089878822,1 rating Rate it yourself - /Services/careproviders/LeaveReview/DefaultView.aspx?id=1-254324554,,,,
Penmar Supported Living,,SCL,"G18, Westlink House",981 Great West Road,,Brentford,,TW8 9DN,Tel: 07578771825,No ratings yet Rate it yourself - /Services/careproviders/LeaveReview/DefaultView.aspx?id=1-7508808027,0,0,,
Prime Care Supported Ltd,,SCL,"Westlink House, Unit 140 E",981 Great West Road,,Brentford,,TW8 9DN,Tel: 07539203806,No ratings yet Rate it yourself - /Services/careproviders/LeaveReview/DefaultView.aspx?id=1-18444848545,0,0,,
Vivid Community Care Ltd,,SCL,37 Half Acre,,,Brentford,,TW8 8BH,Tel: 02081245000,No ratings yet Rate it yourself - /Services/careproviders/LeaveReview/DefaultView.aspx?id=1-12730975744,0,0,,
365 Care Solutions Ltd,,SCL,"Unit 156, Light Box, 111 Power Road",,,London,,W4 5PY,Tel: 02083168994,No ratings yet Rate it yourself - /Services/careproviders/LeaveReview/DefaultView.aspx?id=1-11210283645,0,0,,
Sanctuary Supported Living - Ealing Care Services,,SCL,26 Cumberland Park,,,Acton,London,W3 6SX,Tel: 02089931346,No ratings yet Rate it yourself - /Services/careproviders/LeaveReview/DefaultView.aspx?id=1-2369911445,0,0,,
Striving For Independence Care Solutions,,SCL,3 Pettsgrove Avenue,,,Wembley,Middlesex,HA0 3AF,Tel: 02087951586,No ratings yet Rate it yourself - /Services/careproviders/LeaveReview/DefaultView.aspx?id=1-2996100252,0,0,,
Caerus House,,SCL,61 Medway Gardens,,,Wembley,,HA0 2RJ,Tel: 0203689224,No ratings yet Rate it yourself - /Services/careproviders/LeaveReview/DefaultView.aspx?id=1-10593330077,0,0,,
Rugby Avenue,,SCL,67 Rugby Avenue,,,Wembley,Middlesex,HA0 3DJ,Tel: 02089034613,No ratings yet Rate it yourself - /Services/careproviders/LeaveReview/DefaultView.aspx?id=1-9668349396,0,0,,
Infinity Care Services Limited,,SCL,32 Sussex Road,,,Southall,,UB2 5EQ,Tel: 02030923250,No ratings yet Rate it yourself - /Services/careproviders/LeaveReview/DefaultView.aspx?id=1-3850333552,0,0,,
Heston Care Services Ltd,,SCL,16 Walnut Tree Road,,,Hounslow,Middlesex,TW5 0LR,Tel: 02085817027,No ratings yet Rate it yourself - /Services/careproviders/LeaveReview/DefaultView.aspx?id=1-2851013974,0,0,,
120 Harrowdene Road,,SCL,120 Harrowdene Road,,,North Wembley,Middlesex,HA0 2JF,Tel: 02089083504,No ratings yet Rate it yourself - /Services/careproviders/LeaveReview/DefaultView.aspx?id=1-154426593,0,0,,
Scotts Road,,SCL,79A Scotts Road,,,Southall,Middlesex,UB2 5DF,Tel: 02036204639,No ratings yet Rate it yourself - /Services/careproviders/LeaveReview/DefaultView.aspx?id=1-2145877356,0,0,,
Ablegrange Supported Living,,SCL,47 Kingsway,The Annex,,Wembley,Middlesex,HA9 7QP,Tel: 02089030952,No ratings yet Rate it yourself - /Services/careproviders/LeaveReview/DefaultView.aspx?id=1-2989004583,0,0,,
South Hill,,SCL,93 South Hill Avenue,,,Harrow,Middlesex,HA1 3NZ,Tel: 02088690226,No ratings yet Rate it yourself - /Services/careproviders/LeaveReview/DefaultView.aspx?id=1-9671158504,0,0,,
Queenscourt,,SCL,22 Queenscourt,,,Wembley,,HA9 7QU,,No ratings yet Rate it yourself - /Services/careproviders/LeaveReview/DefaultView.aspx?id=1-6374429482,0,0,,
Westminster Homecare Limited (Peel Road),,SCL,1-5 Peel Road,,,Wembley,,HA9 7LY,Tel: 02031501489,No ratings yet Rate it yourself - /Services/careproviders/LeaveReview/DefaultView.aspx?id=1-9628466028,0,0,,
Sholzy Wolzy Ltd,,SCL,1 Royal Villas,Old Ruislip Road,,Northolt,,UB5 6QF,Tel: 07940518181,1 rating Rate it yourself - /Services/careproviders/LeaveReview/DefaultView.aspx?id=1-14809427484,,,,
58 Acton Lane,,SCL,58 Acton Lane,,,London,,NW10 8TU,Tel: 02036208147,No ratings yet Rate it yourself - /Services/careproviders/LeaveReview/DefaultView.aspx?id=1-5076460230,0,0,,
Glenister Gardens,,SCL,31 Glenister Gardens,,,Hayes,Middlesex,UB3 3FA,Tel: 02085737828,No ratings yet Rate it yourself - /Services/careproviders/LeaveReview/DefaultView.aspx?id=1-1640975970,0,0,,
Core Prospects Limited - 37 Sandringham Crescent,,SCL,37 Sandringham Crescent,,,South Harrow,Middlesex,HA2 9BP,Tel: 02084220564,2 ratings Rate it yourself - /Services/careproviders/LeaveReview/DefaultView.aspx?id=1-117070735,,,,
Goldcrest Healthcare Service (London),,SCL,Unit 1,"Red Lion Court, Alexandra Road",,Hounslow,Middlesex,TW3 1JS,Tel: 02085714402,No ratings yet Rate it yourself - /Services/careproviders/LeaveReview/DefaultView.aspx?id=1-3895383690,0,0,,
Parkside,,SCL,31 College Road,,,Wembley,Middlesex,HA9 8RN,Tel: 02089081268,No ratings yet Rate it yourself - /Services/careproviders/LeaveReview/DefaultView.aspx?id=1-162731961,0,0,,
Dimensions London North/West Domiciliary Care Office,,SCL,"2nd floor, Hounslow House",7 Bath Road,,Hounslow,,TW3 3EB,Tel: 03003039010,No ratings yet Rate it yourself - /Services/careproviders/LeaveReview/DefaultView.aspx?id=1-18843044425,0,0,,
City Home Care Limited,,SCL,90/B East Avenue,,,Hayes,,UB3 2HR,Tel: 02081278240,1 rating Rate it yourself - /Services/careproviders/LeaveReview/DefaultView.aspx?id=1-5516168760,,,,
Joyous Limited,,SCL,27-37,Station Road,,Hayes,,UB3 4DX,Tel: 07400249697,No ratings yet Rate it yourself - /Services/careproviders/LeaveReview/DefaultView.aspx?id=1-14907846233,0,0,,
Flourish Community Homecare Limited ,,SCL,"Unit 4, 2nd Floor",46-50 Station Road,,Hayes,,UB3 4DD,Tel: 07585181115,No ratings yet Rate it yourself - /Services/careproviders/LeaveReview/DefaultView.aspx?id=1-13220572129,0,0,,
Chiltern Jigsaw Resource Centre,,SCL,101 Draycott Avenue,,,Harrow,Middlesex,HA3 0DA,Tel: 02089099877,No ratings yet Rate it yourself - /Services/careproviders/LeaveReview/DefaultView.aspx?id=1-643973724,0,0,,
Cole Park Care Ltd,,SCL,224 London Road,,,Twickenham,,TW1 1EU,Tel: 07841866565,No ratings yet Rate it yourself - /Services/careproviders/LeaveReview/DefaultView.aspx?id=1-15685867558,0,0,,
Excellent Health Care,,SCL,Westminster Business Centre,Printing House Lane,,Hayes,,UB3 1AP,Tel: 02071830739,No ratings yet Rate it yourself - /Services/careproviders/LeaveReview/DefaultView.aspx?id=1-3581710542,0,0,,
Tudor Gardens,,SCL,27-31 Tudor Gardens,Kingsbury,,London,,NW9 8RL,Tel: 02089084692,No ratings yet Rate it yourself - /Services/careproviders/LeaveReview/DefaultView.aspx?id=1-142751234,0,0,,
4 Firs Drive,,SCL,4 Firs Drive,,,Hounslow,,TW5 9TD,Tel: 07730010324,No ratings yet Rate it yourself - /Services/careproviders/LeaveReview/DefaultView.aspx?id=1-14306064460,0,0,,
Enablement Care Supported Living Services,,SCL,348-350,Station Road,,Harrow,,HA1 2DR,Tel: 02088613450,No ratings yet Rate it yourself - /Services/careproviders/LeaveReview/DefaultView.aspx?id=1-6580595089,0,0,,
Seva Care Supported Living Services,,SCL,61 Gayton Road,,,Harrow,,HA1 2LU,Tel: 02084222999,No ratings yet Rate it yourself - /Services/careproviders/LeaveReview/DefaultView.aspx?id=1-3547532021,0,0,,
Panacea Care,,SCL,13 Wood End Green Road,,,Hayes,Middlesex,UB3 2SB,,No ratings yet Rate it yourself - /Services/careproviders/LeaveReview/DefaultView.aspx?id=1-519002719,0,0,,
Care Assist Limited,,SCL,Cervantes House,5-9 Headstone Road,,Harrow,Middlesex,HA1 1PD,Tel: 02035823242,No ratings yet Rate it yourself - /Services/careproviders/LeaveReview/DefaultView.aspx?id=1-375277326,0,0,,
Uxbridge Road,,SCL,623 Uxbridge Road,,,Hayes,Middlesex,UB4 8HR,Tel: 02088480869,No ratings yet Rate it yourself - /Services/careproviders/LeaveReview/DefaultView.aspx?id=1-9672527217,0,0,,
Silverdale Care Limited,,SCL,"Suite 2A, 10 Vista Office Centre",50 Salisbury Road,,Hounslow,,TW4 6JQ,Tel: 07951999553,No ratings yet Rate it yourself - /Services/careproviders/LeaveReview/DefaultView.aspx?id=1-6447271635,0,0,,
Goodluck Care Limited - Hounslow,,SCL,Vista Business Centre,50 Salisbury Road,,Hounslow,Middlesex,TW4 6JQ,Tel: 020 3011 2119,No ratings yet Rate it yourself - /Services/careproviders/LeaveReview/DefaultView.aspx?id=1-2703145341,0,0,,
Care Plus More,,SCL,Care Plus More LTD,"HEAD OFFICE, A1 42, The Vista Centre",,Hounslow,Middlesex,TW4 6JQ,Tel: 07956054109,No ratings yet Rate it yourself - /Services/careproviders/LeaveReview/DefaultView.aspx?id=1-4576665555,0,0,,
Vector Care Supported Living,,SCL,Vista Office Centre,50 Salisbury Road,,Hounslow,Middlesex,TW4 6JQ,Tel: 07460840032,No ratings yet Rate it yourself - /Services/careproviders/LeaveReview/DefaultView.aspx?id=1-15776512461,0,0,,
89 Heathfield North,,SCL,89 Heathfield North,,,Twickenham,,TW2 7QN,Tel: 02087441330,No ratings yet Rate it yourself - /Services/careproviders/LeaveReview/DefaultView.aspx?id=1-256560769,0,0,,
80b Randall Avenue,,SCL,80b Randall Avenue,,,London,,NW2 7SU,Tel: 02084520336,No ratings yet Rate it yourself - /Services/careproviders/LeaveReview/DefaultView.aspx?id=1-6374429312,0,0,,
Clear Horizon,,SCL,1 Falcon Way,,,Harrow,,HA3 0TW,Tel: 02084270906,No ratings yet Rate it yourself - /Services/careproviders/LeaveReview/DefaultView.aspx?id=1-17716751395,0,0,,
Blue Crystal Care Agency,,SCL,40 Parkthorne Drive,,,North Harrow,Middlesex,HA2 7BU,Tel: 0203 7703601,59 ratings Rate it yourself - /Services/careproviders/LeaveReview/DefaultView.aspx?id=1-1788593195,,,,
Harrow and Brent Community Support,,SCL,32 Harrow View,,,Harrow,Middlesex,HA1 1RG,Tel: 02084278288,No ratings yet Rate it yourself - /Services/careproviders/LeaveReview/DefaultView.aspx?id=1-3524304967,0,0,,
Equal People Mencap,,SCL,73 St Charles Square,Kensington,,London,,W10 6EJ,Tel: 02089640544,No ratings yet Rate it yourself - /Services/careproviders/LeaveReview/DefaultView.aspx?id=1-210054189,0,0,,
Direct Independent Care Limited,,SCL,Regal House,70 London Road,,Twickenham,Middlesex,TW1 3QS,,No ratings yet Rate it yourself - /Services/careproviders/LeaveReview/DefaultView.aspx?id=1-1745256288,0,0,,
Hanover Supported Living,,SCL,55 Hanover Circle,,,Hayes,Middlesex,UB3 2TL,Tel: 02036020450,No ratings yet Rate it yourself - /Services/careproviders/LeaveReview/DefaultView.aspx?id=1-2208482776,0,0,,
Reliant Care Ltd,,SCL,33 - 35 Chandos Road,,,Harrow,,HA1 4QX,Tel: 02088936770,2 ratings Rate it yourself - /Services/careproviders/LeaveReview/DefaultView.aspx?id=1-4358692899,,,,
Envico Supported Living LTD,,SCL,59 Commonwealth Avenue,,,Hayes,,UB3 2PN,Tel: 07861359677,No ratings yet Rate it yourself - /Services/careproviders/LeaveReview/DefaultView.aspx?id=1-9710388534,0,0,,
Richmond Community Support,,SCL,Metropolitan Thames Valley Housing Premier House,52 London Road,,Twickenham,,TW1 3RP,Tel: 07736362691,No ratings yet Rate it yourself - /Services/careproviders/LeaveReview/DefaultView.aspx?id=1-8025039785,0,0,,
Wellbeing Assured Healthcare - Main Office,,SCL,Miller House,Rosslyn Crescent,,Harrow,Middlesex,HA1 2RZ,Tel: 02071014087,No ratings yet Rate it yourself - /Services/careproviders/LeaveReview/DefaultView.aspx?id=1-13879974441,0,0,,
Odirich Limited,,SCL,Flat Ground Floor,31 Pinner View,,Harrow,,HA1 4QG,Tel: 07449267705,No ratings yet Rate it yourself - /Services/careproviders/LeaveReview/DefaultView.aspx?id=1-15834693919,0,0,,
Pinnacle Support Services,,SCL,"Office 2.59, 6-9 The Square",Stockley Park,,Uxbridge,,UB11 1FW,Tel: 07879348614,No ratings yet Rate it yourself - /Services/careproviders/LeaveReview/DefaultView.aspx?id=1-16369252298,0,0,,
Marygold Care UK Ltd,,SCL,350 Pinner Road,,,Harrow,,HA1 4LB,Tel: 02035818910,No ratings yet Rate it yourself - /Services/careproviders/LeaveReview/DefaultView.aspx?id=1-1313209468,0,0,,
Newton Care Homes Limited,,SCL,111 Harrow View,,,Harrow,Middlesex,HA1 4SZ,Tel: 02087289044,No ratings yet Rate it yourself - /Services/careproviders/LeaveReview/DefaultView.aspx?id=1-107095355,0,0,,
Piper House,,SCL,2 St Marks Road,,,London,,W11 1RQ,Tel: 07951472868,No ratings yet Rate it yourself - /Services/careproviders/LeaveReview/DefaultView.aspx?id=1-2867132067,0,0,,
Signet Healthcare Limited,,SCL,207A Field End Road,,,Pinner,,HA5 1QZ,Tel: 02089384674,No ratings yet Rate it yourself - /Services/careproviders/LeaveReview/DefaultView.aspx?id=1-130834211,0,0,,
Kenyarcher Care Ltd,,SCL,Kingsbury House,468 Church Lane,,London,,NW9 8UA,Tel: 07577601984,No ratings yet Rate it yourself - /Services/careproviders/LeaveReview/DefaultView.aspx?id=1-13309169228,0,0,,
KT's Care Angels West London,,SCL,"Suite 201, A J P Business Centre",152-154 Coles Green Road,,London,,NW2 7HD,Tel: 02082054862,No ratings yet Rate it yourself - /Services/careproviders/LeaveReview/DefaultView.aspx?id=1-11932085259,0,0,,
Mitus Care,,SCL,2 River Gardens,,,Feltham,,TW14 0RE,Tel: 07506877982,No ratings yet Rate it yourself - /Services/careproviders/LeaveReview/DefaultView.aspx?id=1-12539911993,0,0,,
Brent Supported Living,,SCL,167 Willesden Lane,,,London,,NW6 7YL,Tel: 02084595007,No ratings yet Rate it yourself - /Services/careproviders/LeaveReview/DefaultView.aspx?id=1-9656379878,0,0,,
Eastcote Care,,SCL,301a,Kenton Lane,,Harrow,,HA3 8RR,Tel: 07563564694,No ratings yet Rate it yourself - /Services/careproviders/LeaveReview/DefaultView.aspx?id=1-6947585465,0,0,,
GN 122 Health Care Limited,,SCL,GN 122 Health Care Limited Unit 3,Lowther Road,,Stanmore,,HA7 1EP,,1 rating Rate it yourself - /Services/careproviders/LeaveReview/DefaultView.aspx?id=1-15862407681,,,,
Swan Care Group Ltd,,SCL,Flat 34,"Freetrade House, Lowther Road",,Stanmore,,HA7 1EP,Tel: 02080508171,No ratings yet Rate it yourself - /Services/careproviders/LeaveReview/DefaultView.aspx?id=1-16567342775,0,0,,
Precious Homes North London,,SCL,8 Mount View Road,,,London,,NW9 0UT,Tel: 02089040862,No ratings yet Rate it yourself - /Services/careproviders/LeaveReview/DefaultView.aspx?id=1-1434459956,0,0,,
The Safehouse BD Limited,,SCL,348a,Kilburn High Road,,London,,NW6 2QJ,Tel: 03332244946,1 rating Rate it yourself - /Services/careproviders/LeaveReview/DefaultView.aspx?id=1-11427888128,,,,
Forward Care,,SCL,58 Pield Heath Road,,,Uxbridge,,UB8 3NQ,Tel: 01895349655,1 rating Rate it yourself - /Services/careproviders/LeaveReview/DefaultView.aspx?id=1-14375744618,,,,
Westminster Homecare Limited (North London),,SCL,"Hyde House, The Hyde",Edgware Road,,London,,NW9 6LH,Tel: 02082002030,No ratings yet Rate it yourself - /Services/careproviders/LeaveReview/DefaultView.aspx?id=1-126215494,0,0,,
Ashrey Care,,SCL,96 Carmelite Road,,,Harrow,Middlesex,HA3 5LS,Tel: 02089591114,No ratings yet Rate it yourself - /Services/careproviders/LeaveReview/DefaultView.aspx?id=1-2063765075,0,0,,
Kisharon Supported Living,,SCL,333 Edgware Road,,,London,,NW9 6TD,Tel: 02084572525,No ratings yet Rate it yourself - /Services/careproviders/LeaveReview/DefaultView.aspx?id=1-169593433,0,0,,
Hallmark Healthcare Limited,,SCL,333 Edgware Road,"Colindale, Barnet",,London,,NW9 6TD,Tel: 07404843234,No ratings yet Rate it yourself - /Services/careproviders/LeaveReview/DefaultView.aspx?id=1-15282616803,0,0,,
New Dawn support services,,SCL,333 Edgware Road,,,London,,NW9 6TD,Tel: 02079807160,No ratings yet Rate it yourself - /Services/careproviders/LeaveReview/DefaultView.aspx?id=1-14730868508,0,0,,
Dillon Care Pathway,,SCL,24 Talbot Crescent,Hendon,,London,,NW4 4PE,Tel: 02071937462,No ratings yet Rate it yourself - /Services/careproviders/LeaveReview/DefaultView.aspx?id=1-147679369,0,0,,
Care Shield Services,,SCL,119 Dalston Gardens,,,Stanmore,Middlesex,HA7 1DA,Tel: 07930745239,2 ratings Rate it yourself - /Services/careproviders/LeaveReview/DefaultView.aspx?id=1-5219442280,,,,
Adolphus Care,,SCL,3 Pikes End,,,Pinner,Middlesex,HA5 2EX,,No ratings yet Rate it yourself - /Services/careproviders/LeaveReview/DefaultView.aspx?id=1-152906715,0,0,,
Heritage Care Place,,SCL,Devonshire House,582 Honeypot Lane,,Stanmore,Middlesex,HA7 1JS,,No ratings yet Rate it yourself - /Services/careproviders/LeaveReview/DefaultView.aspx?id=1-9878669694,0,0,,
Main Office,,SCL,"Office 227, Second Floor, Devonshire House",582 Honeypot Lane,,Stanmore,,HA7 1JS,Tel: 07312273717,No ratings yet Rate it yourself - /Services/careproviders/LeaveReview/DefaultView.aspx?id=1-14980893314,0,0,,
Democare Services Limited,,SCL,Suit No 104 Legacy Centre,"Hanworth Trading Estate, Hampton Road West",,Feltham,,TW13 6DH,Tel: 02087555844,No ratings yet Rate it yourself - /Services/careproviders/LeaveReview/DefaultView.aspx?id=1-8694085844,0,0,,
Amber Home Carers,,SCL,397 Staines Road,,,Feltham,,TW14 9HA,Tel: 02088902566,No ratings yet Rate it yourself - /Services/careproviders/LeaveReview/DefaultView.aspx?id=1-5013604773,0,0,,
Penkz Limited,,SCL,Stanmore Business and Innovation Centre,"Howard Road, Harrow",,Stanmore,,HA7 1BT,Tel: 02084295285,No ratings yet Rate it yourself - /Services/careproviders/LeaveReview/DefaultView.aspx?id=1-1937344251,0,0,,
Fairplacecare,,SCL,44 Watford Way,,,London,,NW4 3AL,Tel: 02082056856,No ratings yet Rate it yourself - /Services/careproviders/LeaveReview/DefaultView.aspx?id=1-6521526589,0,0,,
Albert Road,,SCL,66 Albert Road,,,West Drayton,Middlesex,UB7 8ES,Tel: 02037440144,No ratings yet Rate it yourself - /Services/careproviders/LeaveReview/DefaultView.aspx?id=1-4119121384,0,0,,
Salisbury Support 4 Autism,,SCL,"Suite 3, Liddall House","66 Albert Road, Yiewsley",,West Drayton,,UB7 8ES,Tel: 08003689433,No ratings yet Rate it yourself - /Services/careproviders/LeaveReview/DefaultView.aspx?id=1-15833581616,0,0,,
Richmond and Kingston DCA,,SCL,Rowan House,Field Lane,,Teddington,Middlesex,TW11 9BP,Tel: 02037270602,No ratings yet Rate it yourself - /Services/careproviders/LeaveReview/DefaultView.aspx?id=1-8043166315,0,0,,
Pbcare Limited,,SCL,152 Burnt Oak Broadway,,,Edgware,Middlesex,HA8 0AX,Tel: 02089588899,No ratings yet Rate it yourself - /Services/careproviders/LeaveReview/DefaultView.aspx?id=1-11865491015,0,0,,
Optima Care Shine London Limited,,SCL,"First Floor, Block A, Marvan Court",1 Waldegrave Road,,Teddington,,TW11 8LZ,Tel: 02085720990,No ratings yet Rate it yourself - /Services/careproviders/LeaveReview/DefaultView.aspx?id=1-3837014544,0,0,,
Honeycroft Hill - Uxbridge,,SCL,60 Honeycroft Hill,,,Uxbridge,,UB10 9NS,Tel: 01895256697,No ratings yet Rate it yourself - /Services/careproviders/LeaveReview/DefaultView.aspx?id=1-11577518491,0,0,,
Church Road,,SCL,Flat 1-6,6 Church Road,,Uxbridge,,UB8 3NA,Tel: 01895713983,No ratings yet Rate it yourself - /Services/careproviders/LeaveReview/DefaultView.aspx?id=1-10616662318,0,0,,
HENLEY RISE,,SCL,32 Bosanquet Close,,,Uxbridge,,UB8 3PE,Tel: 07458329988,No ratings yet Rate it yourself - /Services/careproviders/LeaveReview/DefaultView.aspx?id=1-15524571463,0,0,,
Walsingham Support - London Supported Living,,SCL,4 Gordon Avenue,,,Stanmore,Middlesex,HA7 3QD,Tel: 02072696931,No ratings yet Rate it yourself - /Services/careproviders/LeaveReview/DefaultView.aspx?id=1-9214140934,0,0,,
Kuklous HealthCare Limited,,SCL,108-114,Golders Green Road,,London,,NW11 8HB,Tel: 02084580103,No ratings yet Rate it yourself - /Services/careproviders/LeaveReview/DefaultView.aspx?id=1-11772776505,0,0,,
Priory Supported Living London & Home Counties,,SCL,"GHL Aviation House Ltd, The Lodge & Annex","Harmondsworth Lane, Harmondsworth",,West Drayton,,UB7 0LQ,Tel: 07885881040,No ratings yet Rate it yourself - /Services/careproviders/LeaveReview/DefaultView.aspx?id=1-3746259064,0,0,,
CLIA Care,,SCL,Apartment 5,1C Osiers Road,,London,,SW18 1NL,Tel: 07738510983,2 ratings Rate it yourself - /Services/careproviders/LeaveReview/DefaultView.aspx?id=1-4279526341,,,,
Langdon Community - Edgware,,SCL,Maccabi House,Gideon Close,,Edgware,Middlesex,HA8 7FR,Tel: 01617734070,No ratings yet Rate it yourself - /Services/careproviders/LeaveReview/DefaultView.aspx?id=1-1134898317,0,0,,
FitzRoy - Teddington,,SCL,7 Haydon Close,Teddington,,Surrey,,TW11 9FN,Tel: 02089485423,No ratings yet Rate it yourself - /Services/careproviders/LeaveReview/DefaultView.aspx?id=1-6387510152,0,0,,
Supported Living Services Uxbridge,,SCL,The Charter Building,Charter Place,,Uxbridge,,UB8 1JG,Tel: 01895259436,No ratings yet Rate it yourself - /Services/careproviders/LeaveReview/DefaultView.aspx?id=1-10929320757,0,0,,
Acquah Lodge- 60 Dalkeith Grove,,SCL,60 Dalkeith Grove,,,Stanmore,Middlesex,HA7 4SF,Tel: 07958010184,No ratings yet Rate it yourself - /Services/careproviders/LeaveReview/DefaultView.aspx?id=1-4699976501,0,0,,
Hayes Staff Recruitment Limited,,SCL,1 Redford Way,,,Uxbridge,,UB8 1SZ,Tel: 02085692662,No ratings yet Rate it yourself - /Services/careproviders/LeaveReview/DefaultView.aspx?id=1-11146468347,0,0,,
Broadway House,,SCL,80-82 The Broadway,,,Stanmore,Middlesex,HA7 4HB,Tel: 07720948169,No ratings yet Rate it yourself - /Services/careproviders/LeaveReview/DefaultView.aspx?id=1-2064853382,0,0,,
Glow Domiciliary Healthcare LTD,,SCL,50 St. Margarets Road,,,Edgware,,HA8 9UU,Tel: 07930473559,No ratings yet Rate it yourself - /Services/careproviders/LeaveReview/DefaultView.aspx?id=1-7333920016,0,0,,
Maya Supported Living Limited,,SCL,Abbey House,450 Bath Road,,West Drayton,Middlesex,UB7 0EB,Tel: 07727181808,No ratings yet Rate it yourself - /Services/careproviders/LeaveReview/DefaultView.aspx?id=1-5972807572,0,0,,
Venus Healthcare,,SCL,"CR House, PO Box 345",,,Hampton,,TW12 9EA,Tel: 07961832047,No ratings yet Rate it yourself - /Services/careproviders/LeaveReview/DefaultView.aspx?id=1-11129824941,0,0,,
Battersea Place Retirement Village Limited,,SCL,73 Albert Bridge Road,Battersea,,London,,SW11 4DS,Tel: 07745649051,No ratings yet Rate it yourself - /Services/careproviders/LeaveReview/DefaultView.aspx?id=1-2525654037,0,0,,
Domiciliary Care Agency Surrey,,SCL,John Morris House Community Centre,"164 St Johns Hill, Battersea",,London,,SW11 1SW,Tel: 07458127283,No ratings yet Rate it yourself - /Services/careproviders/LeaveReview/DefaultView.aspx?id=1-13562441189,0,0,,
Creative Support - Melody Road,,SCL,Poplar House,"126a, Melody Road",,London,,SW18 2BF,Tel: 07976915989,No ratings yet Rate it yourself - /Services/careproviders/LeaveReview/DefaultView.aspx?id=1-9554124815,0,0,,