Organisation Name,NACS Code,Organisation Type,Address1,Address2,Address3,Address4,Address5,PostCode,Telephone Number,NHS.UK users rating,Value  (NHS.UK users rating),Banding Classification  (NHS.UK users rating),Car parking (Is there car parking at this organisation?),Disabled access (Disabled access)
Agincare UK Chippenham,,SCL,Absol House,Ivy Road Industrial Estate,,Chippenham,Wiltshire,SN15 1SB,Tel: 01249652111,No ratings yet Rate it yourself - /Services/careproviders/LeaveReview/DefaultView.aspx?id=1-134638575,0,0,,
Agincare Enable Limited (Wiltshire and Swindon),,SCL,"AGINCARE, Absol House",Ivy Road Industrial Estate,,Chippenham,,SN15 1SB,Tel: 07458121880,No ratings yet Rate it yourself - /Services/careproviders/LeaveReview/DefaultView.aspx?id=1-13264121131,0,0,,
Charlton Court,,SCL,"Suite 5, Lansdowne Business Centre","Lansdowne Court, Bumpers Way, Bumpers Farm",,Chippenham,,SN14 6RZ,Tel: 07886959876,No ratings yet Rate it yourself - /Services/careproviders/LeaveReview/DefaultView.aspx?id=1-18444374146,0,0,,
Dimensions South West Counties Domiciliary Care Office,,SCL,Unit 7,"Granville House, Bumpers Way, Bumpers Farm",,Chippenham,,SN14 6RZ,Tel: 03003039098,No ratings yet Rate it yourself - /Services/careproviders/LeaveReview/DefaultView.aspx?id=1-1643906081,0,0,,
Blakehill Healthcare,,SCL,"Suite 8-9, Lansdowne Business Centre","Lansdowne Court, Bumpers Way, Bumpers Farm",,Chippenham,,SN14 6RZ,Tel: 07877543889,No ratings yet Rate it yourself - /Services/careproviders/LeaveReview/DefaultView.aspx?id=1-9672774911,0,0,,
Dimensions Oxfordshire & Warwickshire Domiciliary Care Office,,SCL,Unit 7,"Lansdowne Court, Bumpers Way, Bumpers Farm",,Chippenham,,SN14 6RZ,Tel: 07943514289,No ratings yet Rate it yourself - /Services/careproviders/LeaveReview/DefaultView.aspx?id=1-10859240015,0,0,,
The White Horse Care Trust Supported Living and Outreach Service,,SCL,D603 Delta Office Park,Welton Road,,Swindon,,SN5 7XF,Tel: 01793846000,No ratings yet Rate it yourself - /Services/careproviders/LeaveReview/DefaultView.aspx?id=1-466337314,0,0,,
Southwest Homecare Solutions Limited,,SCL,Nexus Business Centre,"6 Darby Close, Cheney Manor Industrial Estate",,Swindon,Wiltshire,SN2 2PN,Tel: 03300245864,No ratings yet Rate it yourself - /Services/careproviders/LeaveReview/DefaultView.aspx?id=1-4182274310,0,0,,
Golden Hope Care Ltd,,SCL,Percy Street,,,Swindon,,SN2 2AZ,Tel: 03334330271,No ratings yet Rate it yourself - /Services/careproviders/LeaveReview/DefaultView.aspx?id=1-10917370115,0,0,,
Proalliance Care,,SCL,"23A, B S S House",Cheney Manor Industrial Estate,,Swindon,,SN2 2PJ,Tel: 01793380386,No ratings yet Rate it yourself - /Services/careproviders/LeaveReview/DefaultView.aspx?id=1-17362009559,0,0,,
The Laurel,,SCL,23 Park Lane,,,Swindon,Wiltshire,SN1 5EL,Tel: 01793496458,No ratings yet Rate it yourself - /Services/careproviders/LeaveReview/DefaultView.aspx?id=1-137813785,0,0,,
Honeydew Healthcare Ltd,,SCL,Hartham Park,,,Corsham,Wiltshire,SN13 0RP,Tel: 01249691354,No ratings yet Rate it yourself - /Services/careproviders/LeaveReview/DefaultView.aspx?id=1-12255907988,0,0,,
Network Healthcare Professionals Limited - Swindon,,SCL,"1st Floor, College Court",Regent Circus,,Swindon,Wiltshire,SN1 1PZ,Tel: 01793618198,No ratings yet Rate it yourself - /Services/careproviders/LeaveReview/DefaultView.aspx?id=1-136058657,0,0,,
M T Supported Living Ltd,,SCL,Suite M Astoria House,165-166 Victoria Road,,Swindon,,SN1 3BU,Tel: 07305892959,No ratings yet Rate it yourself - /Services/careproviders/LeaveReview/DefaultView.aspx?id=1-8923584605,0,0,,
"Kingdom Youth Services, Supported Living",,SCL,57 Pure Offices,Kembrey Park,,Swindon,,SN2 8BW,,1 rating Rate it yourself - /Services/careproviders/LeaveReview/DefaultView.aspx?id=1-12297171268,,,,
Collaborative Care Services Ltd,,SCL,"Office Number 31,  Pure Offices Ltd",Kembrey Park,,Swindon,,SN2 8BW,Tel: 07414070577,No ratings yet Rate it yourself - /Services/careproviders/LeaveReview/DefaultView.aspx?id=1-12495293592,0,0,,
Alpine Care UK Swindon,,SCL,"The Old Police House, 38 Ermin Street",,,Swindon,,SN26 8AA,Tel: 07810111714,No ratings yet Rate it yourself - /Services/careproviders/LeaveReview/DefaultView.aspx?id=1-15929630657,0,0,,
Dynamic Support,,SCL,Suite D3 Gemini House,"Hargreaves Road, Groundwell Industrial Estate",,Swindon,,SN25 5AZ,Tel: 01793238224,2 ratings Rate it yourself - /Services/careproviders/LeaveReview/DefaultView.aspx?id=1-2221305162,,,,
Cornerstones Supported Living South Head Office,,SCL,The Printworks to the rear of 14 Market Place,,,Devizes,,SN10 1HT,Tel: 07534142518,No ratings yet Rate it yourself - /Services/careproviders/LeaveReview/DefaultView.aspx?id=1-10597785017,0,0,,
SureCare Services (Wessex),,SCL,Lower Vestry,Church Street,,Trowbridge,Wiltshire,BA14 8DU,,No ratings yet Rate it yourself - /Services/careproviders/LeaveReview/DefaultView.aspx?id=1-116416313,0,0,,
Invictus Plus Care,,SCL,22 Silver Street,,,Trowbridge,,BA14 8AE,Tel: 01225760356,1 rating Rate it yourself - /Services/careproviders/LeaveReview/DefaultView.aspx?id=1-5488895976,,,,
Brandon Trust Supported Living - Wiltshire,,SCL,"Unit 7, Kestrel House",7 Mill Street,,Trowbridge,Wiltshire,BA14 8BE,Tel: 01225761146,No ratings yet Rate it yourself - /Services/careproviders/LeaveReview/DefaultView.aspx?id=1-2055901006,0,0,,
ELSI (SW) LTD,,SCL,Andil House,Court Street,,Trowbridge,Wiltshire,BA14 8BR,,No ratings yet Rate it yourself - /Services/careproviders/LeaveReview/DefaultView.aspx?id=1-11822670281,0,0,,
Bosun Care Ltd,,SCL,"Ground Floor Office, Trixter House",London Road,,Stroud,Gloucestershire,GL5 2AY,Tel: 01453350654,5 ratings Rate it yourself - /Services/careproviders/LeaveReview/DefaultView.aspx?id=1-3136816188,,,,
Mencap - Trowbridge,,SCL,Oak House,"Epsom Road, White Horse Business Park",,Trowbridge,,BA14 0XG,Tel: 01225944011,No ratings yet Rate it yourself - /Services/careproviders/LeaveReview/DefaultView.aspx?id=1-4076151755,0,0,,
Blue Sky Enabling,,SCL,"Suite 1, Limpley Mill","Lower Stoke, Limpley Stoke",,Bath,Wiltshire,BA2 7FJ,Tel: 08004561337,No ratings yet Rate it yourself - /Services/careproviders/LeaveReview/DefaultView.aspx?id=1-721468986,0,0,,
The Gables,,SCL,Lovedays Mead,Folly Lane,,Stroud,Gloucestershire,GL5 1SB,,No ratings yet Rate it yourself - /Services/careproviders/LeaveReview/DefaultView.aspx?id=1-114375431,0,0,,
A+bility,,SCL,"13 Salmon Springs, Stroud",Gloucestershire,,Stroud,,GL6 6NU,Tel: 01453827978,No ratings yet Rate it yourself - /Services/careproviders/LeaveReview/DefaultView.aspx?id=1-3749875621,0,0,,
Network Healthcare Professionals Limited - Dursley,,SCL,14-16 Long Street,,,Dursley,Gloucestershire,GL11 4HY,Tel: 01453519240,No ratings yet Rate it yourself - /Services/careproviders/LeaveReview/DefaultView.aspx?id=1-136058544,0,0,,
Fieldview,,SCL,Pearcroft Road,Stonehouse,,Gloucester,Gloucestershire,GL10 2JY,Tel: 01453791320,No ratings yet Rate it yourself - /Services/careproviders/LeaveReview/DefaultView.aspx?id=1-118835085,0,0,,
Way Ahead Care - Bath and North East Somerset,,SCL,Chameleon Court,Lower Bristol Road,,Bath,Somerset,BA2 9ES,Tel: 01225789161,No ratings yet Rate it yourself - /Services/careproviders/LeaveReview/DefaultView.aspx?id=1-130335221,0,0,,
Carich Care Limited,,SCL,Coedway,4 Bristol Road,,Stonehouse,,GL10 2BQ,Tel: 07952806180,No ratings yet Rate it yourself - /Services/careproviders/LeaveReview/DefaultView.aspx?id=1-6398650126,0,0,,
Spur Healthcare Ltd,,SCL,"Office 1 F, Wessex House",Station Road,,Westbury,,BA13 3JN,Tel: 07939073249,No ratings yet Rate it yourself - /Services/careproviders/LeaveReview/DefaultView.aspx?id=1-16481048858,0,0,,
Complex Health Needs Service,,SCL,Carrswood Day Service,"Cleeve Green, Twerton",,Bath,,BA2 1RS,,No ratings yet Rate it yourself - /Services/careproviders/LeaveReview/DefaultView.aspx?id=1-13687433061,0,0,,
Bath Supported Living Service,,SCL,c/o Carrswood Day Centre,Cleeve Green,,Bath,Avon,BA2 1RS,Tel: 012253966039,No ratings yet Rate it yourself - /Services/careproviders/LeaveReview/DefaultView.aspx?id=1-3617794855,0,0,,
Learning Together Limited,,SCL,The Wheelhouse North 2nd B,Bond's Mill Estate,,Stonehouse,,GL10 3RF,Tel: 01453823400,No ratings yet Rate it yourself - /Services/careproviders/LeaveReview/DefaultView.aspx?id=1-203739848,0,0,,
Thistledown Supported Living Ltd,,SCL,Brunel House,Volunteer Way,,Faringdon,,SN7 7YR,Tel: 01367246004,No ratings yet Rate it yourself - /Services/careproviders/LeaveReview/DefaultView.aspx?id=1-6553136264,0,0,,
Brunel House,,SCL,Brunel House,Volunteer Way,,Faringdon,,SN7 7YR,Tel: 07902009694,No ratings yet Rate it yourself - /Services/careproviders/LeaveReview/DefaultView.aspx?id=1-13728313189,0,0,,
Ultimate Independence Care Ltd,,SCL,14 Maurice Shill Close,Great Oldbury,,Stonehouse,Gloucestershire,GL10 3FR,Tel: 01453704572,No ratings yet Rate it yourself - /Services/careproviders/LeaveReview/DefaultView.aspx?id=1-11933139638,0,0,,
Tempra Health Care Services Ltd.,,SCL,88 Broad Street,Staple Hill,,Bristol,,BS16 5NJ,Tel: 01172390029,No ratings yet Rate it yourself - /Services/careproviders/LeaveReview/DefaultView.aspx?id=1-18269086950,0,0,,
Courtfield Healthcare,,SCL,"Suite 3, 77 North Street",Downend,,Bristol,,BS16 5SE,Tel: 01179564555,No ratings yet Rate it yourself - /Services/careproviders/LeaveReview/DefaultView.aspx?id=1-561997267,0,0,,
New Key Bristol,,SCL,Unit 1,"Vincent Court, 89 Soundwell Road",,Bristol,,BS16 4QR,Tel: 01179338551,No ratings yet Rate it yourself - /Services/careproviders/LeaveReview/DefaultView.aspx?id=1-16323133029,0,0,,
Silva Care Limited,,SCL,37 Penn Drive,"Shady Pines, Frenchay",,Bristol,,BS16 1NN,Tel: 01179642828,No ratings yet Rate it yourself - /Services/careproviders/LeaveReview/DefaultView.aspx?id=1-137648328,0,0,,
Care Managers Ltd,,SCL,Flat 14,"The Old Exchange, 10 Bank Road",,Bristol,,BS15 8LX,Tel: 03335330143,No ratings yet Rate it yourself - /Services/careproviders/LeaveReview/DefaultView.aspx?id=1-16573640997,0,0,,
Milestones Trust Dom Care,,SCL,"Unit 7, Eclipse Office Park","High Street, Staple Hill",,Bristol,,BS16 5EL,,No ratings yet Rate it yourself - /Services/careproviders/LeaveReview/DefaultView.aspx?id=1-118415934,0,0,,
Excel Living Limited,,SCL,Kingswood House,"South Road, Kingswood",,Bristol,,BS15 8JF,Tel: 01174413136,No ratings yet Rate it yourself - /Services/careproviders/LeaveReview/DefaultView.aspx?id=1-126446051,0,0,,
Patience Company,,SCL,"Kingswood House, Suite 16-17","South Road, Kingswood",,Bristol,,BS15 8JF,Tel: 01174229699,No ratings yet Rate it yourself - /Services/careproviders/LeaveReview/DefaultView.aspx?id=1-11147010192,0,0,,
Hazelcare Head Office,,SCL,317 Two Mile Hill Road,,,Bristol,,BS15 1AP,Tel: 01179080085,No ratings yet Rate it yourself - /Services/careproviders/LeaveReview/DefaultView.aspx?id=1-6756098531,0,0,,
Epiphany in Care Limited,,SCL,"Spur 11.4, The Vassall Centre","Gill Avenue, Fishponds",,Bristol,,BS16 2QQ,Tel: 01179656095,1 rating Rate it yourself - /Services/careproviders/LeaveReview/DefaultView.aspx?id=1-2017257620,,,,
B&NES DCA,,SCL,"Acorn House, First Floor, Kingswood Foundation Estate",Britannia Road,,Bristol,,BS15 8DB,Tel: 0789056890,No ratings yet Rate it yourself - /Services/careproviders/LeaveReview/DefaultView.aspx?id=1-15350225955,0,0,,
Rofemaron Healthcare Ltd,,SCL,39 Charnham Street,,,Hungerford,,RG17 0EJ,,No ratings yet Rate it yourself - /Services/careproviders/LeaveReview/DefaultView.aspx?id=1-15102592466,0,0,,
Head Office,,SCL,"11 The Glenmore Centre, Jessop Court","Waterwells Business Park, Quedgeley",,Gloucester,,GL2 2AP,Tel: 01452883011,No ratings yet Rate it yourself - /Services/careproviders/LeaveReview/DefaultView.aspx?id=1-2773135988,0,0,,
Mary Rush Care,,SCL,"Unit G07 Kestrel Court, Waterwells Drive","Waterwells Business Park, Quedgeley",,Gloucester,,GL2 2AT,Tel: 01452346327,No ratings yet Rate it yourself - /Services/careproviders/LeaveReview/DefaultView.aspx?id=1-6553310534,0,0,,
ADM Care Support Limited,,SCL,137 Troopers Hill Road,St George,,Bristol,,BS5 8BL,,No ratings yet Rate it yourself - /Services/careproviders/LeaveReview/DefaultView.aspx?id=1-12724649550,0,0,,
Beckford Lodge,,SCL,Gipsy Lane,,,Warminster,Wiltshire,BA12 9LR,Tel: 01985847755,No ratings yet Rate it yourself - /Services/careproviders/LeaveReview/DefaultView.aspx?id=1-120666321,0,0,,
Cobbett House - Supported Living Service,,SCL,Cobbet Place,,,Warminster,Wiltshire,BA12 8NG,Tel: 01985213958,No ratings yet Rate it yourself - /Services/careproviders/LeaveReview/DefaultView.aspx?id=1-120084773,0,0,,
The Horizon (New) Ltd,,SCL,Regency House,Bonville Road,,Bristol,,BS4 5QH,Tel: 01174520916,No ratings yet Rate it yourself - /Services/careproviders/LeaveReview/DefaultView.aspx?id=1-13036879020,0,0,,
Blakehill Healthcare,,SCL,"Unit 16, Apex Court","Woodlands, Bradley Stoke",,Bristol,,BS32 4JT,Tel: 07949240085,No ratings yet Rate it yourself - /Services/careproviders/LeaveReview/DefaultView.aspx?id=1-4125951625,0,0,,
PI Care,,SCL,96 Dewfalls Drive,Bradley Stoke,,Bristol,,BS32 9BT,Tel: 01454528329,No ratings yet Rate it yourself - /Services/careproviders/LeaveReview/DefaultView.aspx?id=1-11384215858,0,0,,
Olive Leaf Health & Homecare Limited,,SCL,Laurel House,"Brotherswood Court, Great Park Road, Bradley Stoke",,Bristol,,BS32 4QW,Tel: 03330124384,No ratings yet Rate it yourself - /Services/careproviders/LeaveReview/DefaultView.aspx?id=1-2840707895,0,0,,
Fresh Haven Healthcare Ltd - South Gloucestershire,,SCL,"Office 6 Equinox South,","Great Park Road, Bradley Stoke",,Bristol,,BS32 4QL,,No ratings yet Rate it yourself - /Services/careproviders/LeaveReview/DefaultView.aspx?id=1-15775466674,0,0,,
Agincare UK Bristol,,SCL,"Satellite House, Satellite Business Park","Blackswarth Road, St Annes",,Bristol,,BS5 8AU,Tel: 01179637549,No ratings yet Rate it yourself - /Services/careproviders/LeaveReview/DefaultView.aspx?id=1-134638551,0,0,,
Agincare UK - Nutfield Extra Care Scheme,,SCL,Nutfield House,"Nutfield Grove, Filton",,Bristol,Avon,BS34 7LJ,Tel: 01179636597,No ratings yet Rate it yourself - /Services/careproviders/LeaveReview/DefaultView.aspx?id=1-357182168,0,0,,
Nurseline Community Services Ltd,,SCL,2510 The Quadrant,"Aztec West, Almondsbury",,Bristol,,BS32 4AQ,Tel: 01174030943,2 ratings Rate it yourself - /Services/careproviders/LeaveReview/DefaultView.aspx?id=1-7486181315,,,,
Clover Health and Homecare HQ,,SCL,"Regus Brunel Office, 2430/2440 The Quadrant","Aztec West, Almondsbury",,Bristol,,BS32 4AQ,Tel: 07496372965,No ratings yet Rate it yourself - /Services/careproviders/LeaveReview/DefaultView.aspx?id=1-17586377135,0,0,,
Frome Road,,SCL,Frome Road,,,Radstock,Avon,BA3 3LL,Tel: 01225395377,No ratings yet Rate it yourself - /Services/careproviders/LeaveReview/DefaultView.aspx?id=1-3617795190,0,0,,
Goldcrest Healthcare Service (Bristol),,SCL,143 Lawrence Hill,,,Bristol,,BS5 0BT,Tel: 011734620463,No ratings yet Rate it yourself - /Services/careproviders/LeaveReview/DefaultView.aspx?id=1-18773495280,0,0,,
Candle Flame Care Ltd,,SCL,1 Holmes Street,Barton Hill,,Bristol,,BS5 9FD,Tel: 01174505268,No ratings yet Rate it yourself - /Services/careproviders/LeaveReview/DefaultView.aspx?id=1-8810798927,0,0,,
Head Office,,SCL,Futures House,"Goodridge Business Park, Goodridge Avenue",,Gloucester,,GL2 5EA,Tel: 01452535544,1 rating Rate it yourself - /Services/careproviders/LeaveReview/DefaultView.aspx?id=1-3700686190,,,,
Dimensions Somerset Frome Domiciliary Care Office,,SCL,Colliers Court,Manor Road,,Frome,Somerset,BA11 4BS,Tel: 01373456551,No ratings yet Rate it yourself - /Services/careproviders/LeaveReview/DefaultView.aspx?id=1-3279526135,0,0,,
Swift Care Services Ltd,,SCL,70 Arlingham Way,Patchway,,Bristol,,BS34 5NF,,No ratings yet Rate it yourself - /Services/careproviders/LeaveReview/DefaultView.aspx?id=1-18393400708,0,0,,
Cheltenham Supported Living,,SCL,Charlton Lane,,,Cheltenham,,GL53 9HD,Tel: 01242512569,No ratings yet Rate it yourself - /Services/careproviders/LeaveReview/DefaultView.aspx?id=1-4961855782,0,0,,
Oxfordshire DCA,,SCL,63A Alfredston Place,Chain Hill,,Wantage,,OX12 9DL,Tel: 01235772551,No ratings yet Rate it yourself - /Services/careproviders/LeaveReview/DefaultView.aspx?id=1-7556457756,0,0,,
Care at Home (High Street),,SCL,113 High Street,Tredworth,,Gloucester,,GL1 4SY,Tel: 01452300025,No ratings yet Rate it yourself - /Services/careproviders/LeaveReview/DefaultView.aspx?id=1-8461470476,0,0,,
Shy Lowen Care Limited,,SCL,163 Bristol Road,,,Gloucester,Gloucestershire,GL1 5TG,Tel: 01452539200,No ratings yet Rate it yourself - /Services/careproviders/LeaveReview/DefaultView.aspx?id=1-1031162250,0,0,,
HF Trust - Avon DCA,,SCL,241 Redcatch Road,Knowle,,Bristol,,BS4 2HQ,Tel: 01179243152,No ratings yet Rate it yourself - /Services/careproviders/LeaveReview/DefaultView.aspx?id=1-120702134,0,0,,
Kelly House,,SCL,27-29 Ashley Road,,,Bristol,,BS6 5NJ,Tel: 01179246438,No ratings yet Rate it yourself - /Services/careproviders/LeaveReview/DefaultView.aspx?id=1-124769788,0,0,,
Anglo Support and Housing Ltd,,SCL,Regus,"Castlemead, Lower Castle Street",,Bristol,,BS1 3AG,Tel: 07999784417,No ratings yet Rate it yourself - /Services/careproviders/LeaveReview/DefaultView.aspx?id=1-14380294590,0,0,,
The Wellspring Care Ltd,,SCL,"Office 344, Regus, Castlemead",Lower Castle Street,,Bristol,,BS1 3AG,Tel: 03333446061,No ratings yet Rate it yourself - /Services/careproviders/LeaveReview/DefaultView.aspx?id=1-14307907142,0,0,,
Care at Home Gloucester,,SCL,Mill Place 1,"Unit 1, 90 Bristol Road",,Gloucester,,GL1 5SQ,Tel: 01452300025,No ratings yet Rate it yourself - /Services/careproviders/LeaveReview/DefaultView.aspx?id=1-9741576810,0,0,,
Naswell Care LTD,,SCL,"Unit 2, Office 8","Morelands Trading Estate, Bristol Road",,Gloucester,Gloucestershire,GL1 5RZ,Tel: 01452722791,1 rating Rate it yourself - /Services/careproviders/LeaveReview/DefaultView.aspx?id=1-912115696,,,,
Coldbrock Healthcare,,SCL,"Corinium House, BIZSPACE","Barnwood Point, Corinium Avenue",,Gloucester,,GL4 3HX,Tel: 07387077266,1 rating Rate it yourself - /Services/careproviders/LeaveReview/DefaultView.aspx?id=1-6745369595,,,,
Aspirations Southwest Adults,,SCL,365 Corinium House,"Barnwood Point, Corinium Avenue",,Gloucester,,GL4 3HX,Tel: 01452835970,No ratings yet Rate it yourself - /Services/careproviders/LeaveReview/DefaultView.aspx?id=1-13778866709,0,0,,
Sky Vigil Care Ltd Gloucester,,SCL,"Unit 129, Corinium House","Barnwood Point, Corinium Avenue",,Gloucester,,GL4 3HX,Tel: 07775690691,No ratings yet Rate it yourself - /Services/careproviders/LeaveReview/DefaultView.aspx?id=1-13251401815,0,0,,
Divine HomeCare Solutions,,SCL,"Unit 22, Midsomer Enterprise Park","Radstock Road, Midsomer Norton",,Radstock,Avon,BA3 2BB,Tel: 01761408158,No ratings yet Rate it yourself - /Services/careproviders/LeaveReview/DefaultView.aspx?id=1-1798968179,0,0,,
Brandon Trust Support Living - Bristol and North Somerset,,SCL,"Room B1-F-14, The Park Centre",Daventry Road,,Bristol,,BS4 1DQ,,No ratings yet Rate it yourself - /Services/careproviders/LeaveReview/DefaultView.aspx?id=1-13168386742,0,0,,
Karva Care Services Limited,,SCL,Figflex Offices 31,First Floor Southgate House,,Gloucester,,GL1 1UB,Tel: 07963516914,No ratings yet Rate it yourself - /Services/careproviders/LeaveReview/DefaultView.aspx?id=1-10358952663,0,0,,
New Leaf Supported Living Limited,,SCL,"112 First Floor, North Warehouse",The Docks,,Gloucester,,GL1 2FB,Tel: 07947184270,No ratings yet Rate it yourself - /Services/careproviders/LeaveReview/DefaultView.aspx?id=1-10199602829,0,0,,
Gloucestershire,,SCL,"Suite 12, North Warehouse",Gloucester Docks,,Gloucester,,GL1 2FB,Tel: 07935473423,No ratings yet Rate it yourself - /Services/careproviders/LeaveReview/DefaultView.aspx?id=1-15125973943,0,0,,
BASELINE HEALTHCARE AND SUPPORT SERVICES LIMITED,,SCL,45-47,Longsmith Street,,Gloucester,,GL1 2HT,Tel: 07557371470,No ratings yet Rate it yourself - /Services/careproviders/LeaveReview/DefaultView.aspx?id=1-18443211430,0,0,,
My Supported Life LLP,,SCL,Bearland Lodge,47 Longsmith Street,,Gloucester,,GL1 2HT,Tel: 07306857054,No ratings yet Rate it yourself - /Services/careproviders/LeaveReview/DefaultView.aspx?id=1-18024855502,0,0,,
T2Z Care Services,,SCL,Bearland Lodge,45-47 Longsmith Street,,Gloucester,,GL1 2HT,Tel: 07498987626,No ratings yet Rate it yourself - /Services/careproviders/LeaveReview/DefaultView.aspx?id=1-7722962717,0,0,,
Within Reach,,SCL,28 Westgate Street,,,Gloucester,,GL1 2NG,Tel: 01242801201,1 rating Rate it yourself - /Services/careproviders/LeaveReview/DefaultView.aspx?id=1-8939245389,,,,
Raystra Healthcare,,SCL,1 Alvin Street,,,Gloucester,,GL1 3EJ,Tel: 01452238262,No ratings yet Rate it yourself - /Services/careproviders/LeaveReview/DefaultView.aspx?id=1-7332642791,0,0,,
Carmel Domiciliary Care Limited,,SCL,18 Worcester Street,,,Gloucester,,GL1 3AA,Tel: 07960266932,No ratings yet Rate it yourself - /Services/careproviders/LeaveReview/DefaultView.aspx?id=1-10206005895,0,0,,
State Care Solutions - Main Office,,SCL,31 Worcester Street,Conway House,,Gloucester,,GL1 3AJ,Tel: 01452699670,No ratings yet Rate it yourself - /Services/careproviders/LeaveReview/DefaultView.aspx?id=1-10490072597,0,0,,
Merry Den,,SCL,Conway House,31 Worcester Street,,Gloucester,,GL1 3AJ,Tel: 07534142118,No ratings yet Rate it yourself - /Services/careproviders/LeaveReview/DefaultView.aspx?id=1-125905909,0,0,,
New Hope Care Gloucester,,SCL,31,Worcester Street,,Gloucester,,GL1 3AJ,Tel: 01452238419,No ratings yet Rate it yourself - /Services/careproviders/LeaveReview/DefaultView.aspx?id=1-17594288547,0,0,,
Prosperity Care and Wellbeing,,SCL,"Conway House, 31-33 Worcester Street",,,Gloucester,,GL1 3AJ,Tel: 01242906569,1 rating Rate it yourself - /Services/careproviders/LeaveReview/DefaultView.aspx?id=1-10535708147,,,,
Turn Up Care Limited,,SCL,31 Worcester Street,,,Gloucester,,GL1 3AJ,Tel: 01452934994,No ratings yet Rate it yourself - /Services/careproviders/LeaveReview/DefaultView.aspx?id=1-14864721251,0,0,,
Chosen Care Supported Living,,SCL,Conway House,31 Worcester Street,,Gloucester,,GL1 3AJ,Tel: 01452520011,No ratings yet Rate it yourself - /Services/careproviders/LeaveReview/DefaultView.aspx?id=1-14486427993,0,0,,
Dohatech Healthservice,,SCL,"First Floor, 6 Salisbury Street",Amesbury,,Salisbury,,SP4 7HD,Tel: 07309122350,No ratings yet Rate it yourself - /Services/careproviders/LeaveReview/DefaultView.aspx?id=1-8995337961,0,0,,
Choice Supported Living - West,,SCL,"Unit 6, Highnam Business Centre","Newent Road, Highnam",,Gloucester,Gloucestershire,GL2 8DN,Tel: 01452768758,No ratings yet Rate it yourself - /Services/careproviders/LeaveReview/DefaultView.aspx?id=1-2847313986,0,0,,
Cherry Care Services Oxfordshire Ltd,,SCL,"Witney Business and Innovation Centre, Windrush House","Windrush Industrial Park, Burford Road",,Witney,,OX29 7DX,Tel: 01993402200,No ratings yet Rate it yourself - /Services/careproviders/LeaveReview/DefaultView.aspx?id=1-2584412931,0,0,,
Angel Care Group Limited,,SCL,Witney Business And Innovation Centre,"Windrush House, Windrush Industrial Park",,Witney,,OX29 7DX,Tel: 07496817762,1 rating Rate it yourself - /Services/careproviders/LeaveReview/DefaultView.aspx?id=1-10559087555,,,,
The ICE Centre,,SCL,Langdale Hall,Market Square,,Witney,,OX28 6AB,Tel: 01993846240,No ratings yet Rate it yourself - /Services/careproviders/LeaveReview/DefaultView.aspx?id=1-2067125279,0,0,,
TNC Healthcare Limited,,SCL,8B Market Street,,,Cinderford,,GL14 2RX,Tel: 01594829311,No ratings yet Rate it yourself - /Services/careproviders/LeaveReview/DefaultView.aspx?id=1-11829114279,0,0,,
Nurseplus UK - Andover,,SCL,Unit 5,"Westmarch Business Centre, River Way",,Andover,,SP10 1NS,Tel: 01264335007,No ratings yet Rate it yourself - /Services/careproviders/LeaveReview/DefaultView.aspx?id=1-846601869,0,0,,