Organisation Name,NACS Code,Organisation Type,Address1,Address2,Address3,Address4,Address5,PostCode,Telephone Number,NHS.UK users rating,Value  (NHS.UK users rating),Banding Classification  (NHS.UK users rating),Car parking (Is there car parking at this organisation?),Disabled access (Disabled access)
Care Cover 24/7,,SCL,"Suite B, Maple House","Kingswood Business Park, Holyhead Road, Albrighton",,Wolverhampton,,WV7 3AU,Tel: 01902255083,No ratings yet Rate it yourself - /Services/careproviders/LeaveReview/DefaultView.aspx?id=1-8406382998,0,0,,
La Petite Concierge Limited,,SCL,13B Victoria Road,,,Shifnal,Shropshire,TF11 8AF,Tel: 01952463301,No ratings yet Rate it yourself - /Services/careproviders/LeaveReview/DefaultView.aspx?id=1-2406904791,0,0,,
Office F10 James House,,SCL,Office F10 James House,"Newport Road, Albrighton",,Wolverhampton,West Midlands,WV7 3FA,Tel: 01902 244 170,No ratings yet Rate it yourself - /Services/careproviders/LeaveReview/DefaultView.aspx?id=1-2149524392,0,0,,
Peace of Mind Homecare Services,,SCL,"The Haven, New Street",Dawley,,Telford,Shropshire,TF4 3JR,,No ratings yet Rate it yourself - /Services/careproviders/LeaveReview/DefaultView.aspx?id=1-132322958,0,0,,
White Lily Care,,SCL,Richard Hall House,"Wombourne Enterprise Park, Bridgnorth Road, Wombourne",,Wolverhampton,,WV5 0AL,Tel: 01902972005,No ratings yet Rate it yourself - /Services/careproviders/LeaveReview/DefaultView.aspx?id=1-11383893198,0,0,,
Creative Support - Telford & Shropshire,,SCL,13 Buxton Road,Dawley,,Telford,,TF4 2DQ,Tel: 01952506918,No ratings yet Rate it yourself - /Services/careproviders/LeaveReview/DefaultView.aspx?id=1-8169918745,0,0,,
Paradigm Health & Social Care Limited - Telford,,SCL,Telford Business Development Centre,Stafford Park 4,,Telford,Shropshire,TF3 3BA,Tel: 08442578989,No ratings yet Rate it yourself - /Services/careproviders/LeaveReview/DefaultView.aspx?id=1-138692984,0,0,,
Win Healthcare Limited,,SCL,Suite 6 Coalport House,Stafford Park 1,,Telford,,TF3 3BD,Tel: 01952977678,No ratings yet Rate it yourself - /Services/careproviders/LeaveReview/DefaultView.aspx?id=1-14737450636,0,0,,
Komplex Community Ltd,,SCL,"Third Floor, St James House","Hollinswood Road, Central Park",,Telford,,TF2 9TZ,,No ratings yet Rate it yourself - /Services/careproviders/LeaveReview/DefaultView.aspx?id=1-13942997700,0,0,,
Jobmerger Support Services Ltd,,SCL,St. James House,"Hollinswood Road, Central Park",,Telford,,TF2 9TZ,,No ratings yet Rate it yourself - /Services/careproviders/LeaveReview/DefaultView.aspx?id=1-18218676196,0,0,,
Komplex Care Limited,,SCL,"Third Floor, St James House","Hollinswood Road, Central Park",,Telford,,TF2 9TZ,Tel: 01952 781111,1 rating Rate it yourself - /Services/careproviders/LeaveReview/DefaultView.aspx?id=1-7606930867,,,,
Empowering U (Telford & Shropshire),,SCL,3.12 Grosvenor House,Central Park,,Telford,,TF2 9TW,Tel: 01952980800,No ratings yet Rate it yourself - /Services/careproviders/LeaveReview/DefaultView.aspx?id=1-6453045924,0,0,,
Mancroft,,SCL,2 Mancroft Road,,,Wolverhampton,West Midlands,WV6 8RS,Tel: 01902742428,No ratings yet Rate it yourself - /Services/careproviders/LeaveReview/DefaultView.aspx?id=1-318519330,0,0,,
Telford,,SCL,Flat 4 - Pear Tree Apartments,"Holyhead Road, Oakengates",,Telford,,TF2 6DW,Tel: 01952613877,No ratings yet Rate it yourself - /Services/careproviders/LeaveReview/DefaultView.aspx?id=1-8512493615,0,0,,
Knoll House,,SCL,The Avenue,Penn,,Wolverhampton,West Midlands,WV4 5HW,Tel: 01902330559,No ratings yet Rate it yourself - /Services/careproviders/LeaveReview/DefaultView.aspx?id=1-2632838280,0,0,,
The Grove,,SCL,23 Sandhole Crescent,Crescent Lawley,,Telford,,TF3 5JD,Tel: 07803277643,No ratings yet Rate it yourself - /Services/careproviders/LeaveReview/DefaultView.aspx?id=1-12770669334,0,0,,
Priory Supported Living West Midlands,,SCL,6-8 Enville Road,Wall Heath,,Kingswinford,,DY6 0JT,Tel: 01384400286,No ratings yet Rate it yourself - /Services/careproviders/LeaveReview/DefaultView.aspx?id=1-4331182563,0,0,,
Rockspur House,,SCL,16 Orchard Lane,Codsall,,Wolverhampton,,WV8 1NE,,No ratings yet Rate it yourself - /Services/careproviders/LeaveReview/DefaultView.aspx?id=1-9691794362,0,0,,
Lexrae Support Ltd,,SCL,Waterloo House,Ketley Business Park,,Telford,,TF1 5JD,Tel: 01902912899,1 rating Rate it yourself - /Services/careproviders/LeaveReview/DefaultView.aspx?id=1-10528758258,,,,
Sanctuary Supported Living (Oleander House),,SCL,Ketley Park Road,Ketley,,Telford,Shropshire,TF1 5FJ,Tel: 07442530592,No ratings yet Rate it yourself - /Services/careproviders/LeaveReview/DefaultView.aspx?id=1-1979383729,0,0,,
Edgeview Nursing Home,,SCL,The Compa,"Comber Road, Kinver",,Stourbridge,West Midlands,DY7 6HT,Tel: 01384872804,No ratings yet Rate it yourself - /Services/careproviders/LeaveReview/DefaultView.aspx?id=1-113524587,0,0,,
Integra Supported Housing,,SCL,Integra Support - Office S4,"Deansgate Offices, Tettenhall Road",,Wolverhampton,,WV1 4TH,Tel: 01384288220,3 ratings Rate it yourself - /Services/careproviders/LeaveReview/DefaultView.aspx?id=1-498786000,,,,
Oak Cottage,,SCL,Oak Street,,,Wolverhampton,West Midlands,WV3 0AD,Tel: 01902212188,No ratings yet Rate it yourself - /Services/careproviders/LeaveReview/DefaultView.aspx?id=1-14213419184,0,0,,
House of the Flame Lily,,SCL,144 Penn Road,,,Wolverhampton,West Midlands,WV3 0EE,Tel: 03334560120,No ratings yet Rate it yourself - /Services/careproviders/LeaveReview/DefaultView.aspx?id=1-6592356837,0,0,,
Everready Health and Social Care Solutions,,SCL,"Unit 1 4 Badhan Court, Castle Street",Hadley,,Telford,,TF1 5QX,,No ratings yet Rate it yourself - /Services/careproviders/LeaveReview/DefaultView.aspx?id=1-9598171194,0,0,,
Cynosure Telford,,SCL,"Unit 3, Office 35, Badhan Court, Castle Street",Hadley,,Telford,,TF1 5QX,Tel: 07565876510,No ratings yet Rate it yourself - /Services/careproviders/LeaveReview/DefaultView.aspx?id=1-13828528231,0,0,,
Ignite Nursing,,SCL,Regent House,Bath Avenue,,Wolverhampton,West Midlands,WV1 4EG,,No ratings yet Rate it yourself - /Services/careproviders/LeaveReview/DefaultView.aspx?id=1-14582792368,0,0,,
Geocare Services Wolverhampton,,SCL,Regent House,Bath Avenue,,Wolverhampton,West Midlands,WV1 4EG,Tel: 01902810119,No ratings yet Rate it yourself - /Services/careproviders/LeaveReview/DefaultView.aspx?id=1-9440117254,0,0,,
Medirite Healthcare,,SCL,Regent House,Bath Avenue,,Wolverhampton,West Midlands,WV1 4EG,Tel: 01902823438,No ratings yet Rate it yourself - /Services/careproviders/LeaveReview/DefaultView.aspx?id=1-2159545366,0,0,,
Rance Healthcare Services Ltd,,SCL,84 Salop Street,3rd and 4th Floors,,Wolverhampton,,WV3 0SR,Tel: 01902973451,No ratings yet Rate it yourself - /Services/careproviders/LeaveReview/DefaultView.aspx?id=1-11775024685,0,0,,
Beyond Support Limited,,SCL,Regus 84 Salop Street,3rd & 4th floors,,Wolverhampton,,WV3 0SR,Tel: 01217924377,No ratings yet Rate it yourself - /Services/careproviders/LeaveReview/DefaultView.aspx?id=1-4187252777,0,0,,
"Whiteshed Healthcare, Wolverhampton",,SCL,84 Salop Street,"3rd & 4th Floors,",,Wolverhampton,,WV3 0SR,Tel: 07445031390,No ratings yet Rate it yourself - /Services/careproviders/LeaveReview/DefaultView.aspx?id=1-14567008830,0,0,,
Head Office,,SCL,317 Regus 3rd Floor,84 Salop Street,,Wolverhampton,,WV3 0SR,Tel: 07932028658,No ratings yet Rate it yourself - /Services/careproviders/LeaveReview/DefaultView.aspx?id=1-13945958923,0,0,,
Lovage Homecare Ltd,,SCL,"Office 424, 4th Floor, 84 Salop Street",,,Wolverhampton,,WV3 0SR,Tel: 07411757500,No ratings yet Rate it yourself - /Services/careproviders/LeaveReview/DefaultView.aspx?id=1-12903720590,0,0,,
TS Healthcare Limited,,SCL,11 Waterloo Road,,,Wolverhampton,West Midlands,WV1 4DJ,,No ratings yet Rate it yourself - /Services/careproviders/LeaveReview/DefaultView.aspx?id=1-7566958465,0,0,,
Zion Care Services Limited,,SCL,9 Waterloo Road,,,Wolverhampton,West Midlands,WV1 4DJ,Tel: 07368934880,1 rating Rate it yourself - /Services/careproviders/LeaveReview/DefaultView.aspx?id=1-10644063424,,,,
Care Angels Homecare Ltd,,SCL,9 Waterloo Road,,,Wolverhampton,West Midlands,WV1 4DJ,Tel: 01902275780,No ratings yet Rate it yourself - /Services/careproviders/LeaveReview/DefaultView.aspx?id=1-7694244777,0,0,,
Martworld Care Services Limited,,SCL,"Waterloo Court, Offices 7 & 9",31 Waterloo Road,,Wolverhampton,,WV1 4DJ,Tel: 01902256397,1 rating Rate it yourself - /Services/careproviders/LeaveReview/DefaultView.aspx?id=1-2937441998,,,,
Prayngel Healthcare Limited,,SCL,Derwent House 42-46,Waterloo Road,,Wolverhampton,,WV1 4XB,Tel: 03303909535,1 rating Rate it yourself - /Services/careproviders/LeaveReview/DefaultView.aspx?id=1-2110699995,,,,
Alie Limited,,SCL,36 Waterloo Road,,,Wolverhampton,,WV1 4BL,Tel: 07533058309,No ratings yet Rate it yourself - /Services/careproviders/LeaveReview/DefaultView.aspx?id=1-10710205051,0,0,,
Promises of Care,,SCL,80 Darlington Street,,,Wolverhampton,West Midlands,WV1 4JD,Tel: 01902587099,No ratings yet Rate it yourself - /Services/careproviders/LeaveReview/DefaultView.aspx?id=1-2501499161,0,0,,
Eden Support Ltd,,SCL,Newhampton Arts Centre,Dunkley Street,,Wolverhampton,West Midlands,WV1 4AN,Tel: 01902771778,No ratings yet Rate it yourself - /Services/careproviders/LeaveReview/DefaultView.aspx?id=1-1456310911,0,0,,
Liberty Support - Midlands,,SCL,6 Nightingale Place,Pendeford,,Wolverhampton,,WV9 5HF,Tel: 07807104674,No ratings yet Rate it yourself - /Services/careproviders/LeaveReview/DefaultView.aspx?id=1-2279487888,0,0,,
Goldcrest Healthcare Service (Midlands),,SCL,28 Cleveland Street,,,Wolverhampton,,WV1 3HT,Tel: 01902972055,No ratings yet Rate it yourself - /Services/careproviders/LeaveReview/DefaultView.aspx?id=1-10233651067,0,0,,
Blu-Sky Care Limited,,SCL,Flat 1,"Hanover House, 11 George Street",,Wolverhampton,,WV2 4DG,Tel: 01902420571,No ratings yet Rate it yourself - /Services/careproviders/LeaveReview/DefaultView.aspx?id=1-446703229,0,0,,
Swan Care Solutions,,SCL,Suite 203 Denning House,1a George Street,,Wolverhampton,,WV2 4DP,Tel: 07925665692,2 ratings Rate it yourself - /Services/careproviders/LeaveReview/DefaultView.aspx?id=1-9267859487,,,,
Lonsdale Midlands DCA,,SCL,1st Floor St. Georges House,Lever Street,,Wolverhampton,,WV2 1EZ,Tel: 01905798247,No ratings yet Rate it yourself - /Services/careproviders/LeaveReview/DefaultView.aspx?id=1-131377984,0,0,,
Santos Care Limited,,SCL,36 -38  Berry Street,,,Wolverhampton,,WV1 1HA,Tel: 01902427605,2 ratings Rate it yourself - /Services/careproviders/LeaveReview/DefaultView.aspx?id=1-12038361290,,,,
Sublime Care Solution,,SCL,Office 1-3 Pressworks,36-38 Berry Street,,Wolverhampton,,WV1 1HA,Tel: 01902239014,No ratings yet Rate it yourself - /Services/careproviders/LeaveReview/DefaultView.aspx?id=1-5987198251,0,0,,
Majestic Healthcare LTD,,SCL,"Unit 20, The Pressworks 36-38",Berry Street,,Wolverhampton,,WV1 1HA,,No ratings yet Rate it yourself - /Services/careproviders/LeaveReview/DefaultView.aspx?id=1-14234228045,0,0,,
ABC Support Limited,,SCL,Westbury House,Westbury Street,,Wolverhampton,West Midlands,WV1 1JD,Tel: 01902393940,No ratings yet Rate it yourself - /Services/careproviders/LeaveReview/DefaultView.aspx?id=1-15763848918,0,0,,
Creative Support - Wolverhampton Services,,SCL,The Boot Factory,22 Cleveland Road,,Wolverhampton,West Midlands,WV2 1BH,Tel: 01902458797,No ratings yet Rate it yourself - /Services/careproviders/LeaveReview/DefaultView.aspx?id=1-133366769,0,0,,
Complesso Healthcare Solutions,,SCL,Suite 8 The Boot Factory,22 Cleveland Road,,Wolverhampton,,WV2 1BH,Tel: 07496363510,No ratings yet Rate it yourself - /Services/careproviders/LeaveReview/DefaultView.aspx?id=1-2440773264,0,0,,
Abimatic Care Ltd,,SCL,178 Goodwood Drive,,,Wolverhampton,,WV10 6GP,Tel: 07954853554,No ratings yet Rate it yourself - /Services/careproviders/LeaveReview/DefaultView.aspx?id=1-15356238395,0,0,,
Empathy view Healthcare Services Limited,,SCL,42 Kings Road,,,Dudley,,DY3 1HP,Tel: 07984152870,No ratings yet Rate it yourself - /Services/careproviders/LeaveReview/DefaultView.aspx?id=1-14355762409,0,0,,
GSS Healthcare Ltd,,SCL,Office 13b,"York Chambers, 33 York Street",,Wolverhampton,,WV1 3RN,Tel: 07966270229,No ratings yet Rate it yourself - /Services/careproviders/LeaveReview/DefaultView.aspx?id=1-13931190885,0,0,,
Wordsley Housing and Independent Living Services,,SCL,Wordsley Housing Society,30 Brook Street,,Wordsley,West Midlands,DY8 5YW,Tel: 01384480770,No ratings yet Rate it yourself - /Services/careproviders/LeaveReview/DefaultView.aspx?id=1-136923776,0,0,,
CARE-A-LOT LIMITED,,SCL,43 Guy Avenue,,,Wolverhampton,,WV10 9SB,,No ratings yet Rate it yourself - /Services/careproviders/LeaveReview/DefaultView.aspx?id=1-12083470911,0,0,,
Varsity Healthcare Ltd,,SCL,48 Inkerman Street,,,Wolverhampton,,WV10 0EP,Tel: 07985417480,No ratings yet Rate it yourself - /Services/careproviders/LeaveReview/DefaultView.aspx?id=1-16610917399,0,0,,
Wentworth Community Care Ltd,,SCL,6 Market Place,Brewood,,Stafford,,ST19 9BS,Tel: 01902946935,No ratings yet Rate it yourself - /Services/careproviders/LeaveReview/DefaultView.aspx?id=1-12606274881,0,0,,
Inshore Support LTD - Supported Living,,SCL,Davies House Business Centre,4 Lowndes Road,,Stourbridge,,DY8 3SS,Tel: 01384421460,No ratings yet Rate it yourself - /Services/careproviders/LeaveReview/DefaultView.aspx?id=1-119800268,0,0,,
ULTICare Limited,,SCL,"The Saturn Centre, Suite 10, 2nd Floor","Spring Road, Ettingshall",,Wolverhampton,,WV4 6JX,Tel: 01902492100,No ratings yet Rate it yourself - /Services/careproviders/LeaveReview/DefaultView.aspx?id=1-2161811352,0,0,,
Caremax Support Services Ltd,,SCL,Spring Road,Ettingshall,,Wolverhampton,,WV4 6JX,,No ratings yet Rate it yourself - /Services/careproviders/LeaveReview/DefaultView.aspx?id=1-10177317455,0,0,,
The Hub,,SCL,Progress House,127 Millfields Road,,Wolverhampton,West Midlands,WV4 6JG,,No ratings yet Rate it yourself - /Services/careproviders/LeaveReview/DefaultView.aspx?id=1-6615555179,0,0,,
Clent View Domiciliary Service,,SCL,28-30 Church Street,,,Brierley Hill,West Midlands,DY5 3QD,Tel: 01384265276,No ratings yet Rate it yourself - /Services/careproviders/LeaveReview/DefaultView.aspx?id=1-113524652,0,0,,
Lily Health Care Limited,,SCL,Acorn House,23 Dudley Road,,Dudley,West Midlands,DY5 1HA,Tel: 07450986528,1 rating Rate it yourself - /Services/careproviders/LeaveReview/DefaultView.aspx?id=1-2025119557,,,,
Isabella Homes Limited,,SCL,60 Cadman Crescent,,,Wolverhampton,,WV10 0SJ,Tel: 01902687286,No ratings yet Rate it yourself - /Services/careproviders/LeaveReview/DefaultView.aspx?id=1-6973317111,0,0,,
Countywide Home Care Limited,,SCL,97a Marlpool Lane,,,Kidderminster,Worcestershire,DY11 5HP,Tel: 01562515583,No ratings yet Rate it yourself - /Services/careproviders/LeaveReview/DefaultView.aspx?id=1-113723385,0,0,,
Langstone Community Support Services,,SCL,10-12 Charter Street,Brierley Hill,,Brierley Hill,,DY5 1LA,Tel: 01384456465,No ratings yet Rate it yourself - /Services/careproviders/LeaveReview/DefaultView.aspx?id=1-9002948725,0,0,,
18 Holt Coppice,,SCL,18 Holt Coppice,Bratton,,Telford,,TF5 0DB,Tel: 07427572415,No ratings yet Rate it yourself - /Services/careproviders/LeaveReview/DefaultView.aspx?id=1-11639068086,0,0,,
Salutem Supported Living Midlands,,SCL,Alpha House,42 New Road,,Stourbridge,,DY8 1PA,Tel: 07513120310,No ratings yet Rate it yourself - /Services/careproviders/LeaveReview/DefaultView.aspx?id=1-14837988808,0,0,,
West Midlands Supported Living Service,,SCL,184 Franche Road,,,Kidderminster,Worcestershire,DY11 5AD,Tel: 01562745963,No ratings yet Rate it yourself - /Services/careproviders/LeaveReview/DefaultView.aspx?id=1-118032018,0,0,,
Healthcare 1st Choice Wolverhampton,,SCL,Planetary House,"Business Park, Planetary Road",,Willenhall,,WV13 3SW,,No ratings yet Rate it yourself - /Services/careproviders/LeaveReview/DefaultView.aspx?id=1-14246478435,0,0,,
ANIF CARE,,SCL,Planetary Business Centre,Planetary Road,,Willenhall,West Midlands,WV13 3SW,Tel: 07538825279,No ratings yet Rate it yourself - /Services/careproviders/LeaveReview/DefaultView.aspx?id=1-15977015036,0,0,,
Charis Home Care Ltd,,SCL,1 Greensand Drive,Coseley,,Bilston,,WV14 8SF,Tel: 07539739455,No ratings yet Rate it yourself - /Services/careproviders/LeaveReview/DefaultView.aspx?id=1-14443768195,0,0,,
LJM Homecare Limited,,SCL,Unit 3 Shaw House,Two Woods Lane,,Brierley Hill,West Midlands,DY5 1TA,Tel: 01384263731,2 ratings Rate it yourself - /Services/careproviders/LeaveReview/DefaultView.aspx?id=1-214452964,,,,
Orbital 4 Support Limited,,SCL,1 Clares Court,,,Kidderminster,Worcestershire,DY11 6YX,Tel: 01562742458,No ratings yet Rate it yourself - /Services/careproviders/LeaveReview/DefaultView.aspx?id=1-2060180397,0,0,,
Infinity House,,SCL,"Second Floor, Sterling House",Oldswinford,,Stourbridge,,DY8 2JL,,No ratings yet Rate it yourself - /Services/careproviders/LeaveReview/DefaultView.aspx?id=1-7542021401,0,0,,
Lorac Healthcare Limited,,SCL,2 Parsons Street,,,Dudley,West Midlands,DY1 1JJ,Tel: 01384910963,No ratings yet Rate it yourself - /Services/careproviders/LeaveReview/DefaultView.aspx?id=1-2005055184,0,0,,
Newbury Care Ltd,,SCL,193 Wolverhampton Street,2nd Floor,,Dudley,,DY1 1DU,Tel: 07885658215,No ratings yet Rate it yourself - /Services/careproviders/LeaveReview/DefaultView.aspx?id=1-11685209855,0,0,,
TLC Care at Home Ltd,,SCL,58 Load Street,,,Bewdley,Worcestershire,DY12 2AP,Tel: 01299272897,2 ratings Rate it yourself - /Services/careproviders/LeaveReview/DefaultView.aspx?id=1-2037345972,,,,
Nationwide Care Services Ltd (Dudley),,SCL,Trafalgar House,47-49 King Street,,Dudley,West Midlands,DY2 8PS,Tel: 01384211444,No ratings yet Rate it yourself - /Services/careproviders/LeaveReview/DefaultView.aspx?id=1-2773274346,0,0,,
Trum Healthcare,,SCL,"Suite 7, Trafalgar House",47-49 King Street,,Dudley,,DY2 8PS,Tel: 07445246995,No ratings yet Rate it yourself - /Services/careproviders/LeaveReview/DefaultView.aspx?id=1-17967954499,0,0,,
"Suite 6B, Anchor House",,SCL,Anchor Business Park,"New Road, Netherton",,Dudley,,DY2 9AF,Tel: 01384211141,No ratings yet Rate it yourself - /Services/careproviders/LeaveReview/DefaultView.aspx?id=1-4812364791,0,0,,
Stalwart Care Services,,SCL,56 Mattox Road,,,Wolverhampton,,WV11 3TQ,,No ratings yet Rate it yourself - /Services/careproviders/LeaveReview/DefaultView.aspx?id=1-16479521559,0,0,,
Ignite Health and Home Care Service,,SCL,10 Lion Street,,,Kidderminster,Worcestershire,DY10 1PT,Tel: 01562515073,No ratings yet Rate it yourself - /Services/careproviders/LeaveReview/DefaultView.aspx?id=1-411021458,0,0,,
Konastone Healthcare Ltd,,SCL,20 Brook House,Brook Street,,Tipton,West Midlands,DY4 9DD,,No ratings yet Rate it yourself - /Services/careproviders/LeaveReview/DefaultView.aspx?id=1-2950714022,0,0,,
Imperial Breeze Healthcare Ltd,,SCL,Office 30 Brook House,"Brook Street Business Centre, Brook Street",,Tipton,,DY4 9DD,Tel: 01217942522,No ratings yet Rate it yourself - /Services/careproviders/LeaveReview/DefaultView.aspx?id=1-5468513247,0,0,,
Precious Homes Black Country Community Services,,SCL,"Goldcrest Office, Goldcrest Court",Brewster Street,,Dudley,,DY2 0PH,Tel: 01384985820,No ratings yet Rate it yourself - /Services/careproviders/LeaveReview/DefaultView.aspx?id=1-8501704620,0,0,,
CHADD Supported Independent Living Services,,SCL,Brindley House,48-50 Hall Street,,Dudley,,DY2 7DT,Tel: 01384456465,No ratings yet Rate it yourself - /Services/careproviders/LeaveReview/DefaultView.aspx?id=1-2008449819,0,0,,
Endurance Care Worcestershire,,SCL,Suite 123 Paddington house,New Road,,Kidderminster,,DY10 1AL,Tel: 01562829115,No ratings yet Rate it yourself - /Services/careproviders/LeaveReview/DefaultView.aspx?id=1-8798479187,0,0,,
The Woodlands,,SCL,The Woodlands,Rifle Range Road,,Kidderminster,,DY11 7NN,Tel: 0156269525,No ratings yet Rate it yourself - /Services/careproviders/LeaveReview/DefaultView.aspx?id=1-15351658453,0,0,,
Taylor Made Care Ltd,,SCL,60b,Belmont Road,,Stourbridge,,DY9 8AY,Tel: 07585676812,No ratings yet Rate it yourself - /Services/careproviders/LeaveReview/DefaultView.aspx?id=1-3581046628,0,0,,
Bellamy House (Empowering U Care),,SCL,Bellamy House,Wilkes Street,,Willenhall,,WV13 2BS,Tel: 01902290600,No ratings yet Rate it yourself - /Services/careproviders/LeaveReview/DefaultView.aspx?id=1-1764191782,0,0,,
Daffodil House,,SCL,2 Spring Street,,,Tipton,,DY4 8TF,Tel: 07400166858,No ratings yet Rate it yourself - /Services/careproviders/LeaveReview/DefaultView.aspx?id=1-10291543287,0,0,,
Premiere Advantage Ltd,,SCL,206s Castlemill,Burnt Tree,,Tipton,,DY4 7UF,Tel: 07947272058,No ratings yet Rate it yourself - /Services/careproviders/LeaveReview/DefaultView.aspx?id=1-12161473956,0,0,,
Progressive Support Services Ltd,,SCL,Bizbub Castlemill,Burnt Tree,,Tipton,,DY4 7UF,Tel: 07720835967,No ratings yet Rate it yourself - /Services/careproviders/LeaveReview/DefaultView.aspx?id=1-10877228578,0,0,,
Future Home Care Ltd Birmingham,,SCL,Castlemill,Burnt Tree,,Tipton,West Midlands,DY4 7UF,Tel: 07946210997,No ratings yet Rate it yourself - /Services/careproviders/LeaveReview/DefaultView.aspx?id=1-2805173042,0,0,,
Lifeways Community Care Limited (Birmingham & Wolverhampton),,SCL,Castlemill,Burnt Tree,,Tipton,West Midlands,DY4 7UF,Tel: 01215414000,No ratings yet Rate it yourself - /Services/careproviders/LeaveReview/DefaultView.aspx?id=1-2730089873,0,0,,
SLC Paragon (Midlands),,SCL,Castlemill,Burnt Tree,,Tipton,West Midlands,DY4 7UF,Tel: 01215414003,No ratings yet Rate it yourself - /Services/careproviders/LeaveReview/DefaultView.aspx?id=1-2842257585,0,0,,
Trident Reach Domiciliary Care - Dudley & Wolverhampton Branch,,SCL,"Floor 2, South Wing","Castle Mill Building, Burnt Tree",,Tipton,,DY4 7UF,Tel: 01212265822,No ratings yet Rate it yourself - /Services/careproviders/LeaveReview/DefaultView.aspx?id=1-1526784641,0,0,,
Voyage (DCA) West Midlands,,SCL,62-72 Barnard Road,,,Wolverhampton,,WV11 2JZ,Tel: 07973720390,No ratings yet Rate it yourself - /Services/careproviders/LeaveReview/DefaultView.aspx?id=1-2141142104,0,0,,
Sunnyside Healthcare Services Limited,,SCL,22 Glebefields Road,,,Tipton,,DY4 0NZ,Tel: 07823441285,No ratings yet Rate it yourself - /Services/careproviders/LeaveReview/DefaultView.aspx?id=1-10834154931,0,0,,
Oakshed Care Ltd,,SCL,22 Penrice Drive,Tividale,,Oldbury,West Midlands,B69 1UQ,Tel: 07879423345,No ratings yet Rate it yourself - /Services/careproviders/LeaveReview/DefaultView.aspx?id=1-14765829532,0,0,,
New Leaf Healthcare Services,,SCL,West Midlands House,Gipsy Lane,,Willenhall,West Midlands,WV13 2HA,Tel: 01902212152,No ratings yet Rate it yourself - /Services/careproviders/LeaveReview/DefaultView.aspx?id=1-12060337302,0,0,,
Ameliorate Living - Main Office,,SCL,West Midlands House,Gipsy Lane,,Willenhall,West Midlands,WV13 2HA,,No ratings yet Rate it yourself - /Services/careproviders/LeaveReview/DefaultView.aspx?id=1-18392659780,0,0,,
Care Wish Ltd,,SCL,136 Halesowen Road,,,Cradley Heath,West Midlands,B64 5LP,Tel: 0121 421 3733,2 ratings Rate it yourself - /Services/careproviders/LeaveReview/DefaultView.aspx?id=1-2132665996,,,,
Dependable Care LLP,,SCL,204 Halesowen Road,,,Cradley Heath,,B64 6HN,Tel: 08000016027,No ratings yet Rate it yourself - /Services/careproviders/LeaveReview/DefaultView.aspx?id=1-3051446213,0,0,,
Monarch Home Care Services,,SCL,Regis House,223 Halesowen Road,,Cradley Heath,West Midlands,B64 6JE,Tel: 01384410829,No ratings yet Rate it yourself - /Services/careproviders/LeaveReview/DefaultView.aspx?id=1-2306622038,0,0,,
Resjes Ltd,,SCL,"Suite F3, Old Bank Business Centre","43-45 Church Street, Darlaston",,Wednesbury,,WS10 8DU,Tel: 07479882292,No ratings yet Rate it yourself - /Services/careproviders/LeaveReview/DefaultView.aspx?id=1-7374590713,0,0,,