Organisation Name,NACS Code,Organisation Type,Address1,Address2,Address3,Address4,Address5,PostCode,Telephone Number,Opening time,Value  (Opening time),Banding Classification  (Opening time),NHS.UK users rating,Value  (NHS.UK users rating),Banding Classification  (NHS.UK users rating),Electronic prescription service,Value  (Electronic prescription service),Banding Classification  (Electronic prescription service),Car parking (Is there car parking at this organisation?)
WELL,FW859,PHA,WILMSLOW HEALTH CENTRE,CHAPEL LANE,WILMSLOW,CHESHIRE,,SK9 5HX,Tel: 01625 535 663, - ,,,7 ratings Rate it yourself - /Services/pharmacies/LeaveReview/DefaultView.aspx?id=FW859,,,,Yes,yes,yes
WELL,FVC44,PHA,KENMORE MEDICAL CENTRE,60-62 ALDERLEY ROAD,WILMSLOW,CHESHIRE,,SK9 1PA,Tel: 01625 528 860, - ,,,No ratings yet Rate it yourself - /Services/pharmacies/LeaveReview/DefaultView.aspx?id=FVC44,0,0,,Yes,yes,yes
WELL,FL505,PHA,1 LINDOW PARADE,CHAPEL LANE,WILMSLOW,CHESHIRE,,SK9 5JL,Tel: 01625 525 353, - ,,,5 ratings Rate it yourself - /Services/pharmacies/LeaveReview/DefaultView.aspx?id=FL505,,,,Yes,yes,yes
Boots,FPK73,PHA,24-26 GROVE STREET,,WILMSLOW,CHESHIRE,,SK9 1DY,Tel: 01625523320, - ,,,2 ratings Rate it yourself - /Services/pharmacies/LeaveReview/DefaultView.aspx?id=FPK73,,,,Yes,yes,no
WILMSLOW PHARMACY,FE469,PHA,UNIT 2,SUMMERFIELD VILLAGE CTR,WILMSLOW,,,SK9 2TA,Tel: 01625 523414, - ,,,8 ratings Rate it yourself - /Services/pharmacies/LeaveReview/DefaultView.aspx?id=FE469,,,,Yes,yes,
CEDRICS CHEMIST,FYA25,PHA,FESTIVAL HALL,TALBOT ROAD,ALDERLEY EDGE,CHESHIRE,,SK9 7HR,Tel: 01625583145, - ,,,1 rating Rate it yourself - /Services/pharmacies/LeaveReview/DefaultView.aspx?id=FYA25,,,,Yes,yes,
CEDRICS CHEMIST,FWD81,PHA,20 London Road,Alderley Edge,Cheshire,,,SK9 7JS,Tel: 01625 583104        , - ,,,1 rating Rate it yourself - /Services/pharmacies/LeaveReview/DefaultView.aspx?id=FWD81,,,,Yes,yes,no
WELL,FX747,PHA,WELL PHARMACY,WILMSLOW ROAD,HANDFORTH,CHESHIRE,,SK9 3HL,Tel: 01625 532 902, - ,,,No ratings yet Rate it yourself - /Services/pharmacies/LeaveReview/DefaultView.aspx?id=FX747,0,0,,Yes,yes,yes
WELL,FC072,PHA,110 WILMSLOW ROAD,HANDFORTH,WILMSLOW,CHESHIRE,,SK9 3ES,Tel: 01625 523 945, - ,,,1 rating Rate it yourself - /Services/pharmacies/LeaveReview/DefaultView.aspx?id=FC072,,,,Yes,yes,yes
TESCO INSTORE PHARMACY,FGH93,PHA,KILN CROFT LANE,HANDFORTH,WILMSLOW,CHESHIRE,,SK9 3PA,Tel: 0345 6779330, - ,,,5 ratings Rate it yourself - /Services/pharmacies/LeaveReview/DefaultView.aspx?id=FGH93,,,,Yes,yes,yes
Boots,FP773,PHA,TERMINAL 1 AIRSIDE,MANCHESTER AIRPORT,MANCHESTER,,,M90 3HG,Tel: 01614379921, - ,,,1 rating Rate it yourself - /Services/pharmacies/LeaveReview/DefaultView.aspx?id=FP773,,,,Yes,yes,yes
Heald Green Pharmacy,FRA38,PHA,208 Finney Lane,Heald Green,Cheadle,Cheshire,,SK8 3QA,Tel: 0161 498 9743, - ,,,10 ratings Rate it yourself - /Services/pharmacies/LeaveReview/DefaultView.aspx?id=FRA38,,,,Yes,yes,yes
Peak Pharmacy,FPL14,PHA,202-204 FINNEY LANE,HEALD GREEN,CHEADLE,CHESHIRE,,SK8 3QA,Tel: 0161 437 1455, - ,,,2 ratings Rate it yourself - /Services/pharmacies/LeaveReview/DefaultView.aspx?id=FPL14,,,,Yes,yes,no
Pharmacy One,FTE68,PHA,262 FINNEY LANE,HEALD GREEN,CHEADLE,CHESHIRE,,SK8 3QD,Tel: 0161 4372634, - ,,,11 ratings Rate it yourself - /Services/pharmacies/LeaveReview/DefaultView.aspx?id=FTE68,,,,Yes,yes,
PORTWAY PHARMACY,FCQ78,PHA,508-510 PORTWAY,"WOODHOUSE PK,WYTHENSHAWE",MANCHESTER,,,M22 0LA,Tel: 0161 4374377, - ,,,1 rating Rate it yourself - /Services/pharmacies/LeaveReview/DefaultView.aspx?id=FCQ78,,,,Yes,yes,
Cohens Chemist,FCN68,PHA,128 HULME HALL ROAD,CHEADLE HULME,CHEADLE,CHESHIRE,,SK8 6LQ,Tel: 01614853172, - ,,,No ratings yet Rate it yourself - /Services/pharmacies/LeaveReview/DefaultView.aspx?id=FCN68,0,0,,Yes,yes,no
TURVES ROAD PHARMACY,FPL83,PHA,130 TURVES ROAD,CHEADLE HULME,CHEADLE,CHESHIRE,,SK8 6AW,Tel: 0161 4852693, - ,,,No ratings yet Rate it yourself - /Services/pharmacies/LeaveReview/DefaultView.aspx?id=FPL83,0,0,,Yes,yes,
Boots,FRA19,PHA,1A BRAMHALL LANE SOUTH,BRAMHALL,STOCKPORT, ,,SK7 1AL,Tel: 01614394012, - ,,,1 rating Rate it yourself - /Services/pharmacies/LeaveReview/DefaultView.aspx?id=FRA19,,,,Yes,yes,no
Town Lane Pharmacy,FCP97,PHA,93 Town Lane,Mobberley,Knutsford,Cheshire,,WA16 7HH,Tel: 01565 872080, - ,,,1 rating Rate it yourself - /Services/pharmacies/LeaveReview/DefaultView.aspx?id=FCP97,,,,Yes,yes,yes
Village Pharmacy,FK109,PHA,42 BRAMHALL LANE SOUTH,BRAMHALL,STOCKPORT,,,SK7 1AH,Tel: 0161 439 4025, - ,,,16 ratings Rate it yourself - /Services/pharmacies/LeaveReview/DefaultView.aspx?id=FK109,,,,Yes,yes,no
ASDA PHARMACY,FCT29,PHA,1 SWAN WALK,CIVIC CENTRE,WYTHENSHAWE,,,M22 5HZ,Tel: 0161 435 3410, - ,,,No ratings yet Rate it yourself - /Services/pharmacies/LeaveReview/DefaultView.aspx?id=FCT29,0,0,,Yes,yes,yes
Boots,FWT50,PHA,25 HALE TOP,WYTHENSHAWE,MANCHESTER,,,M22 5RN,Tel: 01614371798, - ,,,1 rating Rate it yourself - /Services/pharmacies/LeaveReview/DefaultView.aspx?id=FWT50,,,,Yes,yes,no
Listers Pharmacy,FCG28,PHA,41 Peel Hall Road,Crossacres,Wythenshawe,Manchester,,M22 5DW,Tel: 0161 437 4840, - ,,,2 ratings Rate it yourself - /Services/pharmacies/LeaveReview/DefaultView.aspx?id=FCG28,,,,Yes,yes,yes
THE PHARMACY GROUP,FNQ33,PHA,"UNIT 2, THE FORUM CENTRE",WYTHENSHAWE,MANCHESTER, ,,M22 5RX,Tel: 0161 4989716, - ,,,No ratings yet Rate it yourself - /Services/pharmacies/LeaveReview/DefaultView.aspx?id=FNQ33,0,0,,Yes,yes,
The Village Pharmacy,FNQ84,PHA,UNICORN HOUSE,PRESTBURY,MACCLESFIELD,CHESHIRE,,SK10 4DG,Tel: 01625 829216, - ,,,1 rating Rate it yourself - /Services/pharmacies/LeaveReview/DefaultView.aspx?id=FNQ84,,,,Yes,yes,yes
Centre Pharmacy,FM732,PHA,21A-22 THE SHOPPING PRECT,CHEADLE HULME,CHEADLE,CHESHIRE,,SK8 5BB,Tel: 0161 4869110, - ,,,9 ratings Rate it yourself - /Services/pharmacies/LeaveReview/DefaultView.aspx?id=FM732,,,,Yes,yes,yes
Village Pharmacy,FE543,PHA,1 Buckingham Road,Cheadle Hulme,Cheadle,Cheshire,,SK8 5EG,Tel: 0161 4853155, - ,,,22 ratings Rate it yourself - /Services/pharmacies/LeaveReview/DefaultView.aspx?id=FE543,,,,Yes,yes,
Hale Barns Pharmacy,FHE36,PHA,321 Hale Road,Hale Barns,Altrincham,Cheshire,,WA15 8SS,Tel: 0161 9805247, - ,,,No ratings yet Rate it yourself - /Services/pharmacies/LeaveReview/DefaultView.aspx?id=FHE36,0,0,,Yes,yes,
Benchill Pharmacy,FTA58,PHA,206 Hollyhedge Road,Wythenshawe,Manchester,,,M22 4QN,Tel: 0161 4286802, - ,,,5 ratings Rate it yourself - /Services/pharmacies/LeaveReview/DefaultView.aspx?id=FTA58,,,,Yes,yes,
Wythenshawe Pharmacy,FWR76,PHA,158 Hollyhedge Road,Wythenshawe,Manchester,,,M22 9UE,Tel: 0161 9456481, - ,,,No ratings yet Rate it yourself - /Services/pharmacies/LeaveReview/DefaultView.aspx?id=FWR76,0,0,,Yes,yes,
Fir Road Pharmacy,FWN23,PHA,8 Fir Road,Bramhall,Stockport,,,SK7 2NP,Tel: 0161 4391082, - ,,,8 ratings Rate it yourself - /Services/pharmacies/LeaveReview/DefaultView.aspx?id=FWN23,,,,Yes,yes,yes
WELL,FJ421,PHA,MAPLES MEDICAL CENTRE,SCOUT DRIVE,NEWALL GREEN,MANCHESTER,,M23 2SY,Tel: 0161 437 3782, - ,,,4 ratings Rate it yourself - /Services/pharmacies/LeaveReview/DefaultView.aspx?id=FJ421,,,,Yes,yes,yes
Singers Pharmacy,FN011,PHA,15 CHURCH ROAD,GATLEY,CHEADLE,CHESHIRE,,SK8 4NG,Tel: 0161 428 3047, - ,,,2 ratings Rate it yourself - /Services/pharmacies/LeaveReview/DefaultView.aspx?id=FN011,,,,Yes,yes,
Rowlands Pharmacy,FC729,PHA,10 OLD HALL ROAD,GATLEY,CHEADLE,CHESHIRE,,SK8 4BE,Tel: 0161 4283770, - ,,,2 ratings Rate it yourself - /Services/pharmacies/LeaveReview/DefaultView.aspx?id=FC729,,,,Yes,yes,no
SCORAH CHEMISTS BRAMHALL,FL495,PHA,61 NORTH PARK ROAD,BRAMHALL,STOCKPORT,CHESHIRE,,SK7 3LQ,Tel: 0161 4393744, - ,,,155 ratings Rate it yourself - /Services/pharmacies/LeaveReview/DefaultView.aspx?id=FL495,,,,Yes,yes,yes
SCORAH CHEMIST (CHEADLE) LTD,FX743,PHA,169 COUNCILLOR LANE,,CHEADLE,CHESHIRE,,SK8 2JE,Tel: 0161 428 7750, - ,,,13 ratings Rate it yourself - /Services/pharmacies/LeaveReview/DefaultView.aspx?id=FX743,,,,Yes,yes,yes
High Street Pharmacy,FMC43,PHA,7 HIGH STREET,,CHEADLE,CHESHIRE,,SK8 1AX,Tel: 0161 4911010, - ,,,6 ratings Rate it yourself - /Services/pharmacies/LeaveReview/DefaultView.aspx?id=FMC43,,,,Yes,yes,
Andrews Pharmacy,FH709,PHA,71 KENNEDY AVENUE,,MACCLESFIELD,CHESHIRE,,SK10 3DE,Tel: 01625 618481, - ,,,32 ratings Rate it yourself - /Services/pharmacies/LeaveReview/DefaultView.aspx?id=FH709,,,,Yes,yes,yes
Grove Lane Pharmacy,FXV16,PHA,186 Grove Lane,Hale,Altrincham,Cheshire,,WA15 8PU,Tel: 0161 9802424, - ,,,1 rating Rate it yourself - /Services/pharmacies/LeaveReview/DefaultView.aspx?id=FXV16,,,,Yes,yes,
Cohens Chemist,FVW86,PHA,4 PARKGATE LANE, ,KNUTSFORD,CHESHIRE,,WA16 8HG,Tel: 01565632140, - ,,,No ratings yet Rate it yourself - /Services/pharmacies/LeaveReview/DefaultView.aspx?id=FVW86,0,0,,Yes,yes,
WELL,FV704,PHA,4 Park Lane,Poynton,Stockport,Cheshire,,SK12 1RE,Tel: 01625 872 214, - ,,,8 ratings Rate it yourself - /Services/pharmacies/LeaveReview/DefaultView.aspx?id=FV704,,,,Yes,yes,yes
Rowlands Pharmacy,FVQ34,PHA,67 PARK LANE,,POYNTON,CHESHIRE,,SK12 1RD,Tel: 01625 873955, - ,,,2 ratings Rate it yourself - /Services/pharmacies/LeaveReview/DefaultView.aspx?id=FVQ34,,,,Yes,yes,no
BOWLAND PHARMACY,FDV31,PHA,52 BOWLAND ROAD,BAGULEY,,MANCHESTER,,M23 1JX,Tel: 0161 9987114, - ,,,1 rating Rate it yourself - /Services/pharmacies/LeaveReview/DefaultView.aspx?id=FDV31,,,,Yes,yes,
Adswood Pharmacy,FF385,PHA,205 GARNERS LANE,ADSWOOD,STOCKPORT,CHESHIRE,,SK3 8QJ,Tel: 0161 4832513        , - ,,,5 ratings Rate it yourself - /Services/pharmacies/LeaveReview/DefaultView.aspx?id=FF385,,,,Yes,yes,yes
WELL,FNY09,PHA,23 BOWLAND ROAD,BAGULEY,MANCHESTER, ,,M23 1JP,Tel: 0161 998 9088, - ,,,4 ratings Rate it yourself - /Services/pharmacies/LeaveReview/DefaultView.aspx?id=FNY09,,,,Yes,yes,yes
Tytherington Pharmacy,FH099,PHA,2-3 The Precinct,Tytherington,Macclesfield,Cheshire,,SK10 2HB,Tel: 01625 612993, - ,,,15 ratings Rate it yourself - /Services/pharmacies/LeaveReview/DefaultView.aspx?id=FH099,,,,Yes,yes,yes
Peak Pharmacy,FAY71,PHA,5-6 WESTON SQUARE,EARLSWAY,MACCLESFIELD,CHESHIRE,,SK11 8SS,Tel: 01625 423465        , - ,,,2 ratings Rate it yourself - /Services/pharmacies/LeaveReview/DefaultView.aspx?id=FAY71,,,,Yes,yes,yes
Cohens Chemist,FAV82,PHA,256 STOCKPORT ROAD,CHEADLE HEATH,STOCKPORT,CHESHIRE,,SK3 0RG,Tel: 01614283561, - ,,,No ratings yet Rate it yourself - /Services/pharmacies/LeaveReview/DefaultView.aspx?id=FAV82,0,0,,Yes,yes,no
Rowlands Pharmacy,FHE06,PHA,THE WATERHOUSE,WELLINGTON ROAD,BOLLINGTON,CHESHIRE,,SK10 5JH,Tel: 01625 574401        , - ,,,13 ratings Rate it yourself - /Services/pharmacies/LeaveReview/DefaultView.aspx?id=FHE06,,,,Yes,yes,yes
Rowlands Pharmacy,FA002,PHA,61 ARUNDEL AVENUE,HAZEL GROVE,STOCKPORT, ,,SK7 5LD,Tel: 0161 4838729, - ,,,2 ratings Rate it yourself - /Services/pharmacies/LeaveReview/DefaultView.aspx?id=FA002,,,,Yes,yes,yes
BROOMWOOD PHARMACY,FA565,PHA,63 BRIARFIELD ROAD,TIMPERLEY,ALTRINCHAM,CHESHIRE,,WA15 7DD,Tel: 0161 980 0869, - ,,,2 ratings Rate it yourself - /Services/pharmacies/LeaveReview/DefaultView.aspx?id=FA565,,,,Yes,yes,yes
Barry Bladon,FR189,PHA,219 Ashley Road,Hale,Altrincham,Cheshire,,WA15 9SZ,Tel: 0161 9281233, - ,,,1 rating Rate it yourself - /Services/pharmacies/LeaveReview/DefaultView.aspx?id=FR189,,,,Yes,yes,yes
Boots,FPF22,PHA,64 KING STREET,KNUTSFORD,CHESHIRE,,,WA16 6DT,Tel: 01565633114, - ,,,No ratings yet Rate it yourself - /Services/pharmacies/LeaveReview/DefaultView.aspx?id=FPF22,0,0,,Yes,yes,no
Thacker's Pharmacy,FRP10,PHA,436 ALTRINCHAM ROAD,BAGULEY,MANCHESTER,,,M23 9AB,Tel: 0161 998 3149, - ,,,4 ratings Rate it yourself - /Services/pharmacies/LeaveReview/DefaultView.aspx?id=FRP10,,,,Yes,yes,yes
Cohens Chemist,FD446,PHA,38 PRINCESS STREET, ,KNUTSFORD,CHESHIRE,,WA16 6BN,Tel: 01565633078, - ,,,No ratings yet Rate it yourself - /Services/pharmacies/LeaveReview/DefaultView.aspx?id=FD446,0,0,,Yes,yes,no
The Prescription Service,FCN20,PHA,16 PRINCESS STREET,,KNUTSFORD,,,WA16 6BU,Tel: 01565 653229, - ,,,2 ratings Rate it yourself - /Services/pharmacies/LeaveReview/DefaultView.aspx?id=FCN20,,,,Yes,yes,
WELL,FPE98,PHA,491 PALATINE ROAD,NORTHENDEN,MANCHESTER, ,,M22 4DH,Tel: 0161 945 4626, - ,,,4 ratings Rate it yourself - /Services/pharmacies/LeaveReview/DefaultView.aspx?id=FPE98,,,,Yes,yes,yes
TESCO INSTORE PHARMACY,FD095,PHA,INSTORE PHARMACY,"ALTRINCHAM RD,BAGULEY",MANCHESTER,,,M23 9TJ,Tel: 0345 6779020, - ,,,2 ratings Rate it yourself - /Services/pharmacies/LeaveReview/DefaultView.aspx?id=FD095,,,,Yes,yes,yes
WELL,FM564,PHA,352-354 PALATINE ROAD,NORTHENDEN,MANCHESTER,,,M22 4HD,Tel: 0161 998 2903, - ,,,4 ratings Rate it yourself - /Services/pharmacies/LeaveReview/DefaultView.aspx?id=FM564,,,,Yes,yes,yes
BAGULEY PHARMACY,FD700,PHA,37 PETERSFIELD DRIVE,BAGULEY,MANCHESTER, ,,M23 9PS,Tel: 0161 905 1293, - ,,,5 ratings Rate it yourself - /Services/pharmacies/LeaveReview/DefaultView.aspx?id=FD700,,,,Yes,yes,
Davenport Pharmacy,FQR46,PHA,191 Bramhall Lane,Davenport,Stockport,,,SK2 6JA,Tel: 0161 4832962        , - ,,,18 ratings Rate it yourself - /Services/pharmacies/LeaveReview/DefaultView.aspx?id=FQR46,,,,Yes,yes,
Scorah Chemists Hazel Grove,FKD04,PHA,87 MACCLESFIELD ROAD,HAZEL GROVE,STOCKPORT,CHESHIRE,,SK7 6BG,Tel: 01625 872267, - ,,,42 ratings Rate it yourself - /Services/pharmacies/LeaveReview/DefaultView.aspx?id=FKD04,,,,Yes,yes,
LLOYDSPHARMACY,FK791,PHA,99 BLOOM STREET,EDGELEY,STOCKPORT, ,,SK3 9LQ,Tel: 0161 4803162, - ,,,No ratings yet Rate it yourself - /Services/pharmacies/LeaveReview/DefaultView.aspx?id=FK791,0,0,,Yes,yes,
WELL,FQX11,PHA,238 STOCKPORT ROAD,TIMPERLEY,ALTRINCHAM,CHESHIRE,,WA15 7UN,Tel: 0161 980 4269, - ,,,4 ratings Rate it yourself - /Services/pharmacies/LeaveReview/DefaultView.aspx?id=FQX11,,,,Yes,yes,yes
Timperley Pharmacy,FJJ51,PHA,250 STOCKPORT ROAD,TIMPERLEY,ALTRINCHAM,CHESHIRE,,WA15 7UN,Tel: 0161 948 5066, - ,,,8 ratings Rate it yourself - /Services/pharmacies/LeaveReview/DefaultView.aspx?id=FJJ51,,,,Yes,yes,
Boots,FL388,PHA,82 CASTLE STREET,EDGELEY,STOCKPORT, ,,SK3 9AL,Tel: 01614803384, - ,,,No ratings yet Rate it yourself - /Services/pharmacies/LeaveReview/DefaultView.aspx?id=FL388,0,0,,Yes,yes,no
Cohens Chemist,FQH58,PHA,6 VALE VIEW,"VICARAGE LN,BOWDEN",ALTRINCHAM,CHESHIRE,,WA14 3BD,Tel: 01619299005, - ,,,2 ratings Rate it yourself - /Services/pharmacies/LeaveReview/DefaultView.aspx?id=FQH58,,,,Yes,yes,no
Cale Green Pharmacy,FNM30,PHA,145 SHAW HEATH,,STOCKPORT,CHESHIRE,,SK2 6QZ,Tel: 01614802807, - ,,,20 ratings Rate it yourself - /Services/pharmacies/LeaveReview/DefaultView.aspx?id=FNM30,,,,Yes,yes,no
Pelican Pharmacy,FVG83,PHA,LIBRARY 405 STOCKPORT RD,WEST TIMPERLEY,ALTRINCHAM,CHESHIRE,,WA15 7XR,Tel: 0161 962 4255, - ,,,1 rating Rate it yourself - /Services/pharmacies/LeaveReview/DefaultView.aspx?id=FVG83,,,,Yes,yes,yes
WELL,FM741,PHA,114 LONDON ROAD,HAZEL GROVE,STOCKPORT,CHESHIRE,,SK7 4AG,Tel: 0161 456 3260, - ,,,7 ratings Rate it yourself - /Services/pharmacies/LeaveReview/DefaultView.aspx?id=FM741,,,,Yes,yes,yes
Mai's Pharmacy,FL120,PHA,373 Buxton Road,Great Moor,Stockport,,,SK2 7EY,Tel: 0161 4833516        , - ,,,6 ratings Rate it yourself - /Services/pharmacies/LeaveReview/DefaultView.aspx?id=FL120,,,,Yes,yes,
TESCO INSTORE PHARMACY,FDC89,PHA,MANOR ROAD,ALTRINCHAM,CHESHIRE, ,,WA15 9QT,Tel: 0345 6779768, - ,,,No ratings yet Rate it yourself - /Services/pharmacies/LeaveReview/DefaultView.aspx?id=FDC89,0,0,,Yes,yes,yes
WELL,FKT49,PHA,SHAW HEATH HEALTH CENTRE,GILMORE STREET,SHAW HEATH,STOCKPORT,,SK3 8DN,Tel: 0161 477 5591, - ,,,6 ratings Rate it yourself - /Services/pharmacies/LeaveReview/DefaultView.aspx?id=FKT49,,,,Yes,yes,no
TESCO INSTORE PHARMACY,FC028,PHA,PARRS WOOD LANE,EAST DIDSBURY,MANCHESTER,,,M20 5NP,Tel: 0345 6779239, - ,,,2 ratings Rate it yourself - /Services/pharmacies/LeaveReview/DefaultView.aspx?id=FC028,,,,Yes,yes,yes
WELL,FDK67,PHA,221 LONDON ROAD,HAZEL GROVE,STOCKPORT, ,,SK7 4HS,Tel: 0161 483 3314, - ,,,4 ratings Rate it yourself - /Services/pharmacies/LeaveReview/DefaultView.aspx?id=FDK67,,,,Yes,yes,yes
BARLOW PHARMACY,FXH89,PHA,NHS CLINIC,"828 WILMSLOW RD, DIDSBURY",MANCHESTER,,,M20 2RN,Tel: 0161 4343665, - ,,,5 ratings Rate it yourself - /Services/pharmacies/LeaveReview/DefaultView.aspx?id=FXH89,,,,Yes,yes,
TESCO INSTORE PHARMACY,FYD59,PHA,TESCO SUPERSTORE,HIBEL ROAD,MACCLESFIELD,CHESHIRE,,SK10 2AB,Tel: 01625 310013, - ,,,2 ratings Rate it yourself - /Services/pharmacies/LeaveReview/DefaultView.aspx?id=FYD59,,,,Yes,yes,yes
ALLIED PHARMACY NORTHERN MOOR,FTJ03,PHA,"104 SALE RD,NORTHERN MOOR",WYTHENSHAW,MANCHESTER,,,M23 0BX,Tel: 0161 9982124, - ,,,No ratings yet Rate it yourself - /Services/pharmacies/LeaveReview/DefaultView.aspx?id=FTJ03,0,0,,Yes,yes,
Boots,FY700,PHA,12 MILL STREET MALL,THE GROSVENOR CENTRE,MACCLESFIELD,CHESHIRE,,SK11 6AJ,Tel: 01625615216, - ,,,1 rating Rate it yourself - /Services/pharmacies/LeaveReview/DefaultView.aspx?id=FY700,,,,Yes,yes,no
WELLINGTON ROAD PHARMACY,FQ350,PHA,236 WELLINGTON ROAD SOUTH,,STOCKPORT,,,SK2 6NW,Tel: 0161 4803371, - ,,,1 rating Rate it yourself - /Services/pharmacies/LeaveReview/DefaultView.aspx?id=FQ350,,,,Yes,yes,
Cohens Chemist,FX011,PHA,448 DIDSBURY ROAD,HEATON MERSEY,STOCKPORT, ,,SK4 3BS,Tel: 01614321892, - ,,,1 rating Rate it yourself - /Services/pharmacies/LeaveReview/DefaultView.aspx?id=FX011,,,,Yes,yes,no
MOORCROFT PHARMACY,FYN44,PHA,164 MOORCROFT ROAD,NORTHERN MOOR,MANCHESTER, ,,M23 0AH,Tel: 0161 998 4702, - ,,,1 rating Rate it yourself - /Services/pharmacies/LeaveReview/DefaultView.aspx?id=FYN44,,,,Yes,yes,yes
Boots,FPM98,PHA,1 STAMFORD QUARTER,GEORGE STREET,ALTRINCHAM,CHESHIRE,,WA14 1RH,Tel: 01619284471, - ,,,1 rating Rate it yourself - /Services/pharmacies/LeaveReview/DefaultView.aspx?id=FPM98,,,,Yes,yes,no
Cohens Chemist,FDN59,PHA,20 GREENWOOD STREET,ALTRINCHAM,TRAFFORD,,,WA14 1RZ,Tel: 01619291384, - ,,,1 rating Rate it yourself - /Services/pharmacies/LeaveReview/DefaultView.aspx?id=FDN59,,,,Yes,yes,no
WELL,FTH54,PHA,BOLLIN HOUSE,SUNDERLAND STREET,MACCLESFIELD,CHESHIRE,,SK11 6JL,Tel: 01625 422 927, - ,,,No ratings yet Rate it yourself - /Services/pharmacies/LeaveReview/DefaultView.aspx?id=FTH54,0,0,,Yes,yes,yes
Cohens Chemist,FXP85,PHA,WATERS GREEN MEDICAL CTR,SUNDERLAND STREET,MACCLESFIELD,CHESHIRE,,SK11 6JL,Tel: 01625664405, - ,,,32 ratings Rate it yourself - /Services/pharmacies/LeaveReview/DefaultView.aspx?id=FXP85,,,,Yes,yes,yes
WELL,FM082,PHA,209 PARK LANE,,MACCLESFIELD,CHESHIRE,,SK11 6UD,Tel: 01625 432 755, - ,,,No ratings yet Rate it yourself - /Services/pharmacies/LeaveReview/DefaultView.aspx?id=FM082,0,0,,Yes,yes,yes
Boots,FFE98,PHA,736-740 WILMSLOW ROAD,DIDSBURY,MANCHESTER,,,M20 2DW,Tel: 01614454285, - ,,,No ratings yet Rate it yourself - /Services/pharmacies/LeaveReview/DefaultView.aspx?id=FFE98,0,0,,Yes,yes,no
Carter David Disp Chemist,FMG84,PHA,1A MAPLE ROAD,BROOKLANDS,MANCHESTER,,,M23 9RL,Tel: 0161 973 8739, - ,,,5 ratings Rate it yourself - /Services/pharmacies/LeaveReview/DefaultView.aspx?id=FMG84,,,,Yes,yes,yes
HILLGATE PHARMACY,FVC74,PHA,56-58 HIGHER HILLGATE,,STOCKPORT,,,SK1 3PZ,Tel: 0161 4778564, - ,,,2 ratings Rate it yourself - /Services/pharmacies/LeaveReview/DefaultView.aspx?id=FVC74,,,,Yes,yes,
COHENS CHEMIST,FHL25,PHA,76-80 SUNDERLAND STREET,,MACCLESFIELD,CHESHIRE,,SK11 6HN,Tel: 01625 422160, - ,,,No ratings yet Rate it yourself - /Services/pharmacies/LeaveReview/DefaultView.aspx?id=FHL25,0,0,,Yes,yes,
WELL,FM024,PHA,54 HIGHER HILLGATE,HILLGATE,STOCKPORT, ,,SK1 3PX,Tel: 0161 480 4520, - ,,,1 rating Rate it yourself - /Services/pharmacies/LeaveReview/DefaultView.aspx?id=FM024,,,,Yes,yes,yes
DIAL HOUSE PHARMACY,FCL01,PHA,144 Dialstone Lane,Offerton,Stockport,Cheshire,,SK2 6AP,Tel: 0161 4565668        , - ,,,33 ratings Rate it yourself - /Services/pharmacies/LeaveReview/DefaultView.aspx?id=FCL01,,,,Yes,yes,yes
DIDSBURY PHARMACY,FL885,PHA,676 WILMSLOW ROAD,DIDSBURY,MANCHESTER,,,M20 2DN,Tel: 0161 4452492, - ,,,1 rating Rate it yourself - /Services/pharmacies/LeaveReview/DefaultView.aspx?id=FL885,,,,Yes,yes,
Tesco Instore Pharmacy,FJD64,PHA,BURNAGE LANE,BURNAGE,MANCHESTER,,,M19 1TF,Tel: 0161 602 8943, - ,,,4 ratings Rate it yourself - /Services/pharmacies/LeaveReview/DefaultView.aspx?id=FJD64,,,,Yes,yes,yes
Superdrug Pharmacy,FG096,PHA,4-6 MERSEY SQUARE,,STOCKPORT,,,SK1 1RA,Tel: 0161 480 3374, - ,,,No ratings yet Rate it yourself - /Services/pharmacies/LeaveReview/DefaultView.aspx?id=FG096,0,0,,Yes,yes,no
Cohens Chemist,FVG84,PHA,133 HEATON MOOR ROAD,HEATON MOOR,STOCKPORT,CHESHIRE,,SK4 4HY,Tel: 01614321514, - ,,,1 rating Rate it yourself - /Services/pharmacies/LeaveReview/DefaultView.aspx?id=FVG84,,,,Yes,yes,yes
Riddings Pharmacy,FDW90,PHA,38 Riddings Road,Timperley,Altrincham,Cheshire,,WA15 6BP,Tel: 0161 9732951, - ,,,1 rating Rate it yourself - /Services/pharmacies/LeaveReview/DefaultView.aspx?id=FDW90,,,,Yes,yes,yes
EVEREST PHARMACY DIDSBURY,FPR96,PHA,2A LANE END ROAD,DIDSBURY,MANCHESTER,,,M19 1WA,Tel: 0161 4328877, - ,,,1 rating Rate it yourself - /Services/pharmacies/LeaveReview/DefaultView.aspx?id=FPR96,,,,Yes,yes,
Cocker Pharmacy,FX728,PHA,155 FOG LANE,DIDSBURY,MANCHESTER, ,,M20 6FJ,Tel: 0161 4451999, - ,,,9 ratings Rate it yourself - /Services/pharmacies/LeaveReview/DefaultView.aspx?id=FX728,,,,Yes,yes,yes
Boots,FAL33,PHA,47/49 MERSEYWAY,STOCKPORT, , ,,SK1 1PU,Tel: 01614805424, - ,,,1 rating Rate it yourself - /Services/pharmacies/LeaveReview/DefaultView.aspx?id=FAL33,,,,Yes,yes,no
Broadheath Pharmacy,FHA57,PHA,70 MANCHESTER ROAD,BROADHEATH,ALTRINCHAM,CHESHIRE,,WA14 4PJ,Tel: 0161 929 7144, - ,,,No ratings yet Rate it yourself - /Services/pharmacies/LeaveReview/DefaultView.aspx?id=FHA57,0,0,,Yes,yes,no
Station Pharmacy,FLX50,PHA,102 PARK ROAD,TIMPERLEY,ALTRIINCHAM,CHESHIRE,,WA15 6TE,Tel: 01619731238, - ,,,No ratings yet Rate it yourself - /Services/pharmacies/LeaveReview/DefaultView.aspx?id=FLX50,0,0,,Yes,yes,
PARADE PHARMACY,FJ216,PHA,10 North Parade,Derbyshire Rd South,Sale,Cheshire,,M33 3JS,Tel: 0161 9732288, - ,,,8 ratings Rate it yourself - /Services/pharmacies/LeaveReview/DefaultView.aspx?id=FJ216,,,,Yes,yes,yes
Offerton Pharmacy,FPF95,PHA,513 Hempshaw Lane,Offerton,Stockport,Cheshire,,SK2 5TP,Tel: 0161 4833173, - ,,,4 ratings Rate it yourself - /Services/pharmacies/LeaveReview/DefaultView.aspx?id=FPF95,,,,Yes,yes,
Merseybank Pharmacy,FEW06,PHA,30 MERSEY BANK AVENUE,CHORLTON-CUM-HARDY,MANCHESTER, ,,M21 7NN,Tel: 0161 4457178, - ,,,1 rating Rate it yourself - /Services/pharmacies/LeaveReview/DefaultView.aspx?id=FEW06,,,,Yes,yes,no
WELL,FMF87,PHA,217 HALL STREET,OFFERTON,STOCKPORT, ,,SK1 4JG,Tel: 0161 480 3546, - ,,,9 ratings Rate it yourself - /Services/pharmacies/LeaveReview/DefaultView.aspx?id=FMF87,,,,Yes,yes,yes
Jaybee Pharmacy,FAR04,PHA,136 Lisburne Lane,Offerton,Stockport,Cheshire,,SK2 5RH,Tel: 0161 483 5496, - ,,,2 ratings Rate it yourself - /Services/pharmacies/LeaveReview/DefaultView.aspx?id=FAR04,,,,Yes,yes,yes
Asda Pharmacy,FV018,PHA,WARREN STREET,,STOCKPORT,,,SK1 1UA,Tel: 0161 429 3718, - ,,,1 rating Rate it yourself - /Services/pharmacies/LeaveReview/DefaultView.aspx?id=FV018,,,,Yes,yes,yes
Sterling Pharmacy,FCT06,PHA,103 LAPWING LANE,WEST DIDSBURY,MANCHESTER, ,,M20 6UR,Tel: 0161 445 3753, - ,,,11 ratings Rate it yourself - /Services/pharmacies/LeaveReview/DefaultView.aspx?id=FCT06,,,,Yes,yes,yes
Cohens Chemist,FQM56,PHA,76 BELMONT STREET,HEATON NORRIS,STOCKPORT,,,SK4 1LX,Tel: 01614773355, - ,,,3 ratings Rate it yourself - /Services/pharmacies/LeaveReview/DefaultView.aspx?id=FQM56,,,,Yes,yes,yes
London Road Pharmacy,FD484,PHA,UNIT 1,157 LONDON ROAD,MACCLESFIELD,CHESHIRE,,SK11 7SP,Tel: 01625 617331, - ,,,4 ratings Rate it yourself - /Services/pharmacies/LeaveReview/DefaultView.aspx?id=FD484,,,,Yes,yes,
Terry's Chemist,FNX56,PHA,28 SINDERLAND ROAD,,ALTRINCHAM,CHESHIRE,,WA14 5ET,Tel: 0161 9281275, - ,,,3 ratings Rate it yourself - /Services/pharmacies/LeaveReview/DefaultView.aspx?id=FNX56,,,,Yes,yes,yes