Organisation Name,NACS Code,Organisation Type,Address1,Address2,Address3,Address4,Address5,PostCode,Telephone Number,Opening time,Value  (Opening time),Banding Classification  (Opening time),NHS.UK users rating,Value  (NHS.UK users rating),Banding Classification  (NHS.UK users rating),Electronic prescription service,Value  (Electronic prescription service),Banding Classification  (Electronic prescription service),Car parking (Is there car parking at this organisation?)
Mottingham Pharmacy (Jarman & Dixon),FC313,PHA,71-73 Mottingham Road,,,London,,SE9 4QZ,Tel: 020 88577566, - ,,,No ratings yet Rate it yourself - /Services/pharmacies/LeaveReview/DefaultView.aspx?id=FC313,0,0,,Yes,yes,
Brook Pharmacy,FPJ12,PHA,109 Chinbrook Road,Lewisham,London,,,SE12 9QL,Tel: 020 88578980        , - ,,,No ratings yet Rate it yourself - /Services/pharmacies/LeaveReview/DefaultView.aspx?id=FPJ12,0,0,,Yes,yes,yes
WELL,FL803,PHA,2 THE MOUND,,MOTTINGHAM,LONDON,,SE9 3AZ,Tel: 0208 857 0137, - ,,,No ratings yet Rate it yourself - /Services/pharmacies/LeaveReview/DefaultView.aspx?id=FL803,0,0,,Yes,yes,yes
Newmarket Pharmacy,FJW12,PHA,13 Newmarket Green,,Eltham,London,,SE9 5ER,Tel: 020 8850 8863, - ,,,No ratings yet Rate it yourself - /Services/pharmacies/LeaveReview/DefaultView.aspx?id=FJW12,0,0,,Yes,yes,yes
Rey Pharmacy,FGV05,PHA,735 Sidcup Road,,New Eltham,London,,SE9 3SA,Tel: 0208 8501989, - ,,,No ratings yet Rate it yourself - /Services/pharmacies/LeaveReview/DefaultView.aspx?id=FGV05,0,0,,Yes,yes,yes
GROVE PARK PHARMACY,FJ566,PHA,344 BARING ROAD,GROVE PARK,LONDON,,,SE12 0DU,Tel: 02088575904, - ,,,No ratings yet Rate it yourself - /Services/pharmacies/LeaveReview/DefaultView.aspx?id=FJ566,0,0,,Yes,yes,yes
Harris Chemist,FDK93,PHA,372 BARING ROAD,GROVE PARK,LONDON,,,SE12 0EF,Tel: 02088574371, - ,,,No ratings yet Rate it yourself - /Services/pharmacies/LeaveReview/DefaultView.aspx?id=FDK93,0,0,,Yes,yes,
WELL,FHC98,PHA,27 COURT YARD,ELTHAM,LONDON, ,,SE9 5PR,Tel: 0208 859 6908, - ,,,No ratings yet Rate it yourself - /Services/pharmacies/LeaveReview/DefaultView.aspx?id=FHC98,0,0,,Yes,yes,no
Boots,FPV87,PHA,96-104 ELTHAM HIGH STREET,ELTHAM,LONDON, ,,SE9 1BW,Tel: 02088502054, - ,,,No ratings yet Rate it yourself - /Services/pharmacies/LeaveReview/DefaultView.aspx?id=FPV87,0,0,,Yes,yes,no
Stevens Pharmacy,FK062,PHA,379 FOOTSCRAY ROAD,,NEW ELTHAM,LONDON,,SE9 2DR,Tel: 020 88501593, - ,,,No ratings yet Rate it yourself - /Services/pharmacies/LeaveReview/DefaultView.aspx?id=FK062,0,0,,Yes,yes,yes
Gokul Chemist,FMT20,PHA,53 BARING ROAD,LEE,LONDON, ,,SE12 0JS,Tel: 0208 851 0572, - ,,,No ratings yet Rate it yourself - /Services/pharmacies/LeaveReview/DefaultView.aspx?id=FMT20,0,0,,Yes,yes,yes
Boots,FDX70,PHA,125 BURNT ASH LANE, ,BROMLEY,KENT,,BR1 5AB,Tel: 02082901233, - ,,,No ratings yet Rate it yourself - /Services/pharmacies/LeaveReview/DefaultView.aspx?id=FDX70,0,0,,Yes,yes,no
Mangal Pharmacy,FFG07,PHA,71 Sherard Road,Eltham,,London,,SE9 6ER,Tel: 020 8859 0036, - ,,,No ratings yet Rate it yourself - /Services/pharmacies/LeaveReview/DefaultView.aspx?id=FFG07,0,0,,Yes,yes,yes
DAY LEWIS PHARMACY,FTV69,PHA,443 DOWNHAM WAY,DOWNHAM,BROMLEY,KENT,,BR1 5HS,Tel: 02086972615, - ,,,No ratings yet Rate it yourself - /Services/pharmacies/LeaveReview/DefaultView.aspx?id=FTV69,0,0,,Yes,yes,yes
ELTHAM PHARMACY,FXE81,PHA,560 WESTHORNE AVENUE,,ELTHAM,LONDON,,SE9 6DR,Tel: 020 88501944, - ,,,No ratings yet Rate it yourself - /Services/pharmacies/LeaveReview/DefaultView.aspx?id=FXE81,0,0,,Yes,yes,
Williams Lm (Chislehurst) Ltd,FVF13,PHA,89-93 HIGH STREET,CHISLEHURST,KENT, ,,BR7 5AG,Tel: 020 8467 8229, - ,,,No ratings yet Rate it yourself - /Services/pharmacies/LeaveReview/DefaultView.aspx?id=FVF13,0,0,,Yes,yes,yes
Mangal Pharmacy,FPC00,PHA,59 WELL HALL ROAD,ELTHAM,LONDON, ,,SE9 6SZ,Tel: 020 8850 6860, - ,,,No ratings yet Rate it yourself - /Services/pharmacies/LeaveReview/DefaultView.aspx?id=FPC00,0,0,,Yes,yes,yes
POND PHARMACY,FE213,PHA,59 HIGH STREET,CHISLEHURST,,KENT,,BR7 5AF,Tel: 020 84698358, - ,,,No ratings yet Rate it yourself - /Services/pharmacies/LeaveReview/DefaultView.aspx?id=FE213,0,0,,Yes,yes,
Lee Pharmacy,FJK64,PHA,19 BURNT ASH HILL,LEE,LONDON,,,SE12 0AA,Tel: 020 8857 4265, - ,,,No ratings yet Rate it yourself - /Services/pharmacies/LeaveReview/DefaultView.aspx?id=FJK64,0,0,,Yes,yes,yes
Dickinson Chemist,FPM41,PHA,130 WESTMOUNT ROAD,ELTHAM,LONDON,,,SE9 1UT,Tel: 02088501350, - ,,,No ratings yet Rate it yourself - /Services/pharmacies/LeaveReview/DefaultView.aspx?id=FPM41,0,0,,Yes,yes,yes
Cambelle Chemist,FT872,PHA,83-85 BOUNDFIELD ROAD,,CATFORD,LONDON,,SE6 1PH,Tel: 020 86970709, - ,,,No ratings yet Rate it yourself - /Services/pharmacies/LeaveReview/DefaultView.aspx?id=FT872,0,0,,Yes,yes,
SOUTHCOTT CHEMIST,FD537,PHA,281 MAIN ROAD,SIDCUP,KENT, ,,DA14 6QL,Tel: 020 8300 1304, - ,,,No ratings yet Rate it yourself - /Services/pharmacies/LeaveReview/DefaultView.aspx?id=FD537,0,0,,Yes,yes,
TOUCHWOOD PHARMACY,FJW74,PHA,84A LONDON LANE, ,BROMLEY,KENT,,BR1 4HE,Tel: 020 82498255, - ,,,No ratings yet Rate it yourself - /Services/pharmacies/LeaveReview/DefaultView.aspx?id=FJW74,0,0,,Yes,yes,
Chemcare Pharmacy,FY283,PHA,12 PEGLER SQUARE,,KIDBROOKE,LONDON,,SE3 9GR,Tel: 020 8856 0134, - ,,,No ratings yet Rate it yourself - /Services/pharmacies/LeaveReview/DefaultView.aspx?id=FY283,0,0,,Yes,yes,yes
Targett Chemist,FY261,PHA,172 HALFWAY STREET,SIDCUP,KENT, ,,DA15 8DJ,Tel: 02083002940, - ,,,No ratings yet Rate it yourself - /Services/pharmacies/LeaveReview/DefaultView.aspx?id=FY261,0,0,,Yes,yes,yes
AVERY PHARMACY,FQW82,PHA,192 BEXLEY ROAD,,ELTHAM,LONDON,,SE9 2PH,Tel: 020 88501138, - ,,,No ratings yet Rate it yourself - /Services/pharmacies/LeaveReview/DefaultView.aspx?id=FQW82,0,0,,Yes,yes,
CATFORD PHARMACY,FEC26,PHA,185 TORRIDON ROAD,,CATFORD,LONDON,,SE6 1RG,Tel: 020 86981625, - ,,,No ratings yet Rate it yourself - /Services/pharmacies/LeaveReview/DefaultView.aspx?id=FEC26,0,0,,Yes,yes,
Chislehurst Pharmacy,FC896,PHA,59 CHISLEHURST ROAD,,CHISLEHURST,KENT,,BR7 5NP,Tel: 0208 295 0017, - ,,,No ratings yet Rate it yourself - /Services/pharmacies/LeaveReview/DefaultView.aspx?id=FC896,0,0,,Yes,yes,yes
LORDS PHARMACY LTD,FY745,PHA,428 LEE HIGH ROAD,,LEE GREEN,LONDON,,SE12 8RW,Tel: 02088526292, - ,,,No ratings yet Rate it yourself - /Services/pharmacies/LeaveReview/DefaultView.aspx?id=FY745,0,0,,Yes,yes,yes
Day Lewis Pharmacy,FD505,PHA,195 WIDMORE ROAD, ,BROMLEY,KENT,,BR1 2RG,Tel: 02084600346, - ,,,No ratings yet Rate it yourself - /Services/pharmacies/LeaveReview/DefaultView.aspx?id=FD505,0,0,,Yes,yes,yes
THAMES VIEW HEALTH LIMITED,FVQ67,PHA,481-483 BROMLEY ROAD,DOWNHAM,BROMLEY,KENT,,BR1 4PQ,Tel: 020 86976677, - ,,,No ratings yet Rate it yourself - /Services/pharmacies/LeaveReview/DefaultView.aspx?id=FVQ67,0,0,,Yes,yes,
DAY LEWIS PHARMACY,FMG01,PHA,467 BROMLEY ROAD,DOWNHAM,BROMLEY,KENT,,BR1 4PH,Tel: 02086983160, - ,,,No ratings yet Rate it yourself - /Services/pharmacies/LeaveReview/DefaultView.aspx?id=FMG01,0,0,,Yes,yes,yes
Duncans Chemist,FML90,PHA,24 BROMLEY HILL,DOWNHAM,BROMLEY,KENT,,BR1 4JX,Tel: 0208 460 1425, - ,,,No ratings yet Rate it yourself - /Services/pharmacies/LeaveReview/DefaultView.aspx?id=FML90,0,0,,Yes,yes,yes
Roopson Pharmacy,FE289,PHA,422 WELL HALL ROAD, ,ELTHAM,LONDON,,SE9 6UD,Tel: 020 88563366, - ,,,No ratings yet Rate it yourself - /Services/pharmacies/LeaveReview/DefaultView.aspx?id=FE289,0,0,,Yes,yes,yes
Rains Pharmacy,FJX60,PHA,"UNIT 52, OLD BISCUIT FAC.",9 STAPLEHURST ROAD,HITHER GREEN,LONDON,,SE13 5ND,Tel: 020 88522402, - ,,,No ratings yet Rate it yourself - /Services/pharmacies/LeaveReview/DefaultView.aspx?id=FJX60,0,0,,Yes,yes,yes
LEWISHAM PHARMACY,FTF05,PHA,324 LEE HIGH ROAD,,,LONDON,,SE13 5PJ,Tel: 020 8852 7438, - ,,,No ratings yet Rate it yourself - /Services/pharmacies/LeaveReview/DefaultView.aspx?id=FTF05,0,0,,Yes,yes,yes
Kidbrooke Pharmacy,FKK84,PHA,134 Rochester Way,Kidbrooke,Blackheath,London,,SE3 8AR,Tel: 020 83190115, - ,,,No ratings yet Rate it yourself - /Services/pharmacies/LeaveReview/DefaultView.aspx?id=FKK84,0,0,,Yes,yes,yes
Caxton Pharmacy,FKE53,PHA,3 WIDMORE ROAD,BROMLEY,KENT, ,,BR1 1RL,Tel: 020 8460 0377, - ,,,No ratings yet Rate it yourself - /Services/pharmacies/LeaveReview/DefaultView.aspx?id=FKE53,0,0,,Yes,yes,yes
Woodlands Pharmacy,FQP73,PHA,Woodlands Health Centre,4 Edwin Hall Place,,London,,SE13 6RN,Tel: 020 86971798, - ,,,No ratings yet Rate it yourself - /Services/pharmacies/LeaveReview/DefaultView.aspx?id=FQP73,0,0,,Yes,yes,
Widdicombe Chemist,FNW34,PHA,220 HITHER GREEN LANE,LONDON, , ,,SE13 6RT,Tel: 0208 852 0882, - ,,,No ratings yet Rate it yourself - /Services/pharmacies/LeaveReview/DefaultView.aspx?id=FNW34,0,0,,Yes,yes,
VANTAGE PHARMACY,FW715,PHA,HEALTH CTR ANNEX BUILDING,108-114 CONISBOROUGH CRES,CATFORD,LONDON,,SE6 2SP,Tel: 0208 461 1130, - ,,,No ratings yet Rate it yourself - /Services/pharmacies/LeaveReview/DefaultView.aspx?id=FW715,0,0,,Yes,yes,yes
Boots,FM350,PHA,234 THE GLADES,"SHOPPING CENTRE, HIGH ST",BROMLEY,KENT,,BR1 1HD,Tel: 02084640231, - ,,,No ratings yet Rate it yourself - /Services/pharmacies/LeaveReview/DefaultView.aspx?id=FM350,0,0,,Yes,yes,yes
Baum Pharmacy,FDW13,PHA,10-12 Manor Park Parade,Lee High Road,Lewisham,London,,SE13 5PB,Tel: 020 88521374, - ,,,No ratings yet Rate it yourself - /Services/pharmacies/LeaveReview/DefaultView.aspx?id=FDW13,0,0,,Yes,yes,yes
Boots,FAH85,PHA,UNIT B,77-81 HIGH STREET,BROMLEY,KENT,,BR1 1JY,Tel: 02082906958, - ,,,No ratings yet Rate it yourself - /Services/pharmacies/LeaveReview/DefaultView.aspx?id=FAH85,0,0,,Yes,yes,no
ROADNIGHT CHEMISTS,FMF67,PHA,88 STATION ROAD, ,SIDCUP,KENT,,DA15 7DU,Tel: 020 83002632, - ,,,No ratings yet Rate it yourself - /Services/pharmacies/LeaveReview/DefaultView.aspx?id=FMF67,0,0,,Yes,yes,yes
PAYDENS PHARMACY,FY475,PHA,14 Montpelier Vale,Blackheath,,London,,SE3 0TA,Tel: 020 88520248        , - ,,,No ratings yet Rate it yourself - /Services/pharmacies/LeaveReview/DefaultView.aspx?id=FY475,0,0,,Yes,yes,no
Olins Pharmacy,FHR27,PHA,3 THE OVAL,,SIDCUP,KENT,,DA15 9ER,Tel: 020 83002851        , - ,,,No ratings yet Rate it yourself - /Services/pharmacies/LeaveReview/DefaultView.aspx?id=FHR27,0,0,,Yes,yes,Data not available
Scotts Pharmacy,FVR97,PHA,7 HIGH STREET,BROMLEY,KENT, ,,BR1 1LF,Tel: 020 84603431        , - ,,,No ratings yet Rate it yourself - /Services/pharmacies/LeaveReview/DefaultView.aspx?id=FVR97,0,0,,Yes,yes,no
Falconwood Pharmacy,FE097,PHA,3 FALCONWOOD PARADE, ,WELLING,KENT,,DA16 2PL,Tel: 02083037064, - ,,,No ratings yet Rate it yourself - /Services/pharmacies/LeaveReview/DefaultView.aspx?id=FE097,0,0,,Yes,yes,yes
Boots,FE434,PHA,56-58 SIDCUP HIGH STREET,SIDCUP,KENT, ,,DA14 6EH,Tel: 02083003249, - ,,,No ratings yet Rate it yourself - /Services/pharmacies/LeaveReview/DefaultView.aspx?id=FE434,0,0,,Yes,yes,no
Masters Pharmacy,FQR61,PHA,176 Shooters Hill Road,,Blackheath,London,,SE3 8RP,Tel: 020 88561104, - ,,,No ratings yet Rate it yourself - /Services/pharmacies/LeaveReview/DefaultView.aspx?id=FQR61,0,0,,Yes,yes,yes
Aspire Pharmacy,FFT84,PHA,23 High Street,Sidcup,Bexley,Kent,,DA14 6EQ,Tel: 020 83002008, - ,,,No ratings yet Rate it yourself - /Services/pharmacies/LeaveReview/DefaultView.aspx?id=FFT84,0,0,,Yes,yes,
BROWNES CHEMIST,FX094,PHA,252 BLACKFEN ROAD,BLACKFEN,SIDCUP,KENT,,DA15 8PW,Tel: 020 83012621, - ,,,No ratings yet Rate it yourself - /Services/pharmacies/LeaveReview/DefaultView.aspx?id=FX094,0,0,,Yes,yes,
St.johns Pharmacy,FQ835,PHA,16 HIGH STREET,,SIDCUP,KENT,,DA14 6EH,Tel: 02083091687, - ,,,No ratings yet Rate it yourself - /Services/pharmacies/LeaveReview/DefaultView.aspx?id=FQ835,0,0,,Yes,yes,yes
Rushey Green Pharmacy,FNE37,PHA,THE PRIMARY CARE CENTRE,HAWSTEAD ROAD,CATFORD,LONDON,,SE6 4JH,Tel: 02071381790, - ,,,No ratings yet Rate it yourself - /Services/pharmacies/LeaveReview/DefaultView.aspx?id=FNE37,0,0,,Yes,yes,no
SUPERDRUG PHARMACY,FT015,PHA,138-140 RUSHEY GREEN,CATFORD,LONDON,,,SE6 4HQ,Tel: 020 86906482        , - ,,,No ratings yet Rate it yourself - /Services/pharmacies/LeaveReview/DefaultView.aspx?id=FT015,0,0,,Yes,yes,no
DAY LEWIS PHARMACY,FP029,PHA,253 WESTWOOD LANE,BLACKFEN,SIDCUP,KENT,,DA15 9PS,Tel: 02083033799, - ,,,No ratings yet Rate it yourself - /Services/pharmacies/LeaveReview/DefaultView.aspx?id=FP029,0,0,,Yes,yes,yes
SHEEL PHARMACY LEWISHAM,FLY01,PHA,296-298 LEWISHAM HIGH ST,,LEWISHAM,LONDON,,SE13 6JZ,Tel: 020 8690 1311, - ,,,No ratings yet Rate it yourself - /Services/pharmacies/LeaveReview/DefaultView.aspx?id=FLY01,0,0,,Yes,yes,no
Lewis Grove Pharmacy,FVA74,PHA,1 LEWIS GROVE,,LEWISHAM,LONDON,,SE13 6BG,Tel: 020 88522282, - ,,,No ratings yet Rate it yourself - /Services/pharmacies/LeaveReview/DefaultView.aspx?id=FVA74,0,0,,Yes,yes,yes
Bellegrove Pharmacy,FX263,PHA,225 BELLEGROVE ROAD, ,WELLING,KENT,,DA16 3RQ,Tel: 020 88561973, - ,,,No ratings yet Rate it yourself - /Services/pharmacies/LeaveReview/DefaultView.aspx?id=FX263,0,0,,Yes,yes,yes
PYRAMID PHARMACY,FFA12,PHA,22 OLD DOVER ROAD,BLACKHEATH,GREENWICH,LONDON,,SE3 7BT,Tel: 020 88580059, - ,,,No ratings yet Rate it yourself - /Services/pharmacies/LeaveReview/DefaultView.aspx?id=FFA12,0,0,,Yes,yes,
Boots,FC300,PHA,72-78 LEWISHAM HIGH ST.,LONDON, , ,,SE13 5JN,Tel: 02088524611, - ,,,No ratings yet Rate it yourself - /Services/pharmacies/LeaveReview/DefaultView.aspx?id=FC300,0,0,,Yes,yes,yes
WALLACE PRING & CO,FTK32,PHA,40 CHATTERTON ROAD,,BROMLEY,KENT,,BR2 9QE,Tel: 020 84601897, - ,,,No ratings yet Rate it yourself - /Services/pharmacies/LeaveReview/DefaultView.aspx?id=FTK32,0,0,,Yes,yes,no
Charlton Pharmacy,FVG96,PHA,229 Charlton Road,,Charlton,London,,SE7 7ED,Tel: 020 88588753, - ,,,No ratings yet Rate it yourself - /Services/pharmacies/LeaveReview/DefaultView.aspx?id=FVG96,0,0,,Yes,yes,yes
Blackheath Standard Pharmacy,FNP06,PHA,182 Westcombe Hill,,Blackheath,London,,SE3 7DH,Tel: 0208 858 0443, - ,,,No ratings yet Rate it yourself - /Services/pharmacies/LeaveReview/DefaultView.aspx?id=FNP06,0,0,,Yes,yes,
Seven Day Chemist,FXN89,PHA,175A BELLEGROVE ROAD,WELLING,KENT, ,,DA16 3QS,Tel: 020 8301 1800, - ,,,No ratings yet Rate it yourself - /Services/pharmacies/LeaveReview/DefaultView.aspx?id=FXN89,0,0,,Yes,yes,yes
GORDON DAVIE CHEMIST LTD,FT918,PHA,195 SOUTHBOROUGH LANE,,BROMLEY,KENT,,BR2 8AR,Tel: 02084673835, - ,,,No ratings yet Rate it yourself - /Services/pharmacies/LeaveReview/DefaultView.aspx?id=FT918,0,0,,Yes,yes,yes
Sheel Pharmacy,FQK49,PHA,312-314 LEWISHAM ROAD, ,LEWISHAM,LONDON,,SE13 7PA,Tel: 020 82971551, - ,,,No ratings yet Rate it yourself - /Services/pharmacies/LeaveReview/DefaultView.aspx?id=FQK49,0,0,,Yes,yes,
AKASI PHARMACY,FW698,PHA,15 BROMLEY ROAD,,BECKENHAM,KENT,,BR3 5NT,Tel: 020 86501731, - ,,,No ratings yet Rate it yourself - /Services/pharmacies/LeaveReview/DefaultView.aspx?id=FW698,0,0,,Yes,yes,yes
Grove Pharmacy,FPC93,PHA,17 THE VILLAGE, ,CHARLTON,LONDON,,SE7 8UG,Tel: 02088583440, - ,,,No ratings yet Rate it yourself - /Services/pharmacies/LeaveReview/DefaultView.aspx?id=FPC93,0,0,,Yes,yes,yes
THE VILLAGE PHARMACY,FXF89,PHA,9 THE VILLAGE,,CHARLTON,LONDON,,SE7 8UG,Tel: 020 88580907, - ,,,No ratings yet Rate it yourself - /Services/pharmacies/LeaveReview/DefaultView.aspx?id=FXF89,0,0,,Yes,yes,
Ladywell Pharmacy,FK081,PHA,HILLY FIELDS MEDICAL CTR.,172-174 ADELAIDE AVENUE, ,LONDON,,SE4 1JN,Tel: 020 8690 0327, - ,,,No ratings yet Rate it yourself - /Services/pharmacies/LeaveReview/DefaultView.aspx?id=FK081,0,0,,Yes,yes,yes
TOUCHWOOD PHARMACY,FQT14,PHA,9 ST GEORGES PARADE,WOOLSTONE ROAD, ,LONDON,,SE6 4DT,Tel: 020 86992323, - ,,,No ratings yet Rate it yourself - /Services/pharmacies/LeaveReview/DefaultView.aspx?id=FQT14,0,0,,Yes,yes,no
Herbert Pharmacy,FDQ41,PHA,36-38 HERBERT ROAD,PLUMSTEAD,LONDON, ,,SE18 3SH,Tel: 02088543530, - ,,,No ratings yet Rate it yourself - /Services/pharmacies/LeaveReview/DefaultView.aspx?id=FDQ41,0,0,,Yes,yes,
Weston Pharmacy,FWM57,PHA,60 HERBERT ROAD,,PLUMSTEAD,LONDON,,SE18 3SH,Tel: 020 88541064        , - ,,,No ratings yet Rate it yourself - /Services/pharmacies/LeaveReview/DefaultView.aspx?id=FWM57,0,0,,Yes,yes,
Mistvale Chemist,FYQ93,PHA,138-140 WELLING HIGH ST,,WELLING,KENT,,DA16 1TJ,Tel: 020 8617 0838, - ,,,No ratings yet Rate it yourself - /Services/pharmacies/LeaveReview/DefaultView.aspx?id=FYQ93,0,0,,Yes,yes,no
Neem Tree Welling Pharmacy,FKC93,PHA,109-111 Welling High St,,Welling,Kent,,DA16 1TY,Tel: 020 83034824, - ,,,No ratings yet Rate it yourself - /Services/pharmacies/LeaveReview/DefaultView.aspx?id=FKC93,0,0,,Yes,yes,
Hollytree Pharmacy,FLD66,PHA,2 Hollytree Parade,"Sidcup Hill,Footscray",Sidcup,Kent,,DA14 6JR,Tel: 020 8300 6857, - ,,,No ratings yet Rate it yourself - /Services/pharmacies/LeaveReview/DefaultView.aspx?id=FLD66,0,0,,Yes,yes,
Geepharm Chemists,FCK76,PHA,36 PLUMSTEAD COMMON ROAD,PLUMSTEAD,LONDON, ,,SE18 3TN,Tel: 020 8316 7355, - ,,,No ratings yet Rate it yourself - /Services/pharmacies/LeaveReview/DefaultView.aspx?id=FCK76,0,0,,Yes,yes,yes
CRAY HILL CHEMIST,FTK80,PHA,88 Cotmandene Crescent,St Pauls Cray,Orpington,Kent,,BR5 2RG,Tel: 020 83007341        , - ,,,No ratings yet Rate it yourself - /Services/pharmacies/LeaveReview/DefaultView.aspx?id=FTK80,0,0,,Yes,yes,no
Rowlands Pharmacy,FJV12,PHA,121 WESTMORELAND ROAD,,BROMLEY,KENT,,BR2 0TY,Tel: 0208 4604249, - ,,,No ratings yet Rate it yourself - /Services/pharmacies/LeaveReview/DefaultView.aspx?id=FJV12,0,0,,Yes,yes,yes
SUPERDRUG PHARMACY,FG099,PHA,190-192 HIGH STREET,,BECKENHAM,KENT,,BR3 1AY,Tel: 020 86583205, - ,,,No ratings yet Rate it yourself - /Services/pharmacies/LeaveReview/DefaultView.aspx?id=FG099,0,0,,Yes,yes,yes
Farrants(Excel Pharmacies),FGG04,PHA,13 Station Square,Petts Wood,Orpington,Kent,,BR5 1LY,Tel: 01689 820949, - ,,,No ratings yet Rate it yourself - /Services/pharmacies/LeaveReview/DefaultView.aspx?id=FGG04,0,0,,Yes,yes,no
WELL,FCE42,PHA,CWS SUPERSTORE,71-79 HIGH STREET,WELLING,KENT,,DA16 1TU,Tel: 0208 303 1551, - ,,,No ratings yet Rate it yourself - /Services/pharmacies/LeaveReview/DefaultView.aspx?id=FCE42,0,0,,Yes,yes,yes
Boots,FC864,PHA,77 QUEENSWAY,PETTS WOOD,ORPINGTON,KENT,,BR5 1DQ,Tel: 01689821573, - ,,,No ratings yet Rate it yourself - /Services/pharmacies/LeaveReview/DefaultView.aspx?id=FC864,0,0,,Yes,yes,no
Petts Wood Pharmacy,FR247,PHA,83 QUEENSWAY,PETTS WOOD,ORPINGTON,KENT,,BR5 1DQ,Tel: 01689 898580, - ,,,No ratings yet Rate it yourself - /Services/pharmacies/LeaveReview/DefaultView.aspx?id=FR247,0,0,,Yes,yes,yes
Compact Pharmacy,FQ282,PHA,139 BLENDON ROAD, ,BEXLEY,KENT,,DA5 1BT,Tel: 020 83032036, - ,,,No ratings yet Rate it yourself - /Services/pharmacies/LeaveReview/DefaultView.aspx?id=FQ282,0,0,,Yes,yes,no
Beckenham Pharmacy,FPA70,PHA,70 HIGH STREET,BECKENHAM,,KENT,,BR3 1ED,Tel: 020 86506076        , - ,,,No ratings yet Rate it yourself - /Services/pharmacies/LeaveReview/DefaultView.aspx?id=FPA70,0,0,,Yes,yes,no
Totty Pharmacy,FA450,PHA,44 CHARLTON CHURCH LANE, ,CHARLTON,LONDON,,SE7 7AE,Tel: 0208 858 0657, - ,,,No ratings yet Rate it yourself - /Services/pharmacies/LeaveReview/DefaultView.aspx?id=FA450,0,0,,Yes,yes,yes
TOUCHWOOD PHARMACY,FHL07,PHA,363 Sydenham Road,,Sydenham,London,,SE26 5SL,Tel: 02087783506, - ,,,No ratings yet Rate it yourself - /Services/pharmacies/LeaveReview/DefaultView.aspx?id=FHL07,0,0,,Yes,yes,no
B R Lewis Chemists,FP273,PHA,62-64 UPPER WICKHAM LANE, ,WELLING,KENT,,DA16 3HQ,Tel: 020 83179783, - ,,,No ratings yet Rate it yourself - /Services/pharmacies/LeaveReview/DefaultView.aspx?id=FP273,0,0,,Yes,yes,yes
Osbon Pharmacy,FFL63,PHA,24 STEYNTON AVENUE,BEXLEY, ,KENT,,DA5 3HP,Tel: 020 83002335, - ,,,No ratings yet Rate it yourself - /Services/pharmacies/LeaveReview/DefaultView.aspx?id=FFL63,0,0,,Yes,yes,yes
OSBON PHARMACY,FH772,PHA,56-60 LOAMPIT HILL,,LEWISHAM,LONDON,,SE13 7SX,Tel: 020 86923388, - ,,,No ratings yet Rate it yourself - /Services/pharmacies/LeaveReview/DefaultView.aspx?id=FH772,0,0,,Yes,yes,
Park Langley Pharmacy,FKM27,PHA,90 WICKHAM ROAD,PARK LANGLEY,BECKENHAM,KENT,,BR3 6QH,Tel: 020 8650 1213, - ,,,No ratings yet Rate it yourself - /Services/pharmacies/LeaveReview/DefaultView.aspx?id=FKM27,0,0,,Yes,yes,yes
Burrage Pharmacy,FRE57,PHA,57 BURRAGE PLACE,PLUMSTEAD,WOOLWICH,LONDON,,SE18 7BE,Tel: 020 8244 6969, - ,,,No ratings yet Rate it yourself - /Services/pharmacies/LeaveReview/DefaultView.aspx?id=FRE57,0,0,,Yes,yes,yes
Geepharm Chemists,FGR61,PHA,1-3 BLACKHEATH HILL,GREENWICH,LONDON, ,,SE10 8PB,Tel: 020 8469 0692, - ,,,No ratings yet Rate it yourself - /Services/pharmacies/LeaveReview/DefaultView.aspx?id=FGR61,0,0,,Yes,yes,yes
Boots,FKG02,PHA,182 HIGH STREET,BECKENHAM,KENT, ,,BR3 1EW,Tel: 02086500640, - ,,,No ratings yet Rate it yourself - /Services/pharmacies/LeaveReview/DefaultView.aspx?id=FKG02,0,0,,Yes,yes,no
Temple Pharmacy Ltd,FVC32,PHA,6 THE SLADE,PLUMSTEAD,LONDON, ,,SE18 2NB,Tel: 020 8854 2168, - ,,,No ratings yet Rate it yourself - /Services/pharmacies/LeaveReview/DefaultView.aspx?id=FVC32,0,0,,Yes,yes,yes
Medicos Pharmacy,FK463,PHA,197 STANSTEAD ROAD, ,FOREST HILL,LONDON,,SE23 1HU,Tel: 020 8690 6060, - ,,,No ratings yet Rate it yourself - /Services/pharmacies/LeaveReview/DefaultView.aspx?id=FK463,0,0,,Yes,yes,yes
CROFTON PARK PHARMACY,FV954,PHA,435 BROCKLEY ROAD,CROFTON PARK,LONDON, ,,SE4 2PJ,Tel: 020 8291 5575, - ,,,No ratings yet Rate it yourself - /Services/pharmacies/LeaveReview/DefaultView.aspx?id=FV954,0,0,,Yes,yes,yes
BENTLEY CHEMIST,FV026,PHA,374 BROCKLEY ROAD,LEWISHAM,LONDON, ,,SE4 2BY,Tel: 0208 692 1067, - ,,,No ratings yet Rate it yourself - /Services/pharmacies/LeaveReview/DefaultView.aspx?id=FV026,0,0,,Yes,yes,yes
Amin Pharmacy,FNN90,PHA,291 BROCKLEY ROAD,,BROCKLEY,LONDON,,SE4 2SA,Tel: 02086921389, - ,,,No ratings yet Rate it yourself - /Services/pharmacies/LeaveReview/DefaultView.aspx?id=FNN90,0,0,,Yes,yes,yes
Perry Vale Pharmacy,FT350,PHA,"Shop 1, 193 Perry Vale",Forest Hill,,London,,SE23 2JF,Tel: 0208 699 7999, - ,,,No ratings yet Rate it yourself - /Services/pharmacies/LeaveReview/DefaultView.aspx?id=FT350,0,0,,Yes,yes,yes
Boots,FX053,PHA,UNIT 7A,GREENWICH RETAIL PARK,BUGSBY WAY,LONDON,,SE7 7SR,Tel: 02082935568, - ,,,No ratings yet Rate it yourself - /Services/pharmacies/LeaveReview/DefaultView.aspx?id=FX053,0,0,,Yes,yes,yes
Beckenham Pharmacy,FE112,PHA,171-173 HIGH STREET,BECKENHAM,KENT, ,,BR3 1AH,Tel: 020 8658 9596, - ,,,No ratings yet Rate it yourself - /Services/pharmacies/LeaveReview/DefaultView.aspx?id=FE112,0,0,,Yes,yes,no
TESCO INSTORE PHARMACY,FPK91,PHA,EDGINGTON WAY,,SIDCUP,KENT,,DA14 5BN,Tel: 0203 801 6079, - ,,,No ratings yet Rate it yourself - /Services/pharmacies/LeaveReview/DefaultView.aspx?id=FPK91,0,0,,Yes,yes,yes
Asda Pharmacy,FC116,PHA,BUGSBY WAY,,GREENWICH,LONDON,,SE7 7ST,Tel: 020 8305 4510, - ,,,No ratings yet Rate it yourself - /Services/pharmacies/LeaveReview/DefaultView.aspx?id=FC116,0,0,,Yes,yes,yes
Boots,FJ128,PHA,196-198 TRAFALGAR ROAD,GREENWICH,LONDON, ,,SE10 9ER,Tel: 02088580501, - ,,,No ratings yet Rate it yourself - /Services/pharmacies/LeaveReview/DefaultView.aspx?id=FJ128,0,0,,Yes,yes,no
PE LOGAN,FD551,PHA,209 TRAFALGAR ROAD,GREENWICH,LONDON, ,,SE10 9EQ,Tel: 020 88581073, - ,,,No ratings yet Rate it yourself - /Services/pharmacies/LeaveReview/DefaultView.aspx?id=FD551,0,0,,Yes,yes,yes
TESCO INSTORE PHARMACY,FTX08,PHA,13 OLD STABLE ROW,,WOOLWICH,LONDON,,SE18 6JR,Tel: 0345 671 9559, - ,,,No ratings yet Rate it yourself - /Services/pharmacies/LeaveReview/DefaultView.aspx?id=FTX08,0,0,,Yes,yes,yes
Duncans Pharmacy,FEA03,PHA,193-195 GREENWICH HIGH RD,GREENWICH,LONDON, ,,SE10 8JA,Tel: 020 88581953, - ,,,No ratings yet Rate it yourself - /Services/pharmacies/LeaveReview/DefaultView.aspx?id=FEA03,0,0,,Yes,yes,
Central Chemists,FXE44,PHA,3 BREWERY ROAD,,WOOLWICH,LONDON,,SE18 7PS,Tel: 020 8854 6713, - ,,,No ratings yet Rate it yourself - /Services/pharmacies/LeaveReview/DefaultView.aspx?id=FXE44,0,0,,Yes,yes,yes