Organisation Name,NACS Code,Organisation Type,Address1,Address2,Address3,Address4,Address5,PostCode,Telephone Number,Opening time,Value  (Opening time),Banding Classification  (Opening time),NHS.UK users rating,Value  (NHS.UK users rating),Banding Classification  (NHS.UK users rating),Electronic prescription service,Value  (Electronic prescription service),Banding Classification  (Electronic prescription service),Car parking (Is there car parking at this organisation?)
Rowlands Pharmacy,FVA13,PHA,Maythorne Close,Sutton Hill,Telford,Shropshire,,TF7 4DH,Tel: 01952 586151, - ,,,3 ratings Rate it yourself - /Services/pharmacies/LeaveReview/DefaultView.aspx?id=FVA13,,,,Yes,yes,yes
Anstice Pharmacy,FM519,PHA,7 Anstice Square,Madeley,Telford,Shropshire,,TF7 5BD,Tel: 01952 585717, - ,,,6 ratings Rate it yourself - /Services/pharmacies/LeaveReview/DefaultView.aspx?id=FM519,,,,Yes,yes,yes
Woodside Pharmacy,FKM92,PHA,Park Lane Centre,"Park Lane, Woodside",Telford,Shropshire,,TF7 5QZ,Tel: 01952 586516, - ,,,9 ratings Rate it yourself - /Services/pharmacies/LeaveReview/DefaultView.aspx?id=FKM92,,,,Yes,yes,yes
Aqueduct Pharmacy,FJG68,PHA,Majestic Way,Aqueduct,Telford,Shropshire,,TF4 3RB,Tel: 01952 593220, - ,,,7 ratings Rate it yourself - /Services/pharmacies/LeaveReview/DefaultView.aspx?id=FJG68,,,,Yes,yes,yes
Rowlands Pharmacy,FD018,PHA,THE PHARMACY,STIRCHLEY HEALTH CENTRE,"SANDINO ROAD, STIRCHLEY","TELFORD, SHROPSHIRE",,TF3 1FB,Tel: 01952 596620, - ,,,10 ratings Rate it yourself - /Services/pharmacies/LeaveReview/DefaultView.aspx?id=FD018,,,,Yes,yes,yes
Ironbridge Pharmacy,FC770,PHA,The Square,Ironbridge,Telford,Shropshire,,TF8 7AQ,Tel: 01952 433330, - ,,,6 ratings Rate it yourself - /Services/pharmacies/LeaveReview/DefaultView.aspx?id=FC770,,,,Yes,yes,yes
LLOYDSPHARMACY,FJ757,PHA,DAWLEY MEDICAL CENTRE,"KING STREET, DAWLEY",TELFORD,SHROPSHIRE,,TF4 2AA,Tel: 01952 502260, - ,,,No ratings yet Rate it yourself - /Services/pharmacies/LeaveReview/DefaultView.aspx?id=FJ757,0,0,,Yes,yes,
LLOYDSPHARMACY,FX394,PHA,46 HIGH STREET,DAWLEY,TELFORD,SHROPSHIRE,,TF4 2EX,Tel: 01952 505029, - ,,,No ratings yet Rate it yourself - /Services/pharmacies/LeaveReview/DefaultView.aspx?id=FX394,0,0,,Yes,yes,
Rowlands Pharmacy,FMJ05,PHA,80 HIGH STREET,,BROSELEY,SHROPSHIRE,,TF12 5ET,Tel: 01952 882262        , - ,,,1 rating Rate it yourself - /Services/pharmacies/LeaveReview/DefaultView.aspx?id=FMJ05,,,,Yes,yes,no
Malinslee Pharmacy,FG767,PHA,MALINSLEE MEDICAL CENTRE,CHURCH ROAD,TELFORD,,,TF3 2JZ,Tel: 01952 503 555, - ,,,2 ratings Rate it yourself - /Services/pharmacies/LeaveReview/DefaultView.aspx?id=FG767,,,,Yes,yes,yes
HOLLINSWOOD PHARMACY,FXM74,PHA,"NEW UNIT 4, DOWNEMEAD",HOLLINSWOOD,TELFORD,SHROPSHIRE,,TF3 2EW,Tel: 01952 299925, - ,,,1 rating Rate it yourself - /Services/pharmacies/LeaveReview/DefaultView.aspx?id=FXM74,,,,Yes,yes,
ASDA PHARMACY,FXN28,PHA,MALINSGATE,,TELFORD,SHROPSHIRE,,TF3 4HZ,Tel: 01952 741 028, - ,,,1 rating Rate it yourself - /Services/pharmacies/LeaveReview/DefaultView.aspx?id=FXN28,,,,Yes,yes,yes
Boots,FK954,PHA,4-10 SHERWOOD STREET,TELFORD TOWN CENTRE,TELFORD,SHROPSHIRE,,TF3 4AU,Tel: 01952291351, - ,,,No ratings yet Rate it yourself - /Services/pharmacies/LeaveReview/DefaultView.aspx?id=FK954,0,0,,Yes,yes,no
SUPERDRUG PHARMACY,FA742,PHA,12-13 DEAN STREET,TELFORD TOWN CENTRE,TELFORD,SHROPSHIRE,,TF3 4BT,Tel: 01952 291524        , - ,,,1 rating Rate it yourself - /Services/pharmacies/LeaveReview/DefaultView.aspx?id=FA742,,,,Yes,yes,yes
Lawley Pharmacy,FW094,PHA,FARRIERS GREEN,LAWLEY,TELFORD,,,TF4 2LL,Tel: 01952 504666, - ,,,10 ratings Rate it yourself - /Services/pharmacies/LeaveReview/DefaultView.aspx?id=FW094,,,,Yes,yes,yes
Boots,FA369,PHA,UNITS 14A & B,TELFORD FORGE RETAIL PARK,TELFORD,SHROPSHIRE,,TF3 4AG,Tel: 01952204243, - ,,,No ratings yet Rate it yourself - /Services/pharmacies/LeaveReview/DefaultView.aspx?id=FA369,0,0,,Yes,yes,yes
Priorslee Pharmacy,FKT63,PHA,THE BARN,PRIORSLEE FARM LOCAL CTR,TELFORD,SHROPSHIRE,,TF2 9NR,Tel: 01952 290658, - ,,,6 ratings Rate it yourself - /Services/pharmacies/LeaveReview/DefaultView.aspx?id=FKT63,,,,Yes,yes,yes
Boots,FRK71,PHA,7 CHEAPSIDE,,SHIFNAL,SHROPSHIRE,,TF11 8BN,Tel: 01952461273, - ,,,1 rating Rate it yourself - /Services/pharmacies/LeaveReview/DefaultView.aspx?id=FRK71,,,,Yes,yes,no
OAKENGATES PHARMACY,FP203,PHA,THE SURGERY,"LION STREET, OAKENGATES",TELFORD,SHROPSHIRE,,TF2 6AQ,Tel: 01952 613930, - ,,,2 ratings Rate it yourself - /Services/pharmacies/LeaveReview/DefaultView.aspx?id=FP203,,,,Yes,yes,
Jhoots Pharmacy,FR518,PHA,32 Market Street,Oakengates,Telford,Shropshire,,TF2 6ED,Tel: 01952 613074, - ,,,No ratings yet Rate it yourself - /Services/pharmacies/LeaveReview/DefaultView.aspx?id=FR518,0,0,,Yes,yes,yes
Kitchings Chemist,FJD15,PHA,23-25 LIMES WALK,OAKENGATES,TELFORD,SHROPSHIRE,,TF2 6EP,Tel: 01952 612964, - ,,,8 ratings Rate it yourself - /Services/pharmacies/LeaveReview/DefaultView.aspx?id=FJD15,,,,Yes,yes,yes
TESCO INSTORE PHARMACY,FAR16,PHA,IN-STORE PHARMACY,TESCO SUPERSTORE,"THE RETAIL PARK, ARLESTON","WELLINGTON, SHROPSHIRE",,TF1 2DE,Tel: 0345 6779673, - ,,,1 rating Rate it yourself - /Services/pharmacies/LeaveReview/DefaultView.aspx?id=FAR16,,,,Yes,yes,yes
SHIRE PHARMACY,FQH49,PHA,UNIT 3 THE SHOPS,"TEAGUES CRESCENT, TRENCH",TELFORD,SHROPSHIRE,,TF2 6RX,Tel: 01952 618415, - ,,,No ratings yet Rate it yourself - /Services/pharmacies/LeaveReview/DefaultView.aspx?id=FQH49,0,0,,Yes,yes,
Asda Pharmacy,FJ381,PHA,ST GEORGES ROAD,DONNINGTON WOOD,TELFORD,SHROPSHIRE,,TF2 7RX,Tel: 01952 621710, - ,,,4 ratings Rate it yourself - /Services/pharmacies/LeaveReview/DefaultView.aspx?id=FJ381,,,,Yes,yes,yes
Rowlands Pharmacy,FF208,PHA,UNIT 6 THE STIRLING CTR,HIGH STREET,TELFORD,SHROPSHIRE,,TF1 5GQ,Tel: 01952 242179, - ,,,1 rating Rate it yourself - /Services/pharmacies/LeaveReview/DefaultView.aspx?id=FF208,,,,Yes,yes,yes
CHAPEL LANE PHARMACY,FDW95,PHA,CHAPEL LANE,WELLINGTON,TELFORD,SHROPSHIRE,,TF1 1SS,Tel: 01952 255833, - ,,,No ratings yet Rate it yourself - /Services/pharmacies/LeaveReview/DefaultView.aspx?id=FDW95,0,0,,Yes,yes,
Wellington Pharmacy,FNT17,PHA,WELLINGTON M/P,CHAPEL LANE,WELLINGTON,SHROPSHIRE,,TF1 1PZ,Tel: 01952 258820, - ,,,37 ratings Rate it yourself - /Services/pharmacies/LeaveReview/DefaultView.aspx?id=FNT17,,,,Yes,yes,yes
Donnington Pharmacy,FE301,PHA,DONNINGTON MED PRACTICE,"WREKIN DRIVE,DONNINGTON",TELFORD,SHROPSHIRE,,TF2 8EA,Tel: 01952 676556, - ,,,4 ratings Rate it yourself - /Services/pharmacies/LeaveReview/DefaultView.aspx?id=FE301,,,,Yes,yes,yes
Boots,FGG64,PHA,21-25 NEW STREET,WELLINGTON,TELFORD,SHROPSHIRE,,TF1 1LU,Tel: 01952223468, - ,,,No ratings yet Rate it yourself - /Services/pharmacies/LeaveReview/DefaultView.aspx?id=FGG64,0,0,,Yes,yes,no
PARADE PHARMACY,FK027,PHA,6 THE PARADE,DONNINGTON,TELFORD,SHROPSHIRE,,TF2 8EB,Tel: 01952 605441, - ,,,1 rating Rate it yourself - /Services/pharmacies/LeaveReview/DefaultView.aspx?id=FK027,,,,Yes,yes,
WENLOCK PHARMACY,FNK14,PHA,14 High Street,Much Wenlock,,Shropshire,,TF13 6AA,Tel: 01952 727253, - ,,,2 ratings Rate it yourself - /Services/pharmacies/LeaveReview/DefaultView.aspx?id=FNK14,,,,Yes,yes,
Morrisons Pharmacy,FRX82,PHA,SPRINGHILL,WELLINGTON,TELFORD,SHROPSHIRE,,TF1 1RP,Tel: 01952 242846, - ,,,7 ratings Rate it yourself - /Services/pharmacies/LeaveReview/DefaultView.aspx?id=FRX82,,,,Yes,yes,yes
Leegomery Chemist,FPE75,PHA,LEEGOMERY LOCAL CENTRE,LEEGOMERY,TELFORD,SHROPSHIRE,,TF1 6XQ,Tel: 01952 222164, - ,,,15 ratings Rate it yourself - /Services/pharmacies/LeaveReview/DefaultView.aspx?id=FPE75,,,,Yes,yes,yes
Muxton Pharmacy,FR107,PHA,9C FIELDHOUSE DRIVE,MUXTON,TELFORD,SHROPSHIRE,,TF2 8JQ,Tel: 01952 670686        , - ,,,15 ratings Rate it yourself - /Services/pharmacies/LeaveReview/DefaultView.aspx?id=FR107,,,,Yes,yes,yes
PEAK PHARMACY,FWG73,PHA,NORTHGATE HEALTH CENTRE,NORTHGATE,BRIDGNORTH,SHROPSHIRE,,WV16 4EN,Tel: 01746 763297, - ,,,No ratings yet Rate it yourself - /Services/pharmacies/LeaveReview/DefaultView.aspx?id=FWG73,0,0,,Yes,yes,yes
Boots,FEX56,PHA,2-3 ACORN WAY,SHAWBIRCH,TELFORD,SHROPSHIRE,,TF5 0LW,Tel: 01952260800, - ,,,7 ratings Rate it yourself - /Services/pharmacies/LeaveReview/DefaultView.aspx?id=FEX56,,,,Yes,yes,yes
RHODES TC CHEMIST,FCV56,PHA,77 High Street,Albrighton,Wolverhampton,,,WV7 3JA,Tel: 01902 372363        , - ,,,16 ratings Rate it yourself - /Services/pharmacies/LeaveReview/DefaultView.aspx?id=FCV56,,,,Yes,yes,yes
Boots,FQN20,PHA,30-31 HIGH STREET,BRIDGNORTH,SHROPSHIRE, ,,WV16 4DB,Tel: 01746763127, - ,,,No ratings yet Rate it yourself - /Services/pharmacies/LeaveReview/DefaultView.aspx?id=FQN20,0,0,,Yes,yes,no
Bridgnorth Pharmacy,FNK63,PHA,2 MILL STREET,,BRIDGNORTH,SHROPSHIRE,,WV15 5AL,Tel: 01746 711495, - ,,,3 ratings Rate it yourself - /Services/pharmacies/LeaveReview/DefaultView.aspx?id=FNK63,,,,Yes,yes,yes
PATTINGHAM PHARMACY,FKK87,PHA,1 MEADOW VIEW,"HIGH STREET,PATTINGHAM",WOLVERHAMPTON,,,WV6 7BD,Tel: 01902 700700, - ,,,8 ratings Rate it yourself - /Services/pharmacies/LeaveReview/DefaultView.aspx?id=FKK87,,,,Yes,yes,yes
PEAK PHARMACY,FNW89,PHA,76 UPPER BAR, ,NEWPORT,SHROPSHIRE,,TF10 7AW,Tel: 01952 810059, - ,,,No ratings yet Rate it yourself - /Services/pharmacies/LeaveReview/DefaultView.aspx?id=FNW89,0,0,,Yes,yes,no
High Street Pharmacy,FG695,PHA,4 HIGH STREET,,NEWPORT,SHROPSHIRE,,TF10 7AN,Tel: 01952820946, - ,,,5 ratings Rate it yourself - /Services/pharmacies/LeaveReview/DefaultView.aspx?id=FG695,,,,Yes,yes,
Boots,FPD06,PHA,52 HIGH STREET,NEWPORT,SHROPSHIRE, ,,TF10 7AQ,Tel: 01952811391, - ,,,1 rating Rate it yourself - /Services/pharmacies/LeaveReview/DefaultView.aspx?id=FPD06,,,,Yes,yes,yes
CODSALL PHARMACY,FQ851,PHA,IRVINE HOUSE,"9-11 CHURCH ROAD, CODSALL",WOLVERHAMPTON,,,WV8 1EA,Tel: 01902 847120, - ,,,No ratings yet Rate it yourself - /Services/pharmacies/LeaveReview/DefaultView.aspx?id=FQ851,0,0,,Yes,yes,
WELL,FHK73,PHA,2-3 ANDERS SQUARE,PERTON,WOLVERHAMPTON, ,,WV6 7QH,Tel: 01902 742100, - ,,,No ratings yet Rate it yourself - /Services/pharmacies/LeaveReview/DefaultView.aspx?id=FHK73,0,0,,Yes,yes,
LEABANK HOUSE PHARMACY,FPH96,PHA,LEABANK HOUSE,"THE COBBLES,WHEATON ASTON",STAFFORD,,,ST19 9NB,Tel: 01785 339884, - ,,,No ratings yet Rate it yourself - /Services/pharmacies/LeaveReview/DefaultView.aspx?id=FPH96,0,0,,Yes,yes,
BIRCHES BRIDGE PHARMACY,FA794,PHA,86 WOLVERHAMPTON ROAD,CODSALL,WOLVERHAMPTON,,,WV8 1PE,Tel: 01902 842935, - ,,,4 ratings Rate it yourself - /Services/pharmacies/LeaveReview/DefaultView.aspx?id=FA794,,,,Yes,yes,
LLOYDSPHARMACY,FLH07,PHA,8 BILBROOK ROAD,BILBROOK,CODSALL,WOLVERHAMPTON,,WV8 1EZ,Tel: 01902 842886, - ,,,No ratings yet Rate it yourself - /Services/pharmacies/LeaveReview/DefaultView.aspx?id=FLH07,0,0,,Yes,yes,
Tettenhall Wood Pharmacy,FJH23,PHA,12 SCHOOL ROAD,TETTENHALL WOOD,WOLVERHAMPTON,,,WV6 8EJ,Tel: 01902747647, - ,,,4 ratings Rate it yourself - /Services/pharmacies/LeaveReview/DefaultView.aspx?id=FJH23,,,,Yes,yes,yes
BREWOOD PHARMACY,FGW10,PHA,BROADGATE HOUSE,"6 MARKET PLACE, BREWOOD",STAFFORD,,,ST19 9BS,Tel: 01902 850335, - ,,,No ratings yet Rate it yourself - /Services/pharmacies/LeaveReview/DefaultView.aspx?id=FGW10,0,0,,Yes,yes,
BRIDGNORTH ROAD PHARMACY,FDA94,PHA,41 BRIDGNORTH ROAD,COMPTON,WOLVERHAMPTON, ,,WV6 8AF,Tel: 01902 753325, - ,,,12 ratings Rate it yourself - /Services/pharmacies/LeaveReview/DefaultView.aspx?id=FDA94,,,,Yes,yes,yes
UPPER GREEN PHARMACY,FWX18,PHA,5 UPPER GREEN,TETTENHALL,WOLVERHAMPTON,,,WV6 8QQ,Tel: 01902 751353, - ,,,No ratings yet Rate it yourself - /Services/pharmacies/LeaveReview/DefaultView.aspx?id=FWX18,0,0,,Yes,yes,
I-Meds Pharmacy,FX051,PHA,Kartar Farm,New Road,Swindon,South Staffordshire,,DY3 4PP,Tel: 01902 546565, - ,,,No ratings yet Rate it yourself - /Services/pharmacies/LeaveReview/DefaultView.aspx?id=FX051,0,0,,Yes,yes,
LOWER GREEN PHARMACY,FH253,PHA,LOWER STREET HEALTH CTR,TETTENHALL,WOLVERHAMPTON,,,WV6 9LL,Tel: 01902 793340, - ,,,No ratings yet Rate it yourself - /Services/pharmacies/LeaveReview/DefaultView.aspx?id=FH253,0,0,,Yes,yes,
Newbridge Pharmacy,FQ725,PHA,325-327 TETTENHALL ROAD,,WOLVERHAMPTON,,,WV6 0JZ,Tel: 01902 752868, - ,,,10 ratings Rate it yourself - /Services/pharmacies/LeaveReview/DefaultView.aspx?id=FQ725,,,,Yes,yes,yes
Jhoots Pharmacy,FD014,PHA,THE NEWBRIDGE SURGERY,255 TETTENHALL ROAD,WOLVERHAMPTON,WEST MIDLANDS,,WV6 0DE,Tel: 01902 755778, - ,,,2 ratings Rate it yourself - /Services/pharmacies/LeaveReview/DefaultView.aspx?id=FD014,,,,Yes,yes,yes
Morrisons Pharmacy,FKD48,PHA,PENDEFORD SHOPPING CENTRE,BLAYDON ROAD,PENDEFORD,WOLVERHAMPTON,,WV9 5PG,Tel: 01902 397921, - ,,,20 ratings Rate it yourself - /Services/pharmacies/LeaveReview/DefaultView.aspx?id=FKD48,,,,Yes,yes,yes
Pendeford Pharmacy,FHX23,PHA,Pendeford Health Centre,Whitburn Close,Pendeford,Wolverhampton,,WV9 5NJ,Tel: 01902 781844, - ,,,No ratings yet Rate it yourself - /Services/pharmacies/LeaveReview/DefaultView.aspx?id=FHX23,0,0,,Yes,yes,
Penn Care Pharmacy,FAL84,PHA,48 WARSTONES ROAD,PENN,WOLVERHAMPTON, ,,WV4 4LP,Tel: 01902 336591, - ,,,10 ratings Rate it yourself - /Services/pharmacies/LeaveReview/DefaultView.aspx?id=FAL84,,,,Yes,yes,yes
Wombourne Pharmacy,FWP30,PHA,45A PLANKS LANE,WOMBOURNE,WOLVERHAMPTON,,,WV5 8DX,Tel: 01902 893366, - ,,,10 ratings Rate it yourself - /Services/pharmacies/LeaveReview/DefaultView.aspx?id=FWP30,,,,Yes,yes,yes
Millstream Pharmacy,FF635,PHA,HALFWAY HOUSE,151 TETTENHALL ROAD,WOLVERHAMPTON,WEST MIDLANDS,,WV3 9NJ,Tel: 01902 423743, - ,,,3 ratings Rate it yourself - /Services/pharmacies/LeaveReview/DefaultView.aspx?id=FF635,,,,Yes,yes,Data not available
Boots,FVT62,PHA,5&6 GIGGETTY LANE,WOMBOURNE,WOLVERHAMPTON, ,,WV5 0AW,Tel: 01902324062, - ,,,No ratings yet Rate it yourself - /Services/pharmacies/LeaveReview/DefaultView.aspx?id=FVT62,0,0,,Yes,yes,yes
THE PHARMACY CLINIC,FL554,PHA,6 BARGATE DRIVE,AVION CENTRE,WHITMORE REANS,WOLVERHAMPTON,,WV6 0QW,Tel: 01902 420 600, - ,,,3 ratings Rate it yourself - /Services/pharmacies/LeaveReview/DefaultView.aspx?id=FL554,,,,Yes,yes,
Boots,FCH60,PHA,HIGH STREET,WOMBOURNE,WOLVERHAMPTON, ,,WV5 9DP,Tel: 01902892430, - ,,,No ratings yet Rate it yourself - /Services/pharmacies/LeaveReview/DefaultView.aspx?id=FCH60,0,0,,Yes,yes,no
Coven Pharmacy,FWM74,PHA,25 BREWOOD ROAD,COVEN,WOLVERHAMPTON,WEST MIDLANDS,,WV9 5BX,Tel: 01902 790074, - ,,,3 ratings Rate it yourself - /Services/pharmacies/LeaveReview/DefaultView.aspx?id=FWM74,,,,Yes,yes,yes
Rowlands Pharmacy,FCM55,PHA,MARSDEN MEDICAL PRACTICE,25 SUTTON ROAD,SHREWSBURY,SHROPSHIRE,,SY2 6DL,Tel: 01743 369446        , - ,,,No ratings yet Rate it yourself - /Services/pharmacies/LeaveReview/DefaultView.aspx?id=FCM55,0,0,,Yes,yes,yes
Pennfields Pharmacy,FPE01,PHA,248 JEFFCOCK ROAD,PENN FIELDS,WOLVERHAMPTON, ,,WV3 7AH,Tel: 01902 341300, - ,,,4 ratings Rate it yourself - /Services/pharmacies/LeaveReview/DefaultView.aspx?id=FPE01,,,,Yes,yes,yes
Alpha Pharmacy,FY922,PHA,468 STAFFORD ROAD,,WOLVERHAMPTON, ,,WV10 6AN,Tel: 01902 782017, - ,,,10 ratings Rate it yourself - /Services/pharmacies/LeaveReview/DefaultView.aspx?id=FY922,,,,Yes,yes,
DAY LEWIS PHARMACY,FG745,PHA,Gnosall Health Centre,Brookhouse Road,Gnosall,Staffordshire,,ST20 0GP,Tel: 01785 822228, - ,,,8 ratings Rate it yourself - /Services/pharmacies/LeaveReview/DefaultView.aspx?id=FG745,,,,Yes,yes,yes
Poonian Pharmacy,FCX61,PHA,663 STAFFORD ROAD,FORDHOUSES,WOLVERHAMPTON,WEST MIDLANDS,,WV10 6QG,Tel: 01902 783446, - ,,,1 rating Rate it yourself - /Services/pharmacies/LeaveReview/DefaultView.aspx?id=FCX61,,,,Yes,yes,yes
Conway Pharmacy,FJW10,PHA,238 MONKMOOR ROAD,TELFORD EST SHOPPING CTRE,SHREWSBURY,SHROPSHIRE,,SY2 5SR,Tel: 01743 352352, - ,,,18 ratings Rate it yourself - /Services/pharmacies/LeaveReview/DefaultView.aspx?id=FJW10,,,,Yes,yes,yes
Staveley Pharmacy,FMV70,PHA,212 STAVELEY ROAD,WHITMORE REANS,WOLVERHAMPTON,,,WV1 4RS,Tel: 01902 421789, - ,,,4 ratings Rate it yourself - /Services/pharmacies/LeaveReview/DefaultView.aspx?id=FMV70,,,,Yes,yes,yes
Highley Pharmacy,FCP52,PHA,BEULAH HOUSE,HIGH STREET,HIGHLEY,SHROPSHIRE,,WV16 6LP,Tel: 01746 861255, - ,,,3 ratings Rate it yourself - /Services/pharmacies/LeaveReview/DefaultView.aspx?id=FCP52,,,,Yes,yes,yes
Asda Pharmacy,FRG91,PHA,ASDA SHOPPING COMPLEX,WATERLOO ROAD,WOLVERHAMPTON,,,WV1 4AZ,Tel: 01902 778106, - ,,,1 rating Rate it yourself - /Services/pharmacies/LeaveReview/DefaultView.aspx?id=FRG91,,,,Yes,yes,yes
HINGLEY CHEMISTS,FDL23,PHA,179 LEA ROAD,PENNFIELDS,WOLVERHAMPTON,,,WV3 0LG,Tel: 01902 421132, - ,,,No ratings yet Rate it yourself - /Services/pharmacies/LeaveReview/DefaultView.aspx?id=FDL23,0,0,,Yes,yes,no
Rexall Chemist,FY374,PHA,204 PENN ROAD,PENN,WOLVERHAMPTON,WEST MIDLANDS,,WV4 4AA,Tel: 01902 340101, - ,,,1 rating Rate it yourself - /Services/pharmacies/LeaveReview/DefaultView.aspx?id=FY374,,,,Yes,yes,yes
JHOOTS PHARMACY,FGT74,PHA,PENN MANOR MEDICAL CENTRE,"MANOR ROAD, PENN",WOLVERHAMPTON,WEST MIDLANDS,,WV4 5PY,Tel: 01902 330515, - ,,,No ratings yet Rate it yourself - /Services/pharmacies/LeaveReview/DefaultView.aspx?id=FGT74,0,0,,Yes,yes,
Rowlands Pharmacy,FA941,PHA,SEVERN FIELDS HEALTH CTR,SUNDORNE ROAD,SHREWSBURY,SHROPSHIRE,,SY1 4RQ,Tel: 01743 462929, - ,,,166 ratings Rate it yourself - /Services/pharmacies/LeaveReview/DefaultView.aspx?id=FA941,,,,Yes,yes,yes
ASDA PHARMACY,FLE79,PHA,OLD POTTS WAY, ,SHREWSBURY,SHROPSHIRE,,SY3 7ET,Tel: 01743 276810, - ,,,6 ratings Rate it yourself - /Services/pharmacies/LeaveReview/DefaultView.aspx?id=FLE79,,,,Yes,yes,yes
Superdrug Pharmacy,FD017,PHA,"UNIT 12, CENTRAL ARCADE",MANDER CENTRE,WOLVERHAMPTON,WEST MIDLANDS,,WV1 3NJ,Tel: 01902 313654, - ,,,No ratings yet Rate it yourself - /Services/pharmacies/LeaveReview/DefaultView.aspx?id=FD017,0,0,,Yes,yes,yes
Boots,FWL73,PHA,MEOLE BRACE RETAIL PARK,HEREFORD ROAD,SHREWSBURY,SHROPSHIRE,,SY3 9NB,Tel: 01743236973, - ,,,1 rating Rate it yourself - /Services/pharmacies/LeaveReview/DefaultView.aspx?id=FWL73,,,,Yes,yes,yes
Bushbury Lane Pharmacy,FK880,PHA,331 BUSHBURY LANE,,WOLVERHAMPTON,,,WV10 9UJ,Tel: 01902 789334, - ,,,6 ratings Rate it yourself - /Services/pharmacies/LeaveReview/DefaultView.aspx?id=FK880,,,,Yes,yes,yes
Jhoots Pharmacy,FTG89,PHA,34-35 THORNLEY STREET,,WOLVERHAMPTON,WEST MIDLANDS,,WV1 1JP,Tel: 01902 424380, - ,,,No ratings yet Rate it yourself - /Services/pharmacies/LeaveReview/DefaultView.aspx?id=FTG89,0,0,,Yes,yes,yes
Boots,FKY89,PHA,40-41 DUDLEY STREET,WOLVERHAMPTON, , ,,WV1 3ER,Tel: 01902427145, - ,,,1 rating Rate it yourself - /Services/pharmacies/LeaveReview/DefaultView.aspx?id=FKY89,,,,Yes,yes,no
JHOOTS PHARMACY,FCM26,PHA,18-20 THE BROADWAY,BUSHBURY,WOLVERHAMPTON,WEST MIDLANDS,,WV10 8EB,Tel: 01902 782411, - ,,,No ratings yet Rate it yourself - /Services/pharmacies/LeaveReview/DefaultView.aspx?id=FCM26,0,0,,Yes,yes,
Lunts Pharmacies,FXC75,PHA,1-3 HEREFORD ROAD,,SHREWSBURY,SHROPSHIRE,,SY3 7QT,Tel: 01743 351918, - ,,,No ratings yet Rate it yourself - /Services/pharmacies/LeaveReview/DefaultView.aspx?id=FXC75,0,0,,Yes,yes,yes
Tesco Pharmacy,FN658,PHA,CATTLE MARKET,BATTLEFIELD ROAD,SHREWSBURY,,,SY1 4HA,Tel: 01743 501000, - ,,,4 ratings Rate it yourself - /Services/pharmacies/LeaveReview/DefaultView.aspx?id=FN658,,,,Yes,yes,yes
Low Hill Pharmacy,FWP98,PHA,8 Showell Circus,Low Hill,Wolverhampton, ,,WV10 9BA,Tel: 01902 732029, - ,,,6 ratings Rate it yourself - /Services/pharmacies/LeaveReview/DefaultView.aspx?id=FWP98,,,,Yes,yes,
Dudley Road Pharmacy,FFP58,PHA,425 Dudley Road,Wolverhampton, , ,,WV2 3AH,Tel: 01902 459979, - ,,,1 rating Rate it yourself - /Services/pharmacies/LeaveReview/DefaultView.aspx?id=FFP58,,,,Yes,yes,yes
Supercare Pharmacy,FDJ45,PHA,UNIT 1 BLAKENHALL GARDENS,420 DUDLEY ROAD,WOLVERHAMPTON,,,WV2 3AY,Tel: 01902 871011, - ,,,1 rating Rate it yourself - /Services/pharmacies/LeaveReview/DefaultView.aspx?id=FDJ45,,,,Yes,yes,
All Saints Pharmacy,FPW92,PHA,91-93 VICARAGE ROAD,ALL SAINTS,WOLVERHAMPTON,,,WV2 1DR,Tel: 01902 453720, - ,,,6 ratings Rate it yourself - /Services/pharmacies/LeaveReview/DefaultView.aspx?id=FPW92,,,,Yes,yes,yes
Boots,FG043,PHA,233 TRYSULL ROAD,MERRY HILL,WOLVERHAMPTON,,,WV3 7LF,Tel: 01902342181, - ,,,1 rating Rate it yourself - /Services/pharmacies/LeaveReview/DefaultView.aspx?id=FG043,,,,Yes,yes,no
Boots,FA688,PHA,7-9 PRIDE HILL,SHREWSBURY,SHROPSHIRE,,,SY1 1DD,Tel: 01743351311, - ,,,No ratings yet Rate it yourself - /Services/pharmacies/LeaveReview/DefaultView.aspx?id=FA688,0,0,,Yes,yes,no
Anderson Chemist,FFV96,PHA,311 DUDLEY ROAD,WOLVERHAMPTON, , ,,WV2 3JY,Tel: 01902 342000, - ,,,2 ratings Rate it yourself - /Services/pharmacies/LeaveReview/DefaultView.aspx?id=FFV96,,,,Yes,yes,Data not available
HEATH TOWN PHARMACY,FMW43,PHA,181 WEDNESFIELD ROAD,HEATH TOWN,WOLVERHAMPTON, ,,WV10 0EN,Tel: 01902 456286, - ,,,4 ratings Rate it yourself - /Services/pharmacies/LeaveReview/DefaultView.aspx?id=FMW43,,,,Yes,yes,
Your Pharmacy First,FNV79,PHA,1 RAYNOR ROAD,FALLINGS PARK,WOLVERHAMPTON, ,,WV10 9QY,Tel: 01902 731134, - ,,,11 ratings Rate it yourself - /Services/pharmacies/LeaveReview/DefaultView.aspx?id=FNV79,,,,Yes,yes,yes
Boots,FF141,PHA,14 Albion Pde,,,Kingswinford,West Midlands,DY6 0NP,Tel: 01384273187, - ,,,1 rating Rate it yourself - /Services/pharmacies/LeaveReview/DefaultView.aspx?id=FF141,,,,Yes,yes,yes
Phoenix Pharmacy,FHV89,PHA,PHOENIX HEALTH CENTRE,PARKFIELD ROAD,WOLVERHAMPTON,WEST MIDLANDS,,WV4 6ED,Tel: 01902 621853, - ,,,44 ratings Rate it yourself - /Services/pharmacies/LeaveReview/DefaultView.aspx?id=FHV89,,,,Yes,yes,yes
Rowlands Pharmacy,FM195,PHA,7 LANSDOWNE ROAD,BAYSTON HILL,SHREWSBURY,,,SY3 0HT,Tel: 01743 872154, - ,,,2 ratings Rate it yourself - /Services/pharmacies/LeaveReview/DefaultView.aspx?id=FM195,,,,Yes,yes,yes
RHODES,FCQ01,PHA,28 CLAREMONT HILL,,SHREWSBURY,,,SY1 1RD,Tel: 01743 343998, - ,,,5 ratings Rate it yourself - /Services/pharmacies/LeaveReview/DefaultView.aspx?id=FCQ01,,,,Yes,yes,no
LUNTS PHARMACY,FH024,PHA,THE TANNERY,BARKER STREET,SHREWSBURY,,,SY1 1QJ,Tel: 01743 232857, - ,,,6 ratings Rate it yourself - /Services/pharmacies/LeaveReview/DefaultView.aspx?id=FH024,,,,Yes,yes,no
WELL,FVH68,PHA,101 MOUNT PLEASANT ROAD,,SHREWSBURY,SHROPSHIRE,,SY1 3EL,Tel: 01743 344 277, - ,,,3 ratings Rate it yourself - /Services/pharmacies/LeaveReview/DefaultView.aspx?id=FVH68,,,,Yes,yes,yes
Fallings Park Pharmacy,FL396,PHA,212 BUSHBURY ROAD,"FALLINGS PARK,  BUSHBURY",WOLVERHAMPTON, ,,WV10 0NT,Tel: 01902 731151, - ,,,3 ratings Rate it yourself - /Services/pharmacies/LeaveReview/DefaultView.aspx?id=FL396,,,,Yes,yes,yes
WELL,FEK60,PHA,6 ALDERWOOD PRECINCT,"THE NORTHWAY,SEDGLEY",DUDLEY,WEST MIDLANDS,,DY3 3QY,Tel: 01902 662979, - ,,,No ratings yet Rate it yourself - /Services/pharmacies/LeaveReview/DefaultView.aspx?id=FEK60,0,0,,Yes,yes,yes
Hn Pharmacy,FEM86,PHA,124 CANNOCK ROAD,WEDNESFIELD,WOLVERHAMPTON,WEST MIDLANDS,,WV10 8PW,Tel: 01902 731310, - ,,,3 ratings Rate it yourself - /Services/pharmacies/LeaveReview/DefaultView.aspx?id=FEM86,,,,Yes,yes,yes
ESSINGTON DISPENSING CHEMISTS,FT466,PHA,129 LONG KNOWLE LANE,WEDNESFIELD,WOLVERHAMPTON,WEST MIDLANDS,,WV11 1JG,Tel: 01902 739645, - ,,,2 ratings Rate it yourself - /Services/pharmacies/LeaveReview/DefaultView.aspx?id=FT466,,,,Yes,yes,yes
Morrisons Pharmacy,FKD53,PHA,CHARTERFIELD SHOPPING CTR,STALLINGS LANE,KINGSWINFORD,W.MIDLANDS,,DY6 7SH,Tel: 01384 404045, - ,,,6 ratings Rate it yourself - /Services/pharmacies/LeaveReview/DefaultView.aspx?id=FKD53,,,,Yes,yes,yes
Radbrook Green Pharmacy,FAC87,PHA,BANK FARM ROAD,RADBROOK,SHREWSBURY,,,SY3 6DU,Tel: 01743 249931, - ,,,16 ratings Rate it yourself - /Services/pharmacies/LeaveReview/DefaultView.aspx?id=FAC87,,,,Yes,yes,yes
JHOOTS PHARMACY,FH117,PHA,MOSS GROVE SURGERY,15 MOSS GROVE,KINGSWINFORD,WEST MIDLANDS,,DY6 9HS,Tel: 01384 273020, - ,,,No ratings yet Rate it yourself - /Services/pharmacies/LeaveReview/DefaultView.aspx?id=FH117,0,0,,Yes,yes,