Organisation Name,NACS Code,Organisation Type,Address1,Address2,Address3,Address4,Address5,PostCode,Telephone Number,Opening time,Value  (Opening time),Banding Classification  (Opening time),NHS.UK users rating,Value  (NHS.UK users rating),Banding Classification  (NHS.UK users rating),Electronic prescription service,Value  (Electronic prescription service),Banding Classification  (Electronic prescription service),Car parking (Is there car parking at this organisation?)
JHOOTS PHARMACY,FXG00,PHA,1-2 ABBOTSWOOD CENTRE,BROCKWORTH,GLOUCESTER,GLOUCESTERSHIRE,,GL3 4NY,Tel: 01452 863019, - ,,,No ratings yet Rate it yourself - /Services/pharmacies/LeaveReview/DefaultView.aspx?id=FXG00,0,0,,Yes,yes,
Badham Pharmacy,FLV17,PHA,UNIT B BELGRAVE HOUSE,GLOS BUSINESS PARK,"WHITTLE WAY, BROCKWORTH",GLOUCESTERSHIRE,,GL3 4BJ,Tel: 01452 611089, - ,,,No ratings yet Rate it yourself - /Services/pharmacies/LeaveReview/DefaultView.aspx?id=FLV17,0,0,,Yes,yes,yes
Morrisons Pharmacy,FD597,PHA,SHURDINGTON ROAD,UP HATHERLEY,CHELTENHAM,GLOUCESTERSHIRE,,GL51 3BW,Tel: 01242 862803, - ,,,No ratings yet Rate it yourself - /Services/pharmacies/LeaveReview/DefaultView.aspx?id=FD597,0,0,,Yes,yes,yes
O'connor Pharmacies Ltd,FG509,PHA,HUCCLECOTE PHARMACY,7 GLENVILLE PARADE,HUCCLECOTE,GLOUCESTERSHIRE,,GL3 3ES,Tel: 01452 616906        , - ,,,No ratings yet Rate it yourself - /Services/pharmacies/LeaveReview/DefaultView.aspx?id=FG509,0,0,,Yes,yes,
BROOKFIELD PHARMACY,FGQ38,PHA,5 BROOKFIELD ROAD,HUCCLECOTE,GLOUCESTER, ,,GL3 3HA,Tel: 01452 618377, - ,,,No ratings yet Rate it yourself - /Services/pharmacies/LeaveReview/DefaultView.aspx?id=FGQ38,0,0,,Yes,yes,
Glevum Pharmacy,FPH91,PHA,HADWEN MEDICAL PRACTICE,"GLEVUM WAY SURG,ABBEYDALE",GLOUCESTER,,,GL4 4BL,Tel: 01452 303 182, - ,,,No ratings yet Rate it yourself - /Services/pharmacies/LeaveReview/DefaultView.aspx?id=FPH91,0,0,,Yes,yes,yes
Hawkes Pharmacy 2007 Limited,FLY52,PHA,52 WINDERMERE ROAD,CHELTENHAM,GLOUCESTERSHIRE,,,GL51 3PH,Tel: 01242 523290        , - ,,,No ratings yet Rate it yourself - /Services/pharmacies/LeaveReview/DefaultView.aspx?id=FLY52,0,0,,Yes,yes,yes
Matson Pharmacy,FCR00,PHA,87 MATSON AVENUE,,GLOUCESTER,GLOUCESTERSHIRE,,GL4 6LL,Tel: 01452 526067, - ,,,No ratings yet Rate it yourself - /Services/pharmacies/LeaveReview/DefaultView.aspx?id=FCR00,0,0,,Yes,yes,yes
Rowlands Pharmacy,FMC79,PHA,244 BATH ROAD,LECKHAMPTON,CHELTENHAM,GLOUCESTERSHIRE,,GL53 7NB,Tel: 01242 523270        , - ,,,No ratings yet Rate it yourself - /Services/pharmacies/LeaveReview/DefaultView.aspx?id=FMC79,0,0,,Yes,yes,no
Painswick Pharmacy,FGK88,PHA,NEW STREET,PAINSWICK,STROUD,GLOUCESTERSHIRE,,GL6 6XH,Tel: 01452 812263, - ,,,No ratings yet Rate it yourself - /Services/pharmacies/LeaveReview/DefaultView.aspx?id=FGK88,0,0,,Yes,yes,no
Badham Pharmacy,FAQ35,PHA,NEW MEDICAL CENTRE,"PARTON ROAD, CHURCHDOWN",GLOUCESTER,,,GL3 2JH,Tel: 01452 859906, - ,,,No ratings yet Rate it yourself - /Services/pharmacies/LeaveReview/DefaultView.aspx?id=FAQ35,0,0,,Yes,yes,yes
Charlton Pharmacy,FGN26,PHA,39 LYEFIELD ROAD WEST,CHARLTON KINGS,CHELTENHAM,GLOUCESTERSHIRE,,GL53 8EZ,Tel: 01242 522207        , - ,,,No ratings yet Rate it yourself - /Services/pharmacies/LeaveReview/DefaultView.aspx?id=FGN26,0,0,,Yes,yes,yes
Saintbridge Pharmacy,FJR01,PHA,ASKWITH ROAD, ,GLOUCESTER, ,,GL4 4SH,Tel: 01452 541541, - ,,,No ratings yet Rate it yourself - /Services/pharmacies/LeaveReview/DefaultView.aspx?id=FJR01,0,0,,Yes,yes,yes
St Marks Pharmacy,FG766,PHA,80 TENNYSON ROAD,ST.MARKS,CHELTENHAM,GLOUCESTERSHIRE,,GL51 7DB,Tel: 01242 512333, - ,,,No ratings yet Rate it yourself - /Services/pharmacies/LeaveReview/DefaultView.aspx?id=FG766,0,0,,Yes,yes,yes
Spa Pharmacy,FFF73,PHA,12 Rotunda Terrace,Montpellier Street,Cheltenham,Gloucestershire,,GL50 1SW,Tel: 01242 522130, - ,,,No ratings yet Rate it yourself - /Services/pharmacies/LeaveReview/DefaultView.aspx?id=FFF73,0,0,,Yes,yes,yes
Badham Pharmacy,FVC88,PHA,33 MORLEY AVENUE,CHURCHDOWN,GLOUCESTER, ,,GL3 2BL,Tel: 01452 712286, - ,,,No ratings yet Rate it yourself - /Services/pharmacies/LeaveReview/DefaultView.aspx?id=FVC88,0,0,,Yes,yes,yes
Badham Pharmacy,FJV57,PHA,256 LONDON ROAD,CHARLTON KINGS,CHELTENHAM,GLOUCESTERSHIRE,,GL52 6HS,Tel: 01242 515143, - ,,,No ratings yet Rate it yourself - /Services/pharmacies/LeaveReview/DefaultView.aspx?id=FJV57,0,0,,Yes,yes,yes
James Pharmacy,FAQ29,PHA,19 ST GEORGES ROAD,,CHELTENHAM,GLOUCESTERSHIRE,,GL50 3DT,Tel: 01242 522880, - ,,,No ratings yet Rate it yourself - /Services/pharmacies/LeaveReview/DefaultView.aspx?id=FAQ29,0,0,,Yes,yes,no
JHOOTS PHARMACY,FDN17,PHA,56 CORONATION SQUARE,EDINBURGH PLACE,CHELTENHAM,GLOUCESTERSHIRE,,GL51 7SA,Tel: 01242 516623, - ,,,No ratings yet Rate it yourself - /Services/pharmacies/LeaveReview/DefaultView.aspx?id=FDN17,0,0,,Yes,yes,
Badham Pharmacy,FEJ34,PHA,84 ST GEORGES PLACE,,CHELTENHAM,GLOUCESTERSHIRE,,GL50 3QD,Tel: 01242 522412, - ,,,No ratings yet Rate it yourself - /Services/pharmacies/LeaveReview/DefaultView.aspx?id=FEJ34,0,0,,Yes,yes,no
BADHAM PHARMACY,FQ240,PHA,1 OLD CHELTENHAM ROAD,LONGLEVENS,GLOUCESTER, ,,GL2 0AS,Tel: 01452 523338, - ,,,No ratings yet Rate it yourself - /Services/pharmacies/LeaveReview/DefaultView.aspx?id=FQ240,0,0,,Yes,yes,
SUPERDRUG PHARMACY,FQJ46,PHA,95-97 HIGH STREET,CHELTENHAM,GLOUCESTERSHIRE,,,GL50 1DP,Tel: 01242 262459        , - ,,,No ratings yet Rate it yourself - /Services/pharmacies/LeaveReview/DefaultView.aspx?id=FQJ46,0,0,,Yes,yes,no
JHOOTS PHARMACY,FKW62,PHA,WAITROSE STORE,HONEYBOURNE WAY,CHELTENHAM,GLOUCESTERSHIRE,,GL50 3QW,Tel: 01242 512120, - ,,,No ratings yet Rate it yourself - /Services/pharmacies/LeaveReview/DefaultView.aspx?id=FKW62,0,0,,Yes,yes,
Boots,FTT60,PHA,197/199 HIGH STREET,CHELTENHAM,GLOUCESTERSHIRE,,,GL50 1DB,Tel: 01242527084, - ,,,No ratings yet Rate it yourself - /Services/pharmacies/LeaveReview/DefaultView.aspx?id=FTT60,0,0,,Yes,yes,no
Badham Pharmacy,FCF51,PHA,62 HEWLETT ROAD, ,CHELTENHAM,GLOUCESTERSHIRE,,GL52 6AH,Tel: 01242 523762, - ,,,No ratings yet Rate it yourself - /Services/pharmacies/LeaveReview/DefaultView.aspx?id=FCF51,0,0,,Yes,yes,yes
Badham Pharmacy,FQV02,PHA,ASPEN CENTRE,HORTON ROAD,GLOUCESTER,GLOUCESTERSHIRE,,GL1 3PX,Tel: 01452 506545, - ,,,No ratings yet Rate it yourself - /Services/pharmacies/LeaveReview/DefaultView.aspx?id=FQV02,0,0,,Yes,yes,yes
TESCO INSTORE PHARMACY,FAL29,PHA,TESCO STORE,COLLETTS DRIVE,CHELTENHAM,GLOUCESTERSHIRE,,GL51 8JQ,Tel: 0345 6779161, - ,,,No ratings yet Rate it yourself - /Services/pharmacies/LeaveReview/DefaultView.aspx?id=FAL29,0,0,,Yes,yes,yes
Badham Pharmacy,FLJ58,PHA,118 SWINDON ROAD,,CHELTENHAM,,,GL50 4BJ,Tel: 01242 898030, - ,,,No ratings yet Rate it yourself - /Services/pharmacies/LeaveReview/DefaultView.aspx?id=FLJ58,0,0,,Yes,yes,yes
Badham Pharmacy,FH568,PHA,6 PRESTBURY ROAD,,CHELTENHAM,GLOUCESTERSHIRE,,GL52 2PW,Tel: 01242 523226, - ,,,No ratings yet Rate it yourself - /Services/pharmacies/LeaveReview/DefaultView.aspx?id=FH568,0,0,,Yes,yes,yes
ALLCARE PHARMACY,FAJ67,PHA,115 BARTON STREET, ,GLOUCESTER,GLOUCESTERSHIRE,,GL1 4HR,Tel: 01452 645113, - ,,,No ratings yet Rate it yourself - /Services/pharmacies/LeaveReview/DefaultView.aspx?id=FAJ67,0,0,,Yes,yes,
ASDA PHARMACY,FJJ69,PHA,ASDA STORES LTD,BRUTON WAY,GLOUCESTER,,,GL1 1DS,Tel: 01452 833017, - ,,,No ratings yet Rate it yourself - /Services/pharmacies/LeaveReview/DefaultView.aspx?id=FJJ69,0,0,,Yes,yes,yes
Stroud Road Pharmacy,FH018,PHA,153A STROUD ROAD, ,GLOUCESTER, ,,GL1 5JJ,Tel: 01452 523937, - ,,,No ratings yet Rate it yourself - /Services/pharmacies/LeaveReview/DefaultView.aspx?id=FH018,0,0,,Yes,yes,yes
Tuffley Pharmacy,FHW99,PHA,16 SEVENTH AVENUE,TUFFLEY,GLOUCESTER,,,GL4 0EB,Tel: 01452 310199, - ,,,No ratings yet Rate it yourself - /Services/pharmacies/LeaveReview/DefaultView.aspx?id=FHW99,0,0,,Yes,yes,yes
Badham Pharmacy,FG953,PHA,102 WHADDON ROAD,,CHELTENHAM,GLOUCESTERSHIRE,,GL52 5NF,Tel: 01242 514330, - ,,,No ratings yet Rate it yourself - /Services/pharmacies/LeaveReview/DefaultView.aspx?id=FG953,0,0,,Yes,yes,yes
CHELTENHAM PHARMACY,FH052,PHA,SPRINGBANK COMM RES CTR,SPRINGBANK WAY,CHELTENHAM,GLOUCESTERSHIRE,,GL51 0LH,Tel: 01242 255061, - ,,,No ratings yet Rate it yourself - /Services/pharmacies/LeaveReview/DefaultView.aspx?id=FH052,0,0,,Yes,yes,
Badham Pharmacy,FP764,PHA,12 LONDON ROAD,,GLOUCESTER,GLOUCESTERSHIRE,,GL1 3NE,Tel: 01452 300181, - ,,,No ratings yet Rate it yourself - /Services/pharmacies/LeaveReview/DefaultView.aspx?id=FP764,0,0,,Yes,yes,no
BADHAM PHARMACY,FJJ61,PHA,ALVIN STREET,,GLOUCESTER,GLOUCESTERSHIRE,,GL1 3EN,Tel: 01452 305518, - ,,,No ratings yet Rate it yourself - /Services/pharmacies/LeaveReview/DefaultView.aspx?id=FJJ61,0,0,,Yes,yes,
Linden Pharmacy,FKJ50,PHA,92-94 LINDEN ROAD, ,GLOUCESTER, ,,GL1 5HE,Tel: 01452 522812, - ,,,No ratings yet Rate it yourself - /Services/pharmacies/LeaveReview/DefaultView.aspx?id=FKJ50,0,0,,Yes,yes,yes
Boots,FHG31,PHA,38-46 EASTGATE STREET,,GLOUCESTER, ,,GL1 1PU,Tel: 01452423501, - ,,,No ratings yet Rate it yourself - /Services/pharmacies/LeaveReview/DefaultView.aspx?id=FHG31,0,0,,Yes,yes,no
ALLIED PHARMACY GLOUCESTER,FML07,PHA,28 SOUTHGATE STREET,,GLOUCESTER,GLOUCESTERSHIRE,,GL1 2DP,Tel: 01452 301146, - ,,,No ratings yet Rate it yourself - /Services/pharmacies/LeaveReview/DefaultView.aspx?id=FML07,0,0,,Yes,yes,
ALLIED PHARMACY HOLMLEIGH PARADE,FTC81,PHA,19 HOLMLEIGH PARADE,,TUFFLEY,GLOUCESTERSHIRE,,GL4 0QU,Tel: 01452 527859, - ,,,No ratings yet Rate it yourself - /Services/pharmacies/LeaveReview/DefaultView.aspx?id=FTC81,0,0,,Yes,yes,
Badham Pharmacy,FV408,PHA,UNIT 2 LONGFORD LOCAL CEN,HOSBERE DRIVE,LONGFORD,GLOUCESTERSHIRE,,GL2 9DH,Tel: 01452 203225, - ,,,No ratings yet Rate it yourself - /Services/pharmacies/LeaveReview/DefaultView.aspx?id=FV408,0,0,,Yes,yes,yes
Wymans Brook Pharmacy,FAG66,PHA,UNIT 1,WYMANS SHOPPING CENTRE,WINDYRIDGE GARDENS,"CHELTENHAM, GLOS.",,GL50 4RA,Tel: 01242 221988, - ,,,No ratings yet Rate it yourself - /Services/pharmacies/LeaveReview/DefaultView.aspx?id=FAG66,0,0,,Yes,yes,yes
Badham Pharmacy Limited,FAV45,PHA,THE WILSON HEALTH CENTRE,236 PRESTBURY ROAD,CHELTENHAM,GLOUCESTERSHIRE,,GL52 3EY,Tel: 01242 244318, - ,,,No ratings yet Rate it yourself - /Services/pharmacies/LeaveReview/DefaultView.aspx?id=FAV45,0,0,,Yes,yes,
Boots,FN213,PHA,UNIT F GALLAGHER RTL PARK,TEWKESBURY ROAD,CHELTENHAM,GLOUCESTERSHIRE,,GL51 9RR,Tel: 01242269387, - ,,,No ratings yet Rate it yourself - /Services/pharmacies/LeaveReview/DefaultView.aspx?id=FN213,0,0,,Yes,yes,yes
Badham Pharmacy,FFR82,PHA,QUAYSIDE HOUSE,QUAY STREET,GLOUCESTER,GLOUCESTERSHIRE,,GL1 2TZ,Tel: 01452 757755, - ,,,No ratings yet Rate it yourself - /Services/pharmacies/LeaveReview/DefaultView.aspx?id=FFR82,0,0,,Yes,yes,yes
TESCO INSTORE PHARMACY,FNM51,PHA,TESCO SUPERSTORE,ST OSWALD'S ROAD,GLOUCESTER,,,GL1 2SG,Tel: 0345 6779305, - ,,,No ratings yet Rate it yourself - /Services/pharmacies/LeaveReview/DefaultView.aspx?id=FNM51,0,0,,Yes,yes,yes
Badham Pharmacy,FA323,PHA,NEW MEDICAL CENTRE,RUDLOE DRIVE,KINGSWAY,GLOUCESTERSHIRE,,GL2 2FY,Tel: 01452 724206, - ,,,No ratings yet Rate it yourself - /Services/pharmacies/LeaveReview/DefaultView.aspx?id=FA323,0,0,,Yes,yes,yes
Boots,FVL01,PHA,UNITS 3-6 QUEDGELEY R/P,QUEDGELEY,GLOUCESTER, ,,GL2 4NF,Tel: 01452720688, - ,,,No ratings yet Rate it yourself - /Services/pharmacies/LeaveReview/DefaultView.aspx?id=FVL01,0,0,,Yes,yes,yes
TESCO INSTORE PHARMACY,FGV91,PHA,BRISTOL ROAD,QUEDGELEY,GLOUCESTER,GLOUCESTERSHIRE,,GL2 4PF,Tel: 0345 6779567, - ,,,No ratings yet Rate it yourself - /Services/pharmacies/LeaveReview/DefaultView.aspx?id=FGV91,0,0,,Yes,yes,yes
Boots,FLH40,PHA,37 TANGLEWOOD WAY,BUSSAGE,STROUD,GLOUCESTERSHIRE,,GL6 8DE,Tel: 01453886869, - ,,,No ratings yet Rate it yourself - /Services/pharmacies/LeaveReview/DefaultView.aspx?id=FLH40,0,0,,Yes,yes,yes
JHOOTS PHARMACY,FRW06,PHA,SEVERNVALE SURGERY,"ST JAMES, QUEDGELEY",GLOUCESTER,GLOUCESTERSHIRE,,GL2 4WD,Tel: 01452 728297, - ,,,No ratings yet Rate it yourself - /Services/pharmacies/LeaveReview/DefaultView.aspx?id=FRW06,0,0,,Yes,yes,
Boots,FEA00,PHA,57 HIGH STREET,STROUD,GLOUCESTERSHIRE, ,,GL5 1AS,Tel: 01453764292, - ,,,No ratings yet Rate it yourself - /Services/pharmacies/LeaveReview/DefaultView.aspx?id=FEA00,0,0,,Yes,yes,no
SUPERDRUG PHARMACY,FKJ18,PHA,60-61 HIGH STREET,STROUD,GLOUCESTERSHIRE, ,,GL5 1AS,Tel: 01453 764079        , - ,,,No ratings yet Rate it yourself - /Services/pharmacies/LeaveReview/DefaultView.aspx?id=FKJ18,0,0,,Yes,yes,no
STROUD FAMILY PHARMACY,FTK49,PHA,ROWCROFT MEDICAL CENTRE,ROWCROFT RETREAT,STROUD,GLOUCESTERSHIRE,,GL5 3BE,Tel: 01453 764513, - ,,,No ratings yet Rate it yourself - /Services/pharmacies/LeaveReview/DefaultView.aspx?id=FTK49,0,0,,Yes,yes,
TESCO INSTORE PHARMACY,FDT34,PHA,TESCO SUPERSTORE,STRATFORD ROAD,STROUD,GLOUCESTERSHIRE,,GL5 4AG,Tel: 0345 6779633, - ,,,No ratings yet Rate it yourself - /Services/pharmacies/LeaveReview/DefaultView.aspx?id=FDT34,0,0,,Yes,yes,yes
Cainscross Pharmacy,FTH50,PHA,16 Cashes Green Road,Cainscross,Stroud,Gloucestershire,,GL5 4JG,Tel: 01453 759205, - ,,,No ratings yet Rate it yourself - /Services/pharmacies/LeaveReview/DefaultView.aspx?id=FTH50,0,0,,Yes,yes,
Badham Pharmacy,FYR63,PHA,4 STOKE ROAD,BISHOPS CLEEVE,CHELTENHAM,GLOUCESTERSHIRE,,GL52 8RP,Tel: 01242 672211, - ,,,No ratings yet Rate it yourself - /Services/pharmacies/LeaveReview/DefaultView.aspx?id=FYR63,0,0,,Yes,yes,yes
Badham Pharmacy,FRN12,PHA,23 CHURCH ROAD,BISHOPS CLEEVE,CHELTENHAM,GLOUCESTERSHIRE,,GL52 8LR,Tel: 01242 672653, - ,,,No ratings yet Rate it yourself - /Services/pharmacies/LeaveReview/DefaultView.aspx?id=FRN12,0,0,,Yes,yes,yes
Badham Pharmacy,FCM79,PHA,CLEEVELANDS MEDICAL CTR,SAPPHIRE ROAD,CHELTENHAM,,,GL52 7YU,Tel: 01242 303480, - ,,,No ratings yet Rate it yourself - /Services/pharmacies/LeaveReview/DefaultView.aspx?id=FCM79,0,0,,Yes,yes,yes
Boots,FJE64,PHA,LONDON HOUSE,THE CROSS,MINCHINHAMPTON,GLOUCESTERSHIRE,,GL6 9JA,Tel: 01453882146, - ,,,No ratings yet Rate it yourself - /Services/pharmacies/LeaveReview/DefaultView.aspx?id=FJE64,0,0,,Yes,yes,no
STONEHOUSE PHARMACY,FY942,PHA,High Street Medical Ctre,31 High Street,Stonehouse,Gloucestershire,,GL10 2NG,Tel: 01453 823184        , - ,,,No ratings yet Rate it yourself - /Services/pharmacies/LeaveReview/DefaultView.aspx?id=FY942,0,0,,Yes,yes,yes
G. HORTON LIMITED,FN795,PHA,7 MARKET PLACE,CIRENCESTER,GLOUCESTERSHIRE, ,,GL7 2NX,Tel: 01285 653042, - ,,,No ratings yet Rate it yourself - /Services/pharmacies/LeaveReview/DefaultView.aspx?id=FN795,0,0,,Yes,yes,yes
Boots,FAH31,PHA,39-43 CRICKLADE STREET,,CIRENCESTER,GLOUCESTERSHIRE,,GL7 1HY,Tel: 01285653019, - ,,,No ratings yet Rate it yourself - /Services/pharmacies/LeaveReview/DefaultView.aspx?id=FAH31,0,0,,Yes,yes,no
G HORTON CHEMIST,FG526,PHA,24 ASHCROFT GARDENS,,CIRENCESTER,GLOUCESTERSHIRE,,GL7 1RB,Tel: 01285 658217, - ,,,No ratings yet Rate it yourself - /Services/pharmacies/LeaveReview/DefaultView.aspx?id=FG526,0,0,,Yes,yes,
BADHAM PHARMACY LIMITED,FN190,PHA,3 OLD MARKET,NAILSWORTH,STROUD,GLOUCESTERSHIRE,,GL6 0DU,Tel: 01453 832051, - ,,,No ratings yet Rate it yourself - /Services/pharmacies/LeaveReview/DefaultView.aspx?id=FN190,0,0,,Yes,yes,
Chesterton Pharmacy,FH680,PHA,16 CHESTERTON LANE,CIRENCESTER,GLOUCESTERSHIRE, ,,GL7 1XQ,Tel: 01285 653539        , - ,,,No ratings yet Rate it yourself - /Services/pharmacies/LeaveReview/DefaultView.aspx?id=FH680,0,0,,Yes,yes,yes
WINCHCOMBE PHARMACY,FN014,PHA,11 HIGH STREET,WINCHCOMBE,CHELTENHAM,GLOUCESTERSHIRE,,GL54 5LJ,Tel: 01242 602305, - ,,,No ratings yet Rate it yourself - /Services/pharmacies/LeaveReview/DefaultView.aspx?id=FN014,0,0,,Yes,yes,
TESCO INSTORE PHARMACY,FA561,PHA,KINGS MEADOW,CRICKLADE ROAD,CIRENCESTER,GLOUCESTERSHIRE,,GL7 1NP,Tel: 01285 349520, - ,,,No ratings yet Rate it yourself - /Services/pharmacies/LeaveReview/DefaultView.aspx?id=FA561,0,0,,Yes,yes,yes
Badham Pharmacy,FNW96,PHA,105 QUEENS ROAD,PRIORS PARK,TEWKESBURY,GLOUCESTERSHIRE,,GL20 5EN,Tel: 01684 290659, - ,,,No ratings yet Rate it yourself - /Services/pharmacies/LeaveReview/DefaultView.aspx?id=FNW96,0,0,,Yes,yes,yes
DEVEREUX PHARMACY,FQC26,PHA,DEVEREUX MEDICAL CENTRE,BARTON ROAD,TEWKESBURY,GLOUCESTERSHIRE,,GL20 5GJ,Tel: 01684 293309, - ,,,No ratings yet Rate it yourself - /Services/pharmacies/LeaveReview/DefaultView.aspx?id=FQC26,0,0,,Yes,yes,
Boots,FAQ87,PHA,92 HIGH STREET,,TEWKESBURY,GLOUCESTERSHIRE,,GL20 5JZ,Tel: 01684292122, - ,,,No ratings yet Rate it yourself - /Services/pharmacies/LeaveReview/DefaultView.aspx?id=FAQ87,0,0,,Yes,yes,no
BADHAM PHARMACY LIMITED,FNL99,PHA,94 HIGH STREET,,TEWKESBURY,GLOUCESTERSHIRE,,GL20 5JZ,Tel: 01684 293125, - ,,,No ratings yet Rate it yourself - /Services/pharmacies/LeaveReview/DefaultView.aspx?id=FNL99,0,0,,Yes,yes,
Cotswold Pharmacy,FFJ93,PHA,MARKET PLACE,NORTHLEACH,CHELTENHAM,GLOUCESTERSHIRE,,GL54 3EG,Tel: 01451 860295, - ,,,No ratings yet Rate it yourself - /Services/pharmacies/LeaveReview/DefaultView.aspx?id=FFJ93,0,0,,Yes,yes,yes
Northway Chemist,FW495,PHA,Northway Centre,Northway,Tewksbury,Gloucestershire,,GL20 8TW,Tel: 01684 299499, - ,,,No ratings yet Rate it yourself - /Services/pharmacies/LeaveReview/DefaultView.aspx?id=FW495,0,0,,Yes,yes,
Cohens Chemist,FRR69,PHA,37 LONG STREET,,TETBURY,GLOUCESTERSHIRE,,GL8 8AA,Tel: 01666503058, - ,,,No ratings yet Rate it yourself - /Services/pharmacies/LeaveReview/DefaultView.aspx?id=FRR69,0,0,,Yes,yes,
SOUTH CERNEY PHARMACY,FA641,PHA,3 THE LAURELS,CLARKS HAY,SOUTH CERNEY,GLOUCESTERSHIRE,,GL7 5UA,Tel: 01285 861123, - ,,,No ratings yet Rate it yourself - /Services/pharmacies/LeaveReview/DefaultView.aspx?id=FA641,0,0,,Yes,yes,
Boots,FQL86,PHA,16B CHAPEL STREET,CAM,DURSLEY,GLOUCESTERSHIRE,,GL11 5NU,Tel: 01453543177, - ,,,No ratings yet Rate it yourself - /Services/pharmacies/LeaveReview/DefaultView.aspx?id=FQL86,0,0,,Yes,yes,no
DAY LEWIS PHARMACY,FD740,PHA,19 BROAD STREET, ,NEWENT,GLOUCESTERSHIRE,,GL18 1AQ,Tel: 01531820443, - ,,,No ratings yet Rate it yourself - /Services/pharmacies/LeaveReview/DefaultView.aspx?id=FD740,0,0,,Yes,yes,no
Badham Pharmacy,FKD88,PHA,9 HIGH STREET,,NEWNHAM-ON-SEVERN,GLOUCESTERSHIRE,,GL14 1BB,Tel: 01594 516276, - ,,,No ratings yet Rate it yourself - /Services/pharmacies/LeaveReview/DefaultView.aspx?id=FKD88,0,0,,Yes,yes,yes
Boots,FPL54,PHA,70-72 PARSONAGE STREET,DURSLEY,GLOUCESTERSHIRE,,,GL11 4AA,Tel: 01453542275, - ,,,No ratings yet Rate it yourself - /Services/pharmacies/LeaveReview/DefaultView.aspx?id=FPL54,0,0,,Yes,yes,no
Dursley Family Pharmacy,FFM05,PHA,20 Parsonage Street, ,Dursley,Gloucestershire,,GL11 4EA,Tel: 01453 542321, - ,,,No ratings yet Rate it yourself - /Services/pharmacies/LeaveReview/DefaultView.aspx?id=FFM05,0,0,,Yes,yes,
May Lane Pharmacy,FW544,PHA,Maylane Surgery,27 May Lane,Dursley,Gloucestershire,,GL11 4JN,Tel: 01453 543886, - ,,,No ratings yet Rate it yourself - /Services/pharmacies/LeaveReview/DefaultView.aspx?id=FW544,0,0,,Yes,yes,
Rowlands Pharmacy,FWR99,PHA,3 THE CHESTNUTS,BOURTON-ON-THE-WATER,CHELTENHAM,GLOUCESTERSHIRE,,GL54 2AN,Tel: 01451 820849, - ,,,No ratings yet Rate it yourself - /Services/pharmacies/LeaveReview/DefaultView.aspx?id=FWR99,0,0,,Yes,yes,yes
Mitcheldean Pharmacy,FT390,PHA,5 CHURCHILL WAY,,MITCHELDEAN,GLOUCESTERSHIRE,,GL17 0AZ,Tel: 01594 544997        , - ,,,No ratings yet Rate it yourself - /Services/pharmacies/LeaveReview/DefaultView.aspx?id=FT390,0,0,,Yes,yes,yes
Cinderford Pharmacy,FXW94,PHA,The Co-Op Foodstore,Dockham Road,Cinderford,Gloucestershire,,GL14 2AQ,Tel: 01594 822131, - ,,,No ratings yet Rate it yourself - /Services/pharmacies/LeaveReview/DefaultView.aspx?id=FXW94,0,0,,Yes,yes,
MARKET STREET PHARMACY,FJC25,PHA,9-11 MARKET STREET,,CINDERFORD,GLOUCESTERSHIRE,,GL14 2RT,Tel: 01594 822332, - ,,,No ratings yet Rate it yourself - /Services/pharmacies/LeaveReview/DefaultView.aspx?id=FJC25,0,0,,Yes,yes,
Boots,FRQ45,PHA,GLOUCESTER HOUSE,MARKET PLACE,FAIRFORD,GLOUCESTERSHIRE,,GL7 4AB,Tel: 01285712350, - ,,,No ratings yet Rate it yourself - /Services/pharmacies/LeaveReview/DefaultView.aspx?id=FRQ45,0,0,,Yes,yes,no
WOTTON FAMILY PHARMACY,FDL37,PHA,GRANTLEY HOUSE,43 LONG STREET,WOTTON-UNDER-EDGE,GLOUCESTERSHIRE,,GL12 7BX,Tel: 01453 843171, - ,,,No ratings yet Rate it yourself - /Services/pharmacies/LeaveReview/DefaultView.aspx?id=FDL37,0,0,,Yes,yes,
Boots,FQA38,PHA,12 HIGH STREET, ,UPTON UPON SEVERN,WORCESTERSHIRE,,WR8 0HB,Tel: 01684592637, - ,,,No ratings yet Rate it yourself - /Services/pharmacies/LeaveReview/DefaultView.aspx?id=FQA38,0,0,,Yes,yes,no
Boots,FAC64,PHA,39 HIGH STREET,MALMESBURY,WILTSHIRE, ,,SN16 9AA,Tel: 01666823130, - ,,,No ratings yet Rate it yourself - /Services/pharmacies/LeaveReview/DefaultView.aspx?id=FAC64,0,0,,Yes,yes,no
Boots,FW122,PHA,100 HIGH STREET,CRICKLADE,SWINDON,WILTSHIRE,,SN6 6AA,Tel: 01793750226, - ,,,No ratings yet Rate it yourself - /Services/pharmacies/LeaveReview/DefaultView.aspx?id=FW122,0,0,,Yes,yes,yes
Drybrook Pharmacy,FQP21,PHA,DRYBROOK ROAD,DRYBROOK,GLOUCESTERSHIRE, ,,GL17 9JA,Tel: 01594 542517, - ,,,No ratings yet Rate it yourself - /Services/pharmacies/LeaveReview/DefaultView.aspx?id=FQP21,0,0,,Yes,yes,yes
Boots,FXH88,PHA,PRIMARY CARE CENTRE,"PRIORY WAY,BURTON HILL",MALMESBURY,WILTSHIRE,,SN16 0FB,Tel: 01666826115, - ,,,No ratings yet Rate it yourself - /Services/pharmacies/LeaveReview/DefaultView.aspx?id=FXH88,0,0,,Yes,yes,yes
BERKELEY PHARMACY,FX629,PHA,14 MARKET PLACE,,BERKELEY,GLOUCESTERSHIRE,,GL13 9BB,Tel: 01453 810316, - ,,,No ratings yet Rate it yourself - /Services/pharmacies/LeaveReview/DefaultView.aspx?id=FX629,0,0,,Yes,yes,
Badham Pharmacy Limited,FQ451,PHA,"UNIT 2,THE VILLAGE SQUARE",UPPER RISSINGTON,CHELTENHAM,GLOUCESTERSHIRE,,GL54 2FL,Tel: 01451 828226, - ,,,No ratings yet Rate it yourself - /Services/pharmacies/LeaveReview/DefaultView.aspx?id=FQ451,0,0,,Yes,yes,yes
BROADWAY PHARMACY,FT767,PHA,FISH HILL,22 HIGH STREET,BROADWAY,WORCESTERSHIRE,,WR12 7DT,Tel: 01386 853356, - ,,,No ratings yet Rate it yourself - /Services/pharmacies/LeaveReview/DefaultView.aspx?id=FT767,0,0,,Yes,yes,
Badham Pharmacy ,FYE05,PHA,11 THE SQUARE,STOW ON THE WOLD,CHELTENHAM,GLOUCESTERSHIRE,,GL54 1BQ,Tel: 01451 830623        , - ,,,No ratings yet Rate it yourself - /Services/pharmacies/LeaveReview/DefaultView.aspx?id=FYE05,0,0,,Yes,yes,yes
Morrisons Pharmacy,FX853,PHA,THE LINK,FOUR POOLS ESTATE,EVESHAM,WORCESTERSHIRE,,WR11 1DX,Tel: 01386 40610         , - ,,,No ratings yet Rate it yourself - /Services/pharmacies/LeaveReview/DefaultView.aspx?id=FX853,0,0,,Yes,yes,yes
FOREST PHARMACY,FJW85,PHA,41-43 NEWERNE STREET,,LYDNEY,GLOUCESTERSHIRE,,GL15 5RA,Tel: 01594 842847, - ,,,No ratings yet Rate it yourself - /Services/pharmacies/LeaveReview/DefaultView.aspx?id=FJW85,0,0,,Yes,yes,
Lydney Pharmacy,FWC75,PHA,33 Newerne Street,,Lydney,Gloucestershire,,GL15 5RB,Tel: 01594 843443, - ,,,No ratings yet Rate it yourself - /Services/pharmacies/LeaveReview/DefaultView.aspx?id=FWC75,0,0,,Yes,yes,
Stewart Pharmacy,FEM42,PHA,THE CHAPEL,WATERSIDE,EVESHAM,,,WR11 1JZ,Tel: 01386 443422, - ,,,No ratings yet Rate it yourself - /Services/pharmacies/LeaveReview/DefaultView.aspx?id=FEM42,0,0,,Yes,yes,yes
Vale Pharmacy,FLK28,PHA,EVESHAM MEDICAL CENTRE,ABBEY LANE,EVESHAM,WORCESTERSHIRE,,WR11 4BS,Tel: 01386 47613, - ,,,No ratings yet Rate it yourself - /Services/pharmacies/LeaveReview/DefaultView.aspx?id=FLK28,0,0,,Yes,yes,
Boots,FQ478,PHA,9 HIGH STREET,LEDBURY,HEREFORDSHIRE, ,,HR8 1DS,Tel: 01531632687, - ,,,No ratings yet Rate it yourself - /Services/pharmacies/LeaveReview/DefaultView.aspx?id=FQ478,0,0,,Yes,yes,yes
PURTON PHARMACY,FWP03,PHA,"7 THE PARADE, PAVENHILL",PURTON,SWINDON,WILTSHIRE,,SN5 4BX,Tel: 01793 770294, - ,,,No ratings yet Rate it yourself - /Services/pharmacies/LeaveReview/DefaultView.aspx?id=FWP03,0,0,,Yes,yes,
DAY LEWIS PHARMACY,FE202,PHA,2 SEAR HOUSE,BYE STREET,LEDBURY, ,,HR8 2AA,Tel: 01531632693, - ,,,No ratings yet Rate it yourself - /Services/pharmacies/LeaveReview/DefaultView.aspx?id=FE202,0,0,,Yes,yes,no