Organisation Name,NACS Code,Organisation Type,Address1,Address2,Address3,Address4,Address5,PostCode,Telephone Number,Opening time,Value  (Opening time),Banding Classification  (Opening time),NHS.UK users rating,Value  (NHS.UK users rating),Banding Classification  (NHS.UK users rating),Electronic prescription service,Value  (Electronic prescription service),Banding Classification  (Electronic prescription service),Car parking (Is there car parking at this organisation?)
Boots,FLX98,PHA,78 HIGH STREET,BROMSGROVE,WORCESTERSHIRE, ,,B61 8EX,Tel: 01527872056, - ,,,No ratings yet Rate it yourself - /Services/pharmacies/LeaveReview/DefaultView.aspx?id=FLX98,0,0,,Yes,yes,no
Knights Central Pharmacy,FQR31,PHA,18 MARKET STREET,,BROMSGROVE,WORCESTERSHIRE,,B61 8DA,Tel: 01527 833133, - ,,,1 rating Rate it yourself - /Services/pharmacies/LeaveReview/DefaultView.aspx?id=FQR31,,,,Yes,yes,yes
LLOYDSPHARMACY,FQW07,PHA,BHI PARKSIDE MED CENTRE,STOURBRIDGE ROAD,BROMSGROVE,WORCESTERSHIRE,,B61 0AZ,Tel: 01527 872077, - ,,,No ratings yet Rate it yourself - /Services/pharmacies/LeaveReview/DefaultView.aspx?id=FQW07,0,0,,Yes,yes,
KNIGHTS BROMSGROVE PHARMACY,FR583,PHA,36 BIRMINGHAM ROAD,BROMSGROVE,WORCESTERSHIRE, ,,B61 0DD,Tel: 01527 835984, - ,,,1 rating Rate it yourself - /Services/pharmacies/LeaveReview/DefaultView.aspx?id=FR583,,,,Yes,yes,yes
BROMSGROVE PHARMACY,FG640,PHA,46 NEW ROAD,BROMSGROVE,WORCESTERSHIRE,,,B60 2JS,Tel: 01527 876876, - ,,,2 ratings Rate it yourself - /Services/pharmacies/LeaveReview/DefaultView.aspx?id=FG640,,,,Yes,yes,
Morrisons Pharmacy,FFV57,PHA,BUNTSFORD PARK ROAD,,BROMSGROVE,WORCESTERSHIRE,,B60 3DX,Tel: 01527 870915, - ,,,7 ratings Rate it yourself - /Services/pharmacies/LeaveReview/DefaultView.aspx?id=FFV57,,,,Yes,yes,yes
Knights Catshill Pharmacy,FWW91,PHA,155-157 GOLDEN CROSS LANE,CATSHILL,BROMSGROVE,WORCESTERSHIRE,,B61 0JZ,Tel: 01527 872469, - ,,,3 ratings Rate it yourself - /Services/pharmacies/LeaveReview/DefaultView.aspx?id=FWW91,,,,Yes,yes,yes
BARNT GREEN PHARMACY,FX160,PHA,32 HEWELL ROAD,BARNT GREEN,BIRMINGHAM,WEST MIDLANDS,,B45 8NE,Tel: 0121 4452116, - ,,,3 ratings Rate it yourself - /Services/pharmacies/LeaveReview/DefaultView.aspx?id=FX160,,,,Yes,yes,
Knights Rubery Pharmacy,FTX59,PHA,102 NEW ROAD,RUBERY,BIRMINGHAM, ,,B45 9HY,Tel: 0121 4533594, - ,,,5 ratings Rate it yourself - /Services/pharmacies/LeaveReview/DefaultView.aspx?id=FTX59,,,,Yes,yes,yes
Rubery Late Night Pharmacy,FGQ24,PHA,196 NEW ROAD,,RUBERY,BIRMINGHAM,,B45 9JA,Tel: 0121 457 8175, - ,,,18 ratings Rate it yourself - /Services/pharmacies/LeaveReview/DefaultView.aspx?id=FGQ24,,,,Yes,yes,
REDNAL PHARMACY,FFP70,PHA,202 NEW ROAD,"RUBERY, REDNAL",BIRMINGHAM,,,B45 9JA,Tel: 0121 4532717, - ,,,1 rating Rate it yourself - /Services/pharmacies/LeaveReview/DefaultView.aspx?id=FFP70,,,,Yes,yes,
ALVECHURCH PHARMACY,FA746,PHA,7-8 THE SQUARE,ALVECHURCH,BIRMINGHAM, ,,B48 7LA,Tel: 0121 4452771, - ,,,1 rating Rate it yourself - /Services/pharmacies/LeaveReview/DefaultView.aspx?id=FA746,,,,Yes,yes,
Morrisons Pharmacy,FLD52,PHA,BIRMINGHAM GREAT PARK,"BRISTOL RD SOUTH, RUBERY",BIRMINGHAM, ,,B45 9NY,Tel: 0121 453 2614, - ,,,6 ratings Rate it yourself - /Services/pharmacies/LeaveReview/DefaultView.aspx?id=FLD52,,,,Yes,yes,yes
FRANKLEY PHARMACY,FW779,PHA,"HOLLYHILL CTR,18 ARDEN RD","RUBERY, REDNAL",BIRMINGHAM,,,B45 0JA,Tel: 0121 4539593, - ,,,2 ratings Rate it yourself - /Services/pharmacies/LeaveReview/DefaultView.aspx?id=FW779,,,,Yes,yes,
HILLVIEW PHARMACY,FPE29,PHA,HILLVIEW PHARMACY,60 BROMSGROVE ROAD,REDDITCH,WORCESTERSHIRE,,B97 4RN,Tel: 01527 591737, - ,,,1 rating Rate it yourself - /Services/pharmacies/LeaveReview/DefaultView.aspx?id=FPE29,,,,Yes,yes,yes
Knights Longbridge Pharmacy,FX156,PHA,4 SUNBURY ROAD,LONGBRIDGE,BIRMINGHAM, ,,B31 4LJ,Tel: 0121 475 2655, - ,,,5 ratings Rate it yourself - /Services/pharmacies/LeaveReview/DefaultView.aspx?id=FX156,,,,Yes,yes,yes
County Pharmacy,FTH83,PHA,13-15 CHURCH ROAD,,REDDITCH,WORCESTERSHIRE,,B97 4AB,Tel: 01527 591 501, - ,,,24 ratings Rate it yourself - /Services/pharmacies/LeaveReview/DefaultView.aspx?id=FTH83,,,,Yes,yes,yes
ELGAR HOUSE PHARMACY,FP183,PHA,ELGAR HOUSE SURGERY,CHURCH ROAD,REDDITCH,WORCESTERSHIRE,,B97 4AB,Tel: 01527 64337, - ,,,No ratings yet Rate it yourself - /Services/pharmacies/LeaveReview/DefaultView.aspx?id=FP183,0,0,,Yes,yes,
APOLLO PHARMACY,FEQ01,PHA,15 WILLIAM STREET,,REDDITCH,WORCESTERSHIRE,,B97 4AJ,Tel: 01527 592109, - ,,,1 rating Rate it yourself - /Services/pharmacies/LeaveReview/DefaultView.aspx?id=FEQ01,,,,Yes,yes,
Boots,FCH56,PHA,1-4 KINGFISHER WALK,REDDITCH,WORCESTERSHIRE, ,,B97 4EY,Tel: 0152768166, - ,,,No ratings yet Rate it yourself - /Services/pharmacies/LeaveReview/DefaultView.aspx?id=FCH56,0,0,,Yes,yes,no
CHURCH GREEN PHARMACY,FJW97,PHA,7 CHURCH GREEN WEST,,REDDITCH,WORCESTERSHIRE,,B97 4DU,Tel: 01527 62431, - ,,,No ratings yet Rate it yourself - /Services/pharmacies/LeaveReview/DefaultView.aspx?id=FJW97,0,0,,Yes,yes,
Hingley Chemist,FXR57,PHA,Hollymoor Medical Centre,Manor Park Grove,Northfield,Birmingham,,B31 5ER,Tel: 0121 4530055, - ,,,5 ratings Rate it yourself - /Services/pharmacies/LeaveReview/DefaultView.aspx?id=FXR57,,,,Yes,yes,yes
Knights Headless Cross Pharmacy,FD681,PHA,65 EVESHAM ROAD,HEADLESS CROSS,REDDITCH,WORCESTERSHIRE,,B97 4JX,Tel: 01527 545194, - ,,,1 rating Rate it yourself - /Services/pharmacies/LeaveReview/DefaultView.aspx?id=FD681,,,,Yes,yes,yes
Boots,FKC01,PHA,50 ST ANDREWS SQUARE,DROITWICH,WORCESTERSHIRE,,,WR9 8TJ,Tel: 01905773219, - ,,,No ratings yet Rate it yourself - /Services/pharmacies/LeaveReview/DefaultView.aspx?id=FKC01,0,0,,Yes,yes,no
KNIGHTS WEST HEATH PHARMACY,FCH29,PHA,5 ALVECHURCH ROAD,WEST HEATH,BIRMINGHAM,,,B31 3JW,Tel: 0121 477 0123, - ,,,2 ratings Rate it yourself - /Services/pharmacies/LeaveReview/DefaultView.aspx?id=FCH29,,,,Yes,yes,yes
St Mary Pharmacy,FX620,PHA,FARMERS WAY,WESTLANDS,DROITWICH,WORCESTERSHIRE,,WR9 9EQ,Tel: 01905 778109        , - ,,,No ratings yet Rate it yourself - /Services/pharmacies/LeaveReview/DefaultView.aspx?id=FX620,0,0,,Yes,yes,
REDHILL PHARMACY,FA183,PHA,11 ALVECHURCH ROAD,WEST HEATH,BIRMINGHAM, ,,B31 3JP,Tel: 0121 4752790, - ,,,No ratings yet Rate it yourself - /Services/pharmacies/LeaveReview/DefaultView.aspx?id=FA183,0,0,,Yes,yes,
Droitwich Pharmacy,FD998,PHA,OMBERSLEY STREET EAST,DROITWICH SPA,,WORCESTERSHIRE,,WR9 8RD,Tel: 01905 771036        , - ,,,21 ratings Rate it yourself - /Services/pharmacies/LeaveReview/DefaultView.aspx?id=FD998,,,,Yes,yes,
Corbett Pharmacy,FQ104,PHA,36 CORBETT AVENUE, ,DROITWICH,WORCESTERSHIRE,,WR9 7BE,Tel: 01905 795618, - ,,,17 ratings Rate it yourself - /Services/pharmacies/LeaveReview/DefaultView.aspx?id=FQ104,,,,Yes,yes,yes
Knights Crabbs Cross Pharmacy,FX918,PHA,434 EVESHAM ROAD,CRABBS CROSS,REDDITCH,WORCESTERSHIRE,,B97 5JB,Tel: 01527 402146, - ,,,2 ratings Rate it yourself - /Services/pharmacies/LeaveReview/DefaultView.aspx?id=FX918,,,,Yes,yes,yes
TESCO INSTORE PHARMACY,FWA18,PHA,TESCO EXTRA COLDFIELD DRV,OAKENSHAW,REDDITCH,WORCESTERSHIRE,,B98 7RU,Tel: 0345 6779569, - ,,,9 ratings Rate it yourself - /Services/pharmacies/LeaveReview/DefaultView.aspx?id=FWA18,,,,Yes,yes,yes
Knights Royston Hall Pharmacy,FVX64,PHA,15 ST HELIERS ROAD,NORTHFIELD,BIRMINGHAM,,,B31 1QT,Tel: 0121 475 4427, - ,,,6 ratings Rate it yourself - /Services/pharmacies/LeaveReview/DefaultView.aspx?id=FVX64,,,,Yes,yes,yes
Boots,FHK79,PHA,1 MIDDLEMORE ROAD,NORTHFIELD,BIRMINGHAM, ,,B31 3UD,Tel: 01216043000, - ,,,3 ratings Rate it yourself - /Services/pharmacies/LeaveReview/DefaultView.aspx?id=FHK79,,,,Yes,yes,no
Clock Pharmacy,FAW10,PHA,891 BRISTOL ROAD SOUTH,NORTHFIELD,BIRMINGHAM, ,,B31 2PA,Tel: 0121 477 4646, - ,,,3 ratings Rate it yourself - /Services/pharmacies/LeaveReview/DefaultView.aspx?id=FAW10,,,,Yes,yes,no
Browns Pharmacy ,FRF45,PHA,16-18 HAWKESLEY SQUARE,HAWKESLEY,KINGS NORTON,BIRMINGHAM,,B38 9TU,Tel: 0121 458 6172, - ,,,1 rating Rate it yourself - /Services/pharmacies/LeaveReview/DefaultView.aspx?id=FRF45,,,,Yes,yes,
WELL,FNJ44,PHA,96 WORCESTER ROAD,WEST HAGLEY,STOURBRIDGE,WEST MIDLANDS,,DY9 0NJ,Tel: 01562 882 472, - ,,,2 ratings Rate it yourself - /Services/pharmacies/LeaveReview/DefaultView.aspx?id=FNJ44,,,,Yes,yes,no
Rowlands Pharmacy,FKT11,PHA,CHURCH HILL N/HOOD CENTRE,TANHOUSE LANE,REDDITCH,WORCESTERSHIRE,,B98 9AA,Tel: 01527 65771         , - ,,,11 ratings Rate it yourself - /Services/pharmacies/LeaveReview/DefaultView.aspx?id=FKT11,,,,Yes,yes,no
Superdrug Pharmacy,FW167,PHA,24-28 GROSVENOR SHOPP CTR,NORTHFIELD,BIRMINGHAM,,,B31 2JU,Tel: 0121 477 3845, - ,,,No ratings yet Rate it yourself - /Services/pharmacies/LeaveReview/DefaultView.aspx?id=FW167,0,0,,Yes,yes,yes
BROWNS PHARMACY,FCL96,PHA,228-230 WYCHALL ROAD,NORTHFIELD,BIRMINGHAM,,,B31 3AU,Tel: 0121 4581119, - ,,,No ratings yet Rate it yourself - /Services/pharmacies/LeaveReview/DefaultView.aspx?id=FCL96,0,0,,Yes,yes,
Pitman Pharmacy,FXD49,PHA,622 BRISTOL ROAD SOUTH,NORTHFIELD,BIRMINGHAM,,,B31 2JR,Tel: 0121 476 2276, - ,,,30 ratings Rate it yourself - /Services/pharmacies/LeaveReview/DefaultView.aspx?id=FXD49,,,,Yes,yes,yes
Woodrow Pharmacy,FGT31,PHA,9 Woodrow Centre,Woodrow,Redditch,Worcestershire,,B98 7RY,Tel: 01527 501143, - ,,,No ratings yet Rate it yourself - /Services/pharmacies/LeaveReview/DefaultView.aspx?id=FGT31,0,0,,Yes,yes,yes
Knights Bartley Green Pharmacy,FF431,PHA,1 CURDALE ROAD,BARTLEY GREEN,BIRMINGHAM,WEST MIDLANDS,,B32 4HD,Tel: 0121 4753425, - ,,,2 ratings Rate it yourself - /Services/pharmacies/LeaveReview/DefaultView.aspx?id=FF431,,,,Yes,yes,yes
Aston Chemist Ltd,FDX11,PHA,4 Shenley Green,Shenley Lane,Selly Oak,Birmingham,,B29 4HH,Tel: 0121 475 4293 , - ,,,23 ratings Rate it yourself - /Services/pharmacies/LeaveReview/DefaultView.aspx?id=FDX11,,,,Yes,yes,yes
G R Pharmacy,FDG00,PHA,44-46 HILLWOOD ROAD,NORTHFIELD,,BIRMINGHAM,,B31 1DJ,Tel: 0121 475 2556, - ,,,7 ratings Rate it yourself - /Services/pharmacies/LeaveReview/DefaultView.aspx?id=FDG00,,,,Yes,yes,yes
KD PHARMACY,FHV47,PHA,2 THE FOLD,KINGS NORTON,BIRMINGHAM, ,,B38 9BL,Tel: 0121 458 4638, - ,,,3 ratings Rate it yourself - /Services/pharmacies/LeaveReview/DefaultView.aspx?id=FHV47,,,,Yes,yes,
Knights Winyates Pharmacy,FAV46,PHA,WINYATES HEALTH CENTRE,WINYATES WAY,REDDITCH,WORCESTERSHIRE,,B98 0NR,Tel: 01527 529277, - ,,,No ratings yet Rate it yourself - /Services/pharmacies/LeaveReview/DefaultView.aspx?id=FAV46,0,0,,Yes,yes,yes
Knights Jiggins Lane Pharmacy,FJ513,PHA,17 JIGGINS LANE,BARTLEY GREEN,BIRMINGHAM,WEST MIDLANDS,,B32 3LA,Tel: 0121 475 1654, - ,,,3 ratings Rate it yourself - /Services/pharmacies/LeaveReview/DefaultView.aspx?id=FJ513,,,,Yes,yes,
HASBURY PHARMACY,FX548,PHA,ST MARGARETS WELL SURGERY,2 QUARRY LANE,HALESOWEN,WEST MIDLANDS,,B63 4WD,Tel: 0121 5859065, - ,,,No ratings yet Rate it yourself - /Services/pharmacies/LeaveReview/DefaultView.aspx?id=FX548,0,0,,Yes,yes,
Knights Astwood Bank Pharmacy,FLF99,PHA,1196B EVERSHAM ROAD,ASTWOOD BANK,REDDITCH,WORCESTERSHIRE,,B96 6AA,Tel: 01527 893288, - ,,,No ratings yet Rate it yourself - /Services/pharmacies/LeaveReview/DefaultView.aspx?id=FLF99,0,0,,Yes,yes,yes
Browns Pharmacy ,FTL22,PHA,5 THE GREEN,KINGS NORTON,BIRMINGHAM, ,,B38 8SD,Tel: 0121 458 1097, - ,,,1 rating Rate it yourself - /Services/pharmacies/LeaveReview/DefaultView.aspx?id=FTL22,,,,Yes,yes,
Nightingale Pharmacy,FT243,PHA,"Unit 2,Heronswood Road",Spennells Estate,Kidderminster,Worcestershire,,DY10 4EX,Tel: 01562 829858        , - ,,,3 ratings Rate it yourself - /Services/pharmacies/LeaveReview/DefaultView.aspx?id=FT243,,,,Yes,yes,
STOCK AND LINDSAY LTD,FGE31,PHA,3 MATCHBOROUGH CENTRE,REDDITCH,WORCESTER, ,,B98 0EP,Tel: 01527 501817        , - ,,,No ratings yet Rate it yourself - /Services/pharmacies/LeaveReview/DefaultView.aspx?id=FGE31,0,0,,Yes,yes,yes
WYCHBURY PHARMACY,FVD85,PHA,WYCHBURY MEDICAL CENTRE,121 OAKFIELD ROAD,"WOLLESCOTE, STOURBRIDGE",WEST MIDLANDS,,DY9 9DS,Tel: 01562 882743, - ,,,3 ratings Rate it yourself - /Services/pharmacies/LeaveReview/DefaultView.aspx?id=FVD85,,,,Yes,yes,
PEAK PHARMACY,FJ733,PHA,33 THORNHILL ROAD,HALESOWEN,DUDLEY,WEST MIDLANDS,,B63 1AU,Tel: 0121 550 1015, - ,,,2 ratings Rate it yourself - /Services/pharmacies/LeaveReview/DefaultView.aspx?id=FJ733,,,,Yes,yes,yes
MURRAYS HEALTHCARE,FV619,PHA,57 QUEENSWAY,THE CORNBOW SHOPPING CTR.,"HALESOWEN, DUDLEY",WEST MIDLANDS,,B63 4AG,Tel: 0121 585 1255, - ,,,No ratings yet Rate it yourself - /Services/pharmacies/LeaveReview/DefaultView.aspx?id=FV619,0,0,,Yes,yes,no
HALESOWEN PHARMACY,FWK15,PHA,11 PECKINGHAM STREET,HALESOWEN,DUDLEY,WEST MIDLANDS,,B63 3AW,Tel: 0121 5501374, - ,,,1 rating Rate it yourself - /Services/pharmacies/LeaveReview/DefaultView.aspx?id=FWK15,,,,Yes,yes,
KING'S PHARMACY & OPTICIANS,FDX63,PHA,1-3 PERSHORE ROAD SOUTH,COTTERIDGE,BIRMINGHAM,,,B30 3EE,Tel: 0121 433 3072, - ,,,2 ratings Rate it yourself - /Services/pharmacies/LeaveReview/DefaultView.aspx?id=FDX63,,,,Yes,yes,
ASDA PHARMACY,FE723,PHA,THE CORNBOW SHOPPING CTR,QUEENSWAY MALL,"QUEENSWAY, HALESOWEN",WEST MIDLANDS,,B63 4AB,Tel: 0121 504 4210, - ,,,No ratings yet Rate it yourself - /Services/pharmacies/LeaveReview/DefaultView.aspx?id=FE723,0,0,,Yes,yes,yes
EVERGREEN PHARMACY LTD,FLL07,PHA,24 WATFORD ROAD,COTTERIDGE,BIRMINGHAM,,,B30 1JA,Tel: 0121 458 1439, - ,,,2 ratings Rate it yourself - /Services/pharmacies/LeaveReview/DefaultView.aspx?id=FLL07,,,,Yes,yes,yes
Cotteridge Pharmacy,FMK97,PHA,1889 PERSHORE ROAD,KINGS NORTON,BIRMINGHAM, ,,B30 3DJ,Tel: 0121 4581275, - ,,,No ratings yet Rate it yourself - /Services/pharmacies/LeaveReview/DefaultView.aspx?id=FMK97,0,0,,Yes,yes,no
Boots,FCX95,PHA,61 STEVENS AVENUE,WOODGATE VALLEY,BIRMINGHAM,,,B32 3SD,Tel: 01214263773, - ,,,1 rating Rate it yourself - /Services/pharmacies/LeaveReview/DefaultView.aspx?id=FCX95,,,,Yes,yes,no
DEAN PHARMACY,FHQ02,PHA,175 WEOLEY CASTLE ROAD,SELLY OAK,BIRMINGHAM, ,,B29 5QH,Tel: 0121 4271851, - ,,,1 rating Rate it yourself - /Services/pharmacies/LeaveReview/DefaultView.aspx?id=FHQ02,,,,Yes,yes,
Kings Pharmacy,FRF17,PHA,118-120 WEOLEY CASTLE SQ,WEOLEY CASTLE,BIRMINGHAM,,,B29 5PT,Tel: 0121 477 7756, - ,,,6 ratings Rate it yourself - /Services/pharmacies/LeaveReview/DefaultView.aspx?id=FRF17,,,,Yes,yes,
Castle Chemist,FQ534,PHA,104 Weoley Castle Road,Selly Oak,Birmingham,West Midlands,,B29 5PT,Tel: 0121 4751822, - ,,,1 rating Rate it yourself - /Services/pharmacies/LeaveReview/DefaultView.aspx?id=FQ534,,,,Yes,yes,
Hawne Chemist,FQK55,PHA,177 STOURBRIDGE ROAD,HALESOWEN,DUDLEY,WEST MIDLANDS,,B63 3UD,Tel: 0121 501 3518, - ,,,4 ratings Rate it yourself - /Services/pharmacies/LeaveReview/DefaultView.aspx?id=FQK55,,,,Yes,yes,yes
CRESTPHARMACY - LINDEN AVENUE,FTH46,PHA,46 Linden Avenue,,Kidderminster,Worcestershire,,DY10 3AA,Tel: 01562 822459, - ,,,8 ratings Rate it yourself - /Services/pharmacies/LeaveReview/DefaultView.aspx?id=FTH46,,,,Yes,yes,
Kidderminster Pharmacy,FD652,PHA,24 COMBERTON HILL,,KIDDERMINSTER,WORCESTERSHIRE,,DY10 1QN,Tel: 01562 822837, - ,,,No ratings yet Rate it yourself - /Services/pharmacies/LeaveReview/DefaultView.aspx?id=FD652,0,0,,Yes,yes,yes
Knights Studley Pharmacy,FRJ31,PHA,POOL MEDICAL CENTRE,POOL ROAD,STUDLEY,,,B80 7QU,Tel: 01527 852891, - ,,,9 ratings Rate it yourself - /Services/pharmacies/LeaveReview/DefaultView.aspx?id=FRJ31,,,,Yes,yes,yes
Boots,FM748,PHA,137 MONYHULL HALL ROAD,KINGS NORTON,BIRMINGHAM, ,,B30 3QG,Tel: 01214582756, - ,,,1 rating Rate it yourself - /Services/pharmacies/LeaveReview/DefaultView.aspx?id=FM748,,,,Yes,yes,no
Manor Pharmacy,FGM94,PHA,12 Manor Lane,Halesowen,Dudley,West Midlands,,B62 8PY,Tel: 0121 4217487, - ,,,21 ratings Rate it yourself - /Services/pharmacies/LeaveReview/DefaultView.aspx?id=FGM94,,,,Yes,yes,yes
Druids Heath Pharmacy,FYY02,PHA,17 POUND ROAD,DRUIDS HEATH,BIRMINGHAM, ,,B14 5SB,Tel: 0121 430 5535, - ,,,1 rating Rate it yourself - /Services/pharmacies/LeaveReview/DefaultView.aspx?id=FYY02,,,,Yes,yes,no
Swinford Pharmacy,FD114,PHA,90 Hagley Road,Stourbridge,Dudley,West Midlands,,DY8 1QU,Tel: 01384 440030, - ,,,7 ratings Rate it yourself - /Services/pharmacies/LeaveReview/DefaultView.aspx?id=FD114,,,,Yes,yes,yes
Ashtree Pharmacy,FXR61,PHA,1534 PERSHORE ROAD,STIRCHLEY,BIRMINGHAM,,,B30 2NW,Tel: 0121 459 6023, - ,,,8 ratings Rate it yourself - /Services/pharmacies/LeaveReview/DefaultView.aspx?id=FXR61,,,,Yes,yes,
Bournville Pharmacy,FKR26,PHA,45 Sycamore Road,Bournville,Birmingham,West Midlands,,B30 2AA,Tel: 0121 4720282, - ,,,9 ratings Rate it yourself - /Services/pharmacies/LeaveReview/DefaultView.aspx?id=FKR26,,,,Yes,yes,
Kidderminster Pharmacy,FAH30,PHA,KIDDERMINSTER MEDICAL CTR,COVENTRY ST/WATERLOO ST,KIDDERMINSTER,WORCESTERSHIRE,,DY10 2BG,Tel: 01562 743773, - ,,,1 rating Rate it yourself - /Services/pharmacies/LeaveReview/DefaultView.aspx?id=FAH30,,,,Yes,yes,no
COLLEY GATE PHARMACY,FLA40,PHA,118 Colley Gate,Halesowen,Dudley,West Midlands,,B63 2BU,Tel: 01384 569443, - ,,,5 ratings Rate it yourself - /Services/pharmacies/LeaveReview/DefaultView.aspx?id=FLA40,,,,Yes,yes,yes
Hollywood Pharmacy,FTA06,PHA,59 MAY LANE,HOLLYWOOD,BIRMINGHAM, ,,B47 5PA,Tel: 01564 824122        , - ,,,82 ratings Rate it yourself - /Services/pharmacies/LeaveReview/DefaultView.aspx?id=FTA06,,,,Yes,yes,yes
TESCO INSTORE PHARMACY,FJH90,PHA,TESCO SUPERSTORE,CASTLE ROAD,KIDDERMINSTER,WORCESTERSHIRE,,DY11 6SW,Tel: 0345 6779390, - ,,,No ratings yet Rate it yourself - /Services/pharmacies/LeaveReview/DefaultView.aspx?id=FJH90,0,0,,Yes,yes,yes
RAJJA CHEMISTS,FYA78,PHA,5 DWELLINGS LANE,QUINTON,BIRMINGHAM, ,,B32 1RJ,Tel: 0121 421 6840, - ,,,1 rating Rate it yourself - /Services/pharmacies/LeaveReview/DefaultView.aspx?id=FYA78,,,,Yes,yes,yes
Day Night Pharmacy,FPH60,PHA,45 High Street,Lye,Stourbridge,West Midlands,,DY9 8LQ,Tel: 01384 898400, - ,,,11 ratings Rate it yourself - /Services/pharmacies/LeaveReview/DefaultView.aspx?id=FPH60,,,,Yes,yes,no
LYMES PHARMACY,FDV71,PHA,173A HIGH STREET,LYE,STOURBRIDGE,WEST MIDLANDS,,DY9 8LN,Tel: 01384 422357, - ,,,No ratings yet Rate it yourself - /Services/pharmacies/LeaveReview/DefaultView.aspx?id=FDV71,0,0,,Yes,yes,
Grange Pharmacy,FDJ18,PHA,8 HOWLEY GRANGE ROAD,HALESOWEN,DUDLEY,WEST MIDLANDS,,B62 0HN,Tel: 0121 422 2226, - ,,,6 ratings Rate it yourself - /Services/pharmacies/LeaveReview/DefaultView.aspx?id=FDJ18,,,,Yes,yes,yes
Wythall Pharmacy,FPD67,PHA,221 STATION ROAD,WYTHALL,BIRMINGHAM,WORCESTERSHIRE,,B47 6ET,Tel: 01564 822198, - ,,,6 ratings Rate it yourself - /Services/pharmacies/LeaveReview/DefaultView.aspx?id=FPD67,,,,Yes,yes,yes
Lye Pharmacy,FWW51,PHA,37 HIGH STREET,LYE,STOURBRIDGE,,,DY9 8LF,Tel: 01384 422001, - ,,,2 ratings Rate it yourself - /Services/pharmacies/LeaveReview/DefaultView.aspx?id=FWW51,,,,Yes,yes,yes
Boots,FE890,PHA,15 WEAVERS WHARF,,KIDDERMINSTER,WORCESTERSHIRE,,DY10 1AA,Tel: 01562751200, - ,,,No ratings yet Rate it yourself - /Services/pharmacies/LeaveReview/DefaultView.aspx?id=FE890,0,0,,Yes,yes,yes
The Church Street Pharmacy,FE746,PHA,David Corbet House,Callows Lane,Kidderminster,Worcestershire,,DY10 2JG,Tel: 01562 228362, - ,,,25 ratings Rate it yourself - /Services/pharmacies/LeaveReview/DefaultView.aspx?id=FE746,,,,Yes,yes,no
Broadway Pharmacy,FNH04,PHA,95 THE BROADWAY,STOURBRIDGE,DUDLEY,WEST MIDLANDS,,DY8 3HX,Tel: 01384 394856, - ,,,3 ratings Rate it yourself - /Services/pharmacies/LeaveReview/DefaultView.aspx?id=FNH04,,,,Yes,yes,yes
Medipharma Chemist,FDQ04,PHA,29 OAK TREE LANE,SELLY OAK,BIRMINGHAM, ,,B29 6JE,Tel: 0121 472 0693, - ,,,10 ratings Rate it yourself - /Services/pharmacies/LeaveReview/DefaultView.aspx?id=FDQ04,,,,Yes,yes,yes
Kidderminster Pharmacy,FHE45,PHA,81 Stourport Road,Foley Park,Kidderminster,Worcestershire,,DY11 7BQ,Tel: 01562 753046, - ,,,1 rating Rate it yourself - /Services/pharmacies/LeaveReview/DefaultView.aspx?id=FHE45,,,,Yes,yes,yes
STOURBRIDGE PHARMACY,FL877,PHA,35 WORCESTER STREET,STOURBRIDGE,DUDLEY,WEST MIDLANDS,,DY8 1AT,Tel: 01384 377123, - ,,,3 ratings Rate it yourself - /Services/pharmacies/LeaveReview/DefaultView.aspx?id=FL877,,,,Yes,yes,
MURRAYS HEALTHCARE,FKH40,PHA,5-6 HALESOWEN ROAD,HALESOWEN,DUDLEY,WEST MIDLANDS,,B62 9AA,Tel: 0121 422 2103, - ,,,1 rating Rate it yourself - /Services/pharmacies/LeaveReview/DefaultView.aspx?id=FKH40,,,,Yes,yes,yes
FARADAY PHARMACY,FN620,PHA,17 FARADAY AVENUE,QUINTON,BIRMINGHAM, ,,B32 1JP,Tel: 0121 4222249, - ,,,1 rating Rate it yourself - /Services/pharmacies/LeaveReview/DefaultView.aspx?id=FN620,,,,Yes,yes,
Selcroft Pharmacy,FD522,PHA,SELCROFT AVENUE,QUINTON,BIRMINGHAM,,,B32 2BX,Tel: 01214276060, - ,,,2 ratings Rate it yourself - /Services/pharmacies/LeaveReview/DefaultView.aspx?id=FD522,,,,Yes,yes,yes
Boots,FY822,PHA,5 RYEMARKET,STOURBRIDGE,DUDLEY,WEST MIDLANDS,,DY8 1HJ,Tel: 01384394157, - ,,,1 rating Rate it yourself - /Services/pharmacies/LeaveReview/DefaultView.aspx?id=FY822,,,,Yes,yes,no
Haden Vale Pharmacy,FWL41,PHA,50 BARRS ROAD,CRADLEY HEATH,,WEST MIDLANDS,,B64 7HG,Tel: 01384 562002, - ,,,5 ratings Rate it yourself - /Services/pharmacies/LeaveReview/DefaultView.aspx?id=FWL41,,,,Yes,yes,yes
Evergreen Pharmacy,FD038,PHA,161 COOMBS ROAD,HALESOWEN,DUDLEY,WEST MIDLANDS,,B62 8AF,Tel: 0121 5595157, - ,,,8 ratings Rate it yourself - /Services/pharmacies/LeaveReview/DefaultView.aspx?id=FD038,,,,Yes,yes,
Cohens Chemist,FGA01,PHA,HUME STREET MEDICAL CTR,HUME STREET,KIDDERMINSTER,WORCESTERSHIRE,,DY11 6SF,Tel: 01562825999, - ,,,5 ratings Rate it yourself - /Services/pharmacies/LeaveReview/DefaultView.aspx?id=FGA01,,,,Yes,yes,yes
Whites Pharmacy,FWG01,PHA,788 ALCESTER ROAD SOUTH,KINGS HEATH,BIRMINGHAM, ,,B14 5EZ,Tel: 0121 430 5435, - ,,,1 rating Rate it yourself - /Services/pharmacies/LeaveReview/DefaultView.aspx?id=FWG01,,,,Yes,yes,yes
Kings Heath Pharmacy,FFK75,PHA,294 VICARAGE ROAD,KINGS HEATH,BIRMINGHAM, ,,B14 7NH,Tel: 0121 444 5049, - ,,,28 ratings Rate it yourself - /Services/pharmacies/LeaveReview/DefaultView.aspx?id=FFK75,,,,Yes,yes,yes
VICARAGE ROAD PHARMACY,FHF87,PHA,280 VICARAGE ROAD,KINGS HEATH,BIRMINGHAM, ,,B14 7NH,Tel: 0121 4441764, - ,,,No ratings yet Rate it yourself - /Services/pharmacies/LeaveReview/DefaultView.aspx?id=FHF87,0,0,,Yes,yes,
Ridgacre Hse Pharmacy,FWG91,PHA,RIDGACRE HOUSE MED CTR,"83 RIDGACRE ROAD, QUINTON",BIRMINGHAM ,,,B32 2TJ,Tel: 0121 4223791, - ,,,5 ratings Rate it yourself - /Services/pharmacies/LeaveReview/DefaultView.aspx?id=FWG91,,,,Yes,yes,yes
York Pharmacy,FAP45,PHA,14 YORK STREET,STOURPORT-ON-SEVERN,WORCESTERSHIRE, ,,DY13 9EF,Tel: 01299878845, - ,,,5 ratings Rate it yourself - /Services/pharmacies/LeaveReview/DefaultView.aspx?id=FAP45,,,,Yes,yes,yes
HAGLEY RD PHARMACY,FKF59,PHA,518 HAGLEY ROAD WEST, ,OLDBURY,WEST MIDLANDS,,B68 0BZ,Tel: 0121 4222434, - ,,,No ratings yet Rate it yourself - /Services/pharmacies/LeaveReview/DefaultView.aspx?id=FKF59,0,0,,Yes,yes,
Instore Pharmacy,FV824,PHA,Lombard Street, ,Stourport-On-Severn,Worcestershire,,DY13 8ND,Tel: 01299 879097, - ,,,1 rating Rate it yourself - /Services/pharmacies/LeaveReview/DefaultView.aspx?id=FV824,,,,Yes,yes,yes
Oaks Pharmacy,FWV41,PHA,564-566 BRISTOL ROAD,BOURNBROOK,BIRMINGHAM, ,,B29 6BE,Tel: 0121 4720174, - ,,,6 ratings Rate it yourself - /Services/pharmacies/LeaveReview/DefaultView.aspx?id=FWV41,,,,Yes,yes,Data not available
HINGLEYS CHEMIST,FPX56,PHA,59 Cradley Road,Cradley Heath,,West Midlands,,B64 6AG,Tel: 01384 564993, - ,,,3 ratings Rate it yourself - /Services/pharmacies/LeaveReview/DefaultView.aspx?id=FPX56,,,,Yes,yes,no
STOURPORT (SMC) PHARMACY,FED42,PHA,STOURPORT MEDICAL CENTRE,DUNLEY ROAD,STOURPORT-ON-SEVERN,WORCESTERSHIRE,,DY13 0AA,Tel: 01299 822850, - ,,,87 ratings Rate it yourself - /Services/pharmacies/LeaveReview/DefaultView.aspx?id=FED42,,,,Yes,yes,Data not available
HINGLEYS CHEMIST,FM186,PHA,95 HIGH STREET,CRADLEY HEATH,,WEST MIDLANDS,,B64 5HF,Tel: 0138 4566814, - ,,,2 ratings Rate it yourself - /Services/pharmacies/LeaveReview/DefaultView.aspx?id=FM186,,,,Yes,yes,no