Organisation Name,NACS Code,Organisation Type,Address1,Address2,Address3,Address4,Address5,PostCode,Telephone Number,Opening time,Value  (Opening time),Banding Classification  (Opening time),NHS.UK users rating,Value  (NHS.UK users rating),Banding Classification  (NHS.UK users rating),Car parking (Is there car parking at this organisation?)
"Sames, J.P. Opticians",OP_5A4_241__000001_RM38DT,OPT,108 Hilldene Avenue,Harrold Hill,,Romford,Essex,RM3 8DT,Tel: 01708 377777, - ,,,No ratings yet Rate it yourself - /Services/opticians/LeaveReview/DefaultView.aspx?id=OP_5A4_241__000001_RM38DT,0,0,
Boots-Harold Hill,OP_5A4_9574__000002_RM38DX,OPT,16 Farnham Road,,Harold Hill,Romford,Essex,RM3 8DX,Tel: 01708 341 550, - ,,,No ratings yet Rate it yourself - /Services/opticians/LeaveReview/DefaultView.aspx?id=OP_5A4_9574__000002_RM38DX,0,0,
Romford Tesco Opticians,OP_5A4RTO__000002_RM30LL,OPT,Bryant Avenue,,Romford,Essex,,RM3 0LL,Tel: 0345 601 3479, - ,,,No ratings yet Rate it yourself - /Services/opticians/LeaveReview/DefaultView.aspx?id=OP_5A4RTO__000002_RM30LL,0,0,
Eye Clinic,OP_5A4_13775__000001_RM30PH,OPT,11b Oak Road,Harold Wood,,Romford,Essex,RM3 0PH,Tel: 01708 372303, - ,,,1 rating Rate it yourself - /Services/opticians/LeaveReview/DefaultView.aspx?id=OP_5A4_13775__000001_RM30PH,,,
"Debney, K. Opticians",OP_5A4_4835__000002_RM53PR,OPT,16 Chase Cross Road,Collier Row,Romford,,,RM5 3PR,Tel: 01708 737448, - ,,,1 rating Rate it yourself - /Services/opticians/LeaveReview/DefaultView.aspx?id=OP_5A4_4835__000002_RM53PR,,,
A M Fletcher Opticians,CO 3580 - 5A4__000001_RM26ND,OPT,Links Avenue,Gidea Park,,Romford,Essex,RM2 6ND,Tel: 01708 742297, - ,,,No ratings yet Rate it yourself - /Services/opticians/LeaveReview/DefaultView.aspx?id=CO 3580 - 5A4__000001_RM26ND,0,0,
Templeman Opticians,OP_5GP_10874__000001_CM144RZ,OPT,131 High Street,,Brentwood,Essex,,CM14 4RZ,Tel: 01277 220932, - ,,,No ratings yet Rate it yourself - /Services/opticians/LeaveReview/DefaultView.aspx?id=OP_5GP_10874__000001_CM144RZ,0,0,
"Muskett, W. (N. Cox)",OP_5A4_13776__000002_RM11DL,OPT,108 North Street,,Romford,,,RM1 1DL,Tel: 01708 749589, - ,,,No ratings yet Rate it yourself - /Services/opticians/LeaveReview/DefaultView.aspx?id=OP_5A4_13776__000002_RM11DL,0,0,
Vision Express (UK) Ltd,OP_5A4_6734__000001_RM13EE,OPT,"Unit 17, Liberty 2",Mercury Gardens,Romford,,,RM1 3EE,Tel: 01708 731616, - ,,,No ratings yet Rate it yourself - /Services/opticians/LeaveReview/DefaultView.aspx?id=OP_5A4_6734__000001_RM13EE,0,0,
Scrivens Opticians,OP_5GP_7429__000001_CM144BX,OPT,29 Baytree Centre,,Brentwood,Essex,,CM14 4BX,Tel: 0121 456 8700, - ,,,No ratings yet Rate it yourself - /Services/opticians/LeaveReview/DefaultView.aspx?id=OP_5GP_7429__000001_CM144BX,0,0,
Boots Opticians Ltd,OP_5GP_11983__000002_CM144RH,OPT,15 High Street,,Brentwood,,,CM14 4RH,Tel: 01277 211297, - ,,,No ratings yet Rate it yourself - /Services/opticians/LeaveReview/DefaultView.aspx?id=OP_5GP_11983__000002_CM144RH,0,0,
Boots-Brentwood - High St,OP_5GP_6329__000001_CM144AJ,OPT,36a High Street,,,Brentwood,Essex,CM14 4AJ,Tel: 01277 211297, - ,,,1 rating Rate it yourself - /Services/opticians/LeaveReview/DefaultView.aspx?id=OP_5GP_6329__000001_CM144AJ,,,
Boots-Romford - The Liberty,OP_5A4_11825__000002_RM13RL,OPT,12 The Liberty,,,Romford,Essex,RM1 3RL,Tel: 01708 725334, - ,,,1 rating Rate it yourself - /Services/opticians/LeaveReview/DefaultView.aspx?id=OP_5A4_11825__000002_RM13RL,,,
Vision Express,OP-5PY-3491__000003_CM144AB,OPT,26a High Street,,Brentwood,Essex,,CM14 4AB,Tel: 01277 231502, - ,,,No ratings yet Rate it yourself - /Services/opticians/LeaveReview/DefaultView.aspx?id=OP-5PY-3491__000003_CM144AB,0,0,
Specsavers Opticians,OP_5GP_1290__000001_CM144AB,OPT,22 High Street,,Brentwood,,,CM14 4AB,Tel: 01277 200700, - ,,,No ratings yet Rate it yourself - /Services/opticians/LeaveReview/DefaultView.aspx?id=OP_5GP_1290__000001_CM144AB,0,0,
"Cole, Martin & Tregaskis Optometrists",OP_5GP_9926__000002_CM158AG,OPT,23 Shenfield Road,,,Brentwood,Essex,CM15 8AG,Tel: 01277 211164, - ,,,1 rating Rate it yourself - /Services/opticians/LeaveReview/DefaultView.aspx?id=OP_5GP_9926__000002_CM158AG,,,
Boots-Romford - Stewards Walk,RM1 3RJ_19288,OPT,,16 Stewards Walk,,Romford,Essex,RM1 3RJ,Tel: 01708 741 312, - ,,,No ratings yet Rate it yourself - /Services/opticians/LeaveReview/DefaultView.aspx?id=RM1 3RJ_19288,0,0,
Specsavers,OP_5A4_417__000001_RM11RX,OPT,90 South Street,,Romford,,,RM1 1RX,Tel: 01708 724475, - ,,,No ratings yet Rate it yourself - /Services/opticians/LeaveReview/DefaultView.aspx?id=OP_5A4_417__000001_RM11RX,0,0,
Edward Watts Opticians,OP_5GP_10094__000002_CM158RQ,OPT,14 Chelmsford Road,Shenfield,Brentwood,Essex,,CM15 8RQ,Tel: 01277 212978, - ,,,1 rating Rate it yourself - /Services/opticians/LeaveReview/DefaultView.aspx?id=OP_5GP_10094__000002_CM158RQ,,,
SCRIVENS,OP_5NA45715__000001_IG74DJ,OPT,191 Manford Way,Chigwell,,London,,IG7 4DJ,Tel: 020 8500 2304, - ,,,No ratings yet Rate it yourself - /Services/opticians/LeaveReview/DefaultView.aspx?id=OP_5NA45715__000001_IG74DJ,0,0,
Pipkin Partnership Optometrists,OP_5AJ_4264__000001_CM59EB,OPT,96 High Street,,Ongar,Essex,,CM5 9EB,Tel: 01277 362192, - ,,,No ratings yet Rate it yourself - /Services/opticians/LeaveReview/DefaultView.aspx?id=OP_5AJ_4264__000001_CM59EB,0,0,
Roy Gill,OP_5A4_13770__000001_RM124U,OPT,96 High Street,Hornchurch,Essex,,,RM12 4UH,Tel: 01708 475623, - ,,,No ratings yet Rate it yourself - /Services/opticians/LeaveReview/DefaultView.aspx?id=OP_5A4_13770__000001_RM124U,0,0,
Boatmans Opticians,OP_5PV_01__000003_CM59JJ,OPT,182 High Street,,Ongar,Essex,,CM5 9JJ,Tel: 01277 366665, - ,,,No ratings yet Rate it yourself - /Services/opticians/LeaveReview/DefaultView.aspx?id=OP_5PV_01__000003_CM59JJ,0,0,
Boots-Hornchurch - High St,OP_5A4_1321__000001_RM113YD,OPT,127-133 High Street,,,Hornchurch,Essex,RM11 3YD,Tel: 01708 440233, - ,,,No ratings yet Rate it yourself - /Services/opticians/LeaveReview/DefaultView.aspx?id=OP_5A4_1321__000001_RM113YD,0,0,
Specsavers Ltd,OP_5A4_14774__000002_RM113YD,OPT,139 High Street,Hornchurch,Essex,,,RM11 3YD,Tel: 01708 460170, - ,,,1 rating Rate it yourself - /Services/opticians/LeaveReview/DefaultView.aspx?id=OP_5A4_14774__000002_RM113YD,,,
Gill Eyecare Ltd,01/14123,OPT,,145 High Street,,Honrchurch,Essex,RM11 3YD,Tel: 01708 475623, - ,,,No ratings yet Rate it yourself - /Services/opticians/LeaveReview/DefaultView.aspx?id=01/14123,0,0,yes
Maa Eyecare,TP8XN,OPT,Maa Eyecare,121 Avon Road,Cranham,Upminster,Greater London,RM14 1RQ,Tel: 01708 259889, - ,,,No ratings yet Rate it yourself - /Services/opticians/LeaveReview/DefaultView.aspx?id=TP8XN,0,0,yes
"Debney, K. Optician",OP_5A4_999__000001_RM141LD,OPT,219 Front Lane,,Upminster,,,RM14 1LD,Tel: 01708 223116, - ,,,No ratings yet Rate it yourself - /Services/opticians/LeaveReview/DefaultView.aspx?id=OP_5A4_999__000001_RM141LD,0,0,
J H PETERS,OP_5NA45707__000001_RM66LU,OPT,192 High Road,Romford,Essex,,,RM6 6LU,Tel: 020 8590 7590, - ,,,No ratings yet Rate it yourself - /Services/opticians/LeaveReview/DefaultView.aspx?id=OP_5NA45707__000001_RM66LU,0,0,
EYE CLINIC CHIGWELL LTD, TP2FH,OPT,,173 Manor Road,,Chigwell Essex,,IG7 5QB,, - ,,,No ratings yet Rate it yourself - /Services/opticians/LeaveReview/DefaultView.aspx?id=TP2FH,0,0,
EYE CLINIC CHIGWELL LTD, TP2FH,OPT,The Opticians,173 Manor Road,,Chigwell,Essex,IG7 5QB,Tel: 0208 928 1500, - ,,,No ratings yet Rate it yourself - /Services/opticians/LeaveReview/DefaultView.aspx?id=TP2FH,0,0,
Aves Opticians,OP_5A4_7090__000002_RM126LL,OPT,211 Station Lane,,Hornchurch,,,RM12 6LL,Tel: 01708 452295, - ,,,No ratings yet Rate it yourself - /Services/opticians/LeaveReview/DefaultView.aspx?id=OP_5A4_7090__000002_RM126LL,0,0,
Eye Gee Opticians,OP_5AJ_13310__000003_IG103ST,OPT,66 The Broadway,Debden,,Loughton,,IG10 3ST,Tel: 0208 508 5092, - ,,,No ratings yet Rate it yourself - /Services/opticians/LeaveReview/DefaultView.aspx?id=OP_5AJ_13310__000003_IG103ST,0,0,
James Read Opticians Ltd,OP_5A4_14773__000001_RM142S,OPT,36 Station Road,Upminster,,Essex,,RM14 2TR,Tel: 01708 221086, - ,,,No ratings yet Rate it yourself - /Services/opticians/LeaveReview/DefaultView.aspx?id=OP_5A4_14773__000001_RM142S,0,0,
Peters J H,OP_52C__000001_RM64LU,OPT,192 High Road,Chadwell Heath,Dagenham,Essex,,RM6 4LU,, - ,,,No ratings yet Rate it yourself - /Services/opticians/LeaveReview/DefaultView.aspx?id=OP_52C__000001_RM64LU,0,0,
Dawsons Opticians (R Stewart),OP_5C2_7675__000001_RM64BE,OPT,1 Station Road,Chadwell Heath,Romford,,,RM6 4BE,Tel: 020 8590 1748, - ,,,No ratings yet Rate it yourself - /Services/opticians/LeaveReview/DefaultView.aspx?id=OP_5C2_7675__000001_RM64BE,0,0,
J I PARTRIDGE,OP_5NA45708__000001_RM64AD,OPT,1106 High Road,Chadwell Heath,London,,,RM6 4AD,Tel: 020 8590 1762, - ,,,No ratings yet Rate it yourself - /Services/opticians/LeaveReview/DefaultView.aspx?id=OP_5NA45708__000001_RM64AD,0,0,
"Bahri, P.K.",OP_5A4_8118__000001_RM143BT,OPT,172 St. Marys Lane,,Upminster,,,RM14 3BT,Tel: 01708 228397, - ,,,No ratings yet Rate it yourself - /Services/opticians/LeaveReview/DefaultView.aspx?id=OP_5A4_8118__000001_RM143BT,0,0,
Boots-Upminster,OP_5A4_4931__000001_RM142AP,OPT,7 Corbets Tey Road,,,Upminster,Essex,RM14 2AP,Tel: 01708 222 383, - ,,,No ratings yet Rate it yourself - /Services/opticians/LeaveReview/DefaultView.aspx?id=OP_5A4_4931__000001_RM142AP,0,0,
AVES OPTICIAN (MRS GUPTA),10090__000001_IG62UE,OPT,49 New North Road,Hainult,Essex,,,IG6 2UE,Tel: 020 8502 7000, - ,,,No ratings yet Rate it yourself - /Services/opticians/LeaveReview/DefaultView.aspx?id=10090__000001_IG62UE,0,0,
Eye Clinic,OP_5A4_13123__000001_RM124RN,OPT,35 The Broadway,Elm Park,,Hornchurch,Essex,RM12 4RN,Tel: 01708 447012, - ,,,1 rating Rate it yourself - /Services/opticians/LeaveReview/DefaultView.aspx?id=OP_5A4_13123__000001_RM124RN,,,
CHIGWELL MEDICAL CENTRE,20000__000001_IG62TA,OPT,300 Fencepiece Road,Hainault,Essex,,,IG6 2TA,, - ,,,2 ratings Rate it yourself - /Services/opticians/LeaveReview/DefaultView.aspx?id=20000__000001_IG62TA,,,
Nasir Opticians,OP_5C2_13777__000001_RM109R,OPT,2-3 Station Parade,Elm Park,,Hornchurch,Essex,RM12 5AB,Tel: 020 8593 0328, - ,,,No ratings yet Rate it yourself - /Services/opticians/LeaveReview/DefaultView.aspx?id=OP_5C2_13777__000001_RM109R,0,0,
Boots-Epping - High St,CM16 4AQ_19173,OPT,,188 Epping High Street,,Epping,Essex,CM16 4AQ,Tel: 01992 571986, - ,,,No ratings yet Rate it yourself - /Services/opticians/LeaveReview/DefaultView.aspx?id=CM16 4AQ_19173,0,0,
Pryor & Clacher,OP_5AJ_1464__000001_CM164BD,OPT,91 High Street,,Epping,Essex,,CM16 4BD,Tel: 01992 575999, - ,,,No ratings yet Rate it yourself - /Services/opticians/LeaveReview/DefaultView.aspx?id=OP_5AJ_1464__000001_CM164BD,0,0,
Aves Optometrists,OP_5AJ_8196__000002_CM164BL,OPT,,221 High Street,,Epping,Essex,CM16 4BL,Tel: 01992 572302, - ,,,1 rating Rate it yourself - /Services/opticians/LeaveReview/DefaultView.aspx?id=OP_5AJ_8196__000002_CM164BL,,,
Boots-Barkingside - High St,OP_5NA45695__000001_IG62DR,OPT,90 High Street,Barkingside,London,London,Essex,IG6 2DR,Tel: 0208 550 2920, - ,,,No ratings yet Rate it yourself - /Services/opticians/LeaveReview/DefaultView.aspx?id=OP_5NA45695__000001_IG62DR,0,0,
OPT A VISION,OP_5NA45713__000005_RM81XU,OPT,14 Rowallen Parade,Dagenham,London,,,RM8 1XU,Tel: 020 8590 1333, - ,,,No ratings yet Rate it yourself - /Services/opticians/LeaveReview/DefaultView.aspx?id=OP_5NA45713__000005_RM81XU,0,0,
Shiva Optician Ltd,TP4CT,OPT,,433 Becontree Avenue,,Dagenham,,RM8 3UH,, - ,,,No ratings yet Rate it yourself - /Services/opticians/LeaveReview/DefaultView.aspx?id=TP4CT,0,0,
"OSAGIE, HENRY",10036__000001_IG103HT,OPT,61 The Lindens,Loughton,Essex,,,IG10 3HT,Tel: 020 8965 6707, - ,,,No ratings yet Rate it yourself - /Services/opticians/LeaveReview/DefaultView.aspx?id=10036__000001_IG103HT,0,0,
SPECSAVERS,50000__000004_IG62AD,OPT,45 High Street,Barkingside,Essex,,,IG6 2AD,Tel: 0208 418 2480, - ,,,66 ratings Rate it yourself - /Services/opticians/LeaveReview/DefaultView.aspx?id=50000__000004_IG62AD,,,
Boots-Barkingside - High St,OP_5NA45687__000001_IG62DF,OPT,10 High Street,Barkingside,London,London,Essex,IG6 2DF,Tel: 020 8550 7740, - ,,,No ratings yet Rate it yourself - /Services/opticians/LeaveReview/DefaultView.aspx?id=OP_5NA45687__000001_IG62DF,0,0,
ELLIS BASS OPTOMETRISTS,5NA_0121__000001_IG62AA,OPT,"Unit 4c, 3-19 High Street",Barkingside,Ilford,Essex,,IG6 2AA,Tel: 020 8550 9288, - ,,,1 rating Rate it yourself - /Services/opticians/LeaveReview/DefaultView.aspx?id=5NA_0121__000001_IG62AA,,,
RAJ OPTICIANS ,OP_5NA45714__000001_IG39UR,OPT,1 RAVENINGS PARADE,39 GOODMAYES ROAD,GOODMAYES,ILFORD,Essex,IG3 9NR,Tel: 0208 590 2739, - ,,,No ratings yet Rate it yourself - /Services/opticians/LeaveReview/DefaultView.aspx?id=OP_5NA45714__000001_IG39UR,0,0,
Bird & Fairley,OP_5AJ_3042__000001_IG101AH,OPT,269 High Road,,,Loughton,Essex,IG10 1AH,Tel: 0208 508 4070, - ,,,No ratings yet Rate it yourself - /Services/opticians/LeaveReview/DefaultView.aspx?id=OP_5AJ_3042__000001_IG101AH,0,0,
David Clulow Opticians,NEW WEPCT__000002_IG101AH,OPT,297 High Road,,Loughton,Essex,,IG10 1AH,Tel: 0208 502 5259, - ,,,No ratings yet Rate it yourself - /Services/opticians/LeaveReview/DefaultView.aspx?id=NEW WEPCT__000002_IG101AH,0,0,
Scher & Ward Opticians,OP_5AJ_2908__000001_IG101BR,OPT,278 High Road,,Loughton,Essex,,IG10 1RB,Tel: 020 8508 5852, - ,,,1 rating Rate it yourself - /Services/opticians/LeaveReview/DefaultView.aspx?id=OP_5AJ_2908__000001_IG101BR,,,
Specsavers Opticians,OP_5AJ_14203__000001_IG101AD,OPT,231 High Road,,Loughton,Essex,,IG10 1AD,Tel: 0208 498 6740, - ,,,No ratings yet Rate it yourself - /Services/opticians/LeaveReview/DefaultView.aspx?id=OP_5AJ_14203__000001_IG101AD,0,0,
Boots-Loughton,IG10 1AD_19218,OPT,,247 High Road,,Loughton,Essex,IG10 1AD,Tel: 02085 087 497, - ,,,1 rating Rate it yourself - /Services/opticians/LeaveReview/DefaultView.aspx?id=IG10 1AD_19218,,,
Atkinson Opticians Ltd,OP_5AJ_794__000001_IG101DX,OPT,24 Forest Road,,Loughton,,,IG10 1DX,Tel: 0208 508 1325, - ,,,No ratings yet Rate it yourself - /Services/opticians/LeaveReview/DefaultView.aspx?id=OP_5AJ_794__000001_IG101DX,0,0,
Home Eye Care (DOM),5LA_OPT_17__000007_IG38RG,OPT,627d  Southend Road,Ilford,Essex,,,IG3 8RG,Tel: 0208 590 6666, - ,,,No ratings yet Rate it yourself - /Services/opticians/LeaveReview/DefaultView.aspx?id=5LA_OPT_17__000007_IG38RG,0,0,
EYE GEE LTD,OP_5NA45700__000002_IG38RA,OPT,651 High Street,Seven Kings,London,,,IG3 8RA,Tel: 0208 599 0033, - ,,,No ratings yet Rate it yourself - /Services/opticians/LeaveReview/DefaultView.aspx?id=OP_5NA45700__000002_IG38RA,0,0,
"Morgan, Henry",OP_5C2_12068__000001_RM108QU,OPT,276 Heathway,,Dagenham,Essex,,RM10 8QU,Tel: 020 8592 1033, - ,,,No ratings yet Rate it yourself - /Services/opticians/LeaveReview/DefaultView.aspx?id=OP_5C2_12068__000001_RM108QU,0,0,
Downes Eyecare,5NA 6080,OPT,,608 High Road,Seven Kings,Ilford,Essex,IG3 8RF,Tel: 020 8590 2710, - ,,,3 ratings Rate it yourself - /Services/opticians/LeaveReview/DefaultView.aspx?id=5NA 6080,,,
Heathway Eyecare,OP_5C2_9798__000002_RM95AQ,OPT,295 Heathway,,Dagenham,,,RM9 5AQ,Tel: 020 8592 2309, - ,,,2 ratings Rate it yourself - /Services/opticians/LeaveReview/DefaultView.aspx?id=OP_5C2_9798__000002_RM95AQ,,,
JAMES SCOTT OPTICIANS LTD,OP_5NA45709__000001_IG88AJ,OPT,637a Chigwell Road,Woodford Bridge,London,,,IG8 8AJ,Tel: 020 8504 3292, - ,,,No ratings yet Rate it yourself - /Services/opticians/LeaveReview/DefaultView.aspx?id=OP_5NA45709__000001_IG88AJ,0,0,
Specsavers ,OP_5C2_13799__000001_RM95AN,OPT,249 Heathway,,Dagenham,Essex,,RM9 5AN,Tel: 020 8596 9998, - ,,,No ratings yet Rate it yourself - /Services/opticians/LeaveReview/DefaultView.aspx?id=OP_5C2_13799__000001_RM95AN,0,0,
Queens Road Opticians,OP_5AJ_5829__000001_IG95BU,OPT,55 Queens Road,,Buckhurst Hill,Essex,,IG9 5BU,Tel: 020 8504 5175, - ,,,2 ratings Rate it yourself - /Services/opticians/LeaveReview/DefaultView.aspx?id=OP_5AJ_5829__000001_IG95BU,,,
HD Jameson & Associates,OP_5AJ_13309__000001_IG96LN,OPT,46 Station Way,,Buckhurst Hill,Essex,,IG9 6LN,Tel: 0208 504 4830, - ,,,No ratings yet Rate it yourself - /Services/opticians/LeaveReview/DefaultView.aspx?id=OP_5AJ_13309__000001_IG96LN,0,0,
HOWARD HARRIS,OP_5NA45706__000001_IG26LE,OPT,474 Cranbrook Road,Gants Hill,Ilford,Essex,,IG2 6LE,Tel: 020 8518 3666, - ,,,2 ratings Rate it yourself - /Services/opticians/LeaveReview/DefaultView.aspx?id=OP_5NA45706__000001_IG26LE,,,
MOBELEYES LTD,30000__000002_IG26LE,OPT,747 Cranbrook Road,Gants Hill,Essex,,,IG2 6LE,Tel: 0208 518 3769, - ,,,No ratings yet Rate it yourself - /Services/opticians/LeaveReview/DefaultView.aspx?id=30000__000002_IG26LE,0,0,
ROSE OPTICAL SERVICE,10079__000004_IG26JU,OPT,48/50 Wayside Mews,,Ilford,,,IG2 6JU,Tel: 020 8551 7512, - ,,,No ratings yet Rate it yourself - /Services/opticians/LeaveReview/DefaultView.aspx?id=10079__000004_IG26JU,0,0,
ROSE OPTOMETRISTS,OP_5NA45716__000010_IG26JZ,OPT,583 Cranbrook Road,Gants Hill,London,,,IG2 6JZ,Tel: 020 8551 5353, - ,,,No ratings yet Rate it yourself - /Services/opticians/LeaveReview/DefaultView.aspx?id=OP_5NA45716__000010_IG26JZ,0,0,
Care Optics,OPT_RM94TR_1,OPT,,527a Gale Street,,London,,RM9 4TR,, - ,,,No ratings yet Rate it yourself - /Services/opticians/LeaveReview/DefaultView.aspx?id=OPT_RM94TR_1,0,0,
VISITING OPTICIAN (MR J SINGH),10040__000001_IG12TF,OPT,295 Mortlake Road,Ilford,Essex,,,IG1 2TF,, - ,,,No ratings yet Rate it yourself - /Services/opticians/LeaveReview/DefaultView.aspx?id=10040__000001_IG12TF,0,0,
Asda Opticians,OP_5C2__000002_RM96SJ,OPT,Merrielands Crescent,*,,Dagenham,Essex,RM9 6SJ,Tel: 0208 5965372, - ,,,1 rating Rate it yourself - /Services/opticians/LeaveReview/DefaultView.aspx?id=OP_5C2__000002_RM96SJ,,,
Scher and Lasky Opticians,10080__000005_IG87QF,OPT,4 Jubilee Parade,Snakes Lane East,Woodford Green,Essex,,IG8 7QF,Tel: 020 8504 9243, - ,,,No ratings yet Rate it yourself - /Services/opticians/LeaveReview/DefaultView.aspx?id=10080__000005_IG87QF,0,0,
Elite Vision,OP_5NA45696__000001_IG11LX,OPT,221 High Road,221 High Road,London,Ilford,,IG1 1LX,Tel: 0208 9118885, - ,,,No ratings yet Rate it yourself - /Services/opticians/LeaveReview/DefaultView.aspx?id=OP_5NA45696__000001_IG11LX,0,0,
Care Optics,01-15072-1,OPT,,14 The Broadway,,London,,IG8 0HL,, - ,,,1 rating Rate it yourself - /Services/opticians/LeaveReview/DefaultView.aspx?id=01-15072-1,,,yes
AVES OPTICIANS,OP_5NA45684__000002_IG14JT,OPT,17 Wellesley Road,Ilford,London,,,IG1 4JT,Tel: 020 8551 1088, - ,,,No ratings yet Rate it yourself - /Services/opticians/LeaveReview/DefaultView.aspx?id=OP_5NA45684__000002_IG14JT,0,0,
"GUPTA, MRS NP",10073__000004_IG14JT,OPT,17 Wellesley Road,,Ilford,,,IG1 4JT,Tel: 020 8554 1088, - ,,,No ratings yet Rate it yourself - /Services/opticians/LeaveReview/DefaultView.aspx?id=10073__000004_IG14JT,0,0,
EYEWEAR CLINIC,OP_5NA45703__000001_IG11AS,OPT,Unit 49,"The Exchange, Ilford",London,,,IG1 1AS,Tel: 020 8478 2971, - ,,,No ratings yet Rate it yourself - /Services/opticians/LeaveReview/DefaultView.aspx?id=OP_5NA45703__000001_IG11AS,0,0,
VISION EXPRESS,OP_5NA45722__000002_IG11AS,OPT,The Exchange,Ilford,London,,,IG1 1AS,Tel: 0208 553 0505, - ,,,No ratings yet Rate it yourself - /Services/opticians/LeaveReview/DefaultView.aspx?id=OP_5NA45722__000002_IG11AS,0,0,
Tesco Opticians Rainham,RM13 9YZ,OPT,,"Bridge Road, Rainham",,Essex,,RM13 9YZ,, - ,,,No ratings yet Rate it yourself - /Services/opticians/LeaveReview/DefaultView.aspx?id=RM13 9YZ,0,0,
SPECSAVERS,OP_5NA45717__000001_IG11DS,OPT,92 High Road,Ilford,London,,,IG1 1DS,Tel: 020 8553 1122, - ,,,No ratings yet Rate it yourself - /Services/opticians/LeaveReview/DefaultView.aspx?id=OP_5NA45717__000001_IG11DS,0,0,
Boots-Ilford - High Rd (in Boots UK),OP_5NA45688__000002_IG11DE,OPT,177-185 High Road,,,Ilford,Essex,IG1 1DE,Tel: 0208 553 5776, - ,,,2 ratings Rate it yourself - /Services/opticians/LeaveReview/DefaultView.aspx?id=OP_5NA45688__000002_IG11DE,,,
EYE CARE (LEWIS JACOBS),OP_5NA45699__000001_IG14DU,OPT,13 Cranbrook Road,Ilford,London,,,IG1 4DU,Tel: 020 8478 3767, - ,,,No ratings yet Rate it yourself - /Services/opticians/LeaveReview/DefaultView.aspx?id=OP_5NA45699__000001_IG14DU,0,0,
Aves Opticians,OP_5A4_13772__000001_RM139Y,OPT,24 The Broadway,Rainham,Essex,,,RM13 9YW,Tel: 01708 555606, - ,,,No ratings yet Rate it yourself - /Services/opticians/LeaveReview/DefaultView.aspx?id=OP_5A4_13772__000001_RM139Y,0,0,
Optom Solutions,10081__000003_IG89AR,OPT,17 Shenfield Road,Woodford Green,Essex,London,,IG8 9AR,Tel: 07968371368, - ,,,No ratings yet Rate it yourself - /Services/opticians/LeaveReview/DefaultView.aspx?id=10081__000003_IG89AR,0,0,
"TUOMINEN, RICKY",10041__000001_IG89AR,OPT,17 Shenfield Road,Woodford Green,Essex,London,,IG8 9AR,Tel: 020 8504 1939, - ,,,No ratings yet Rate it yourself - /Services/opticians/LeaveReview/DefaultView.aspx?id=10041__000001_IG89AR,0,0,
Eye Deal Spectacles Limited,OPT_IG13EE_5,OPT,,108 De Vere Gardens,,Ilford,,IG1 3EE,, - ,,,No ratings yet Rate it yourself - /Services/opticians/LeaveReview/DefaultView.aspx?id=OPT_IG13EE_5,0,0,
Eye Deal Spectacles Limited,OPT_IG13EE_4,OPT,,108 De Vere Gardens,,Ilford,,IG1 3EE,, - ,,,No ratings yet Rate it yourself - /Services/opticians/LeaveReview/DefaultView.aspx?id=OPT_IG13EE_4,0,0,
Eye Deal Spectacles Limited,OPT_IG13EE_2,OPT,,108 De Vere Gardens,,Ilford,Essex,IG1 3EE,Tel: 02085548400, - ,,,No ratings yet Rate it yourself - /Services/opticians/LeaveReview/DefaultView.aspx?id=OPT_IG13EE_2,0,0,
Eye Deal Spectacles Limited,OPT_IG13EE_3,OPT,,108 De Vere Gardens,,Ilford,,IG1 3EE,, - ,,,No ratings yet Rate it yourself - /Services/opticians/LeaveReview/DefaultView.aspx?id=OPT_IG13EE_3,0,0,
Eye Deal Spectacles Limited,OPT_IG13EE_1,OPT,,108 De Vere Gardens,,Ilford,,IG1 3EE,, - ,,,No ratings yet Rate it yourself - /Services/opticians/LeaveReview/DefaultView.aspx?id=OPT_IG13EE_1,0,0,
Eye Deal Spectacles Limited,OPT_IG13EE_6,OPT,,108 De Vere Gardens,,Ilford,,IG1 3EE,, - ,,,No ratings yet Rate it yourself - /Services/opticians/LeaveReview/DefaultView.aspx?id=OPT_IG13EE_6,0,0,
Eye Deal Spectacles Limited,OPT_IG13EE_7,OPT,,108 De Vere Gardens,,Ilford,,IG1 3EE,, - ,,,No ratings yet Rate it yourself - /Services/opticians/LeaveReview/DefaultView.aspx?id=OPT_IG13EE_7,0,0,
Eye Deal Spectacles Limited,OPT_IG13EE_8,OPT,,108 De Vere Gardens,,Ilford,,IG1 3EE,, - ,,,No ratings yet Rate it yourself - /Services/opticians/LeaveReview/DefaultView.aspx?id=OPT_IG13EE_8,0,0,
Eye Deal Spectacles Limited,CO-3845,OPT,,108 De Vere Gardens,,Ilford,,IG1 3EE,, - ,,,No ratings yet Rate it yourself - /Services/opticians/LeaveReview/DefaultView.aspx?id=CO-3845,0,0,
EYES-RITE OPTICIANS,OP_5NA45702__000001_IG12RU,OPT,207 Ilford Lane,Ilford Essex,London,,,IG1 2RU,Tel: 0208 478  5799, - ,,,No ratings yet Rate it yourself - /Services/opticians/LeaveReview/DefaultView.aspx?id=OP_5NA45702__000001_IG12RU,0,0,
C J PACKFORD OPTICIANS,OP_5NC34572__000002_E112RL,OPT,373 High Road,Woodford Green,Essex,,,IG8 0XQ,Tel: 020 8504 2296, - ,,,No ratings yet Rate it yourself - /Services/opticians/LeaveReview/DefaultView.aspx?id=OP_5NC34572__000002_E112RL,0,0,
Bayfields Opticians and Audiologists (South Woodford),M1O9B,OPT,,135a George Lane,,South Woodford,,E18 1AN,Tel: 0208 9891996, - ,,,No ratings yet Rate it yourself - /Services/opticians/LeaveReview/DefaultView.aspx?id=M1O9B,0,0,
KENNETH BIRD (OPTICIANS) LTD,OP_5NA45710__000001_E182QS,OPT,144 High Road,South Woodford,London,,,E18 2QS,Tel: 020 8504 8817, - ,,,No ratings yet Rate it yourself - /Services/opticians/LeaveReview/DefaultView.aspx?id=OP_5NA45710__000001_E182QS,0,0,