Organisation Name,NACS Code,Organisation Type,Address1,Address2,Address3,Address4,Address5,PostCode,Telephone Number,Opening time,Value  (Opening time),Banding Classification  (Opening time),NHS.UK users rating,Value  (NHS.UK users rating),Banding Classification  (NHS.UK users rating),Car parking (Is there car parking at this organisation?)
Robinsons Opticians,OP_5KK_3255__000001_YO177JE,OPT,9 Newbiggin,,Malton,,,YO17 7JE,Tel: 01653 692283, - ,,,3 ratings Rate it yourself - /Services/opticians/LeaveReview/DefaultView.aspx?id=OP_5KK_3255__000001_YO177JE,,,
Scrivens Ltd,OP_5KK_5473__000002_YO177LX,OPT,40 Market Place,,,Malton,Yorkshire,YO17 7LY,Tel: 01653 692052, - ,,,No ratings yet Rate it yourself - /Services/opticians/LeaveReview/DefaultView.aspx?id=OP_5KK_5473__000002_YO177LX,0,0,
Glen Opticians,CO-3860,OPT,,21 Wheelgate,,Malton,North Yorkshire,YO17 7HT,Tel: 01653 600058, - ,,,No ratings yet Rate it yourself - /Services/opticians/LeaveReview/DefaultView.aspx?id=CO-3860,0,0,
Specsavers Opticians,OP_5KK_12540__000001_YO177DT,OPT,Specsavers,10 Castlegate,,Malton,,YO17 7DT,Tel: 01653 692784, - ,,,No ratings yet Rate it yourself - /Services/opticians/LeaveReview/DefaultView.aspx?id=OP_5KK_12540__000001_YO177DT,0,0,
Helmsley Opticians,OP_5KK_2458__000001_YO625B,OPT,10/12 Bondgate,10/12 Bondgate,Helmsley,York,North Yorkshire,YO62 5BR,Tel: 01439 770929, - ,,,No ratings yet Rate it yourself - /Services/opticians/LeaveReview/DefaultView.aspx?id=OP_5KK_2458__000001_YO625B,0,0,
Robinson Opticians Ltd,OP_5KK_1041__000002_YO187DP,OPT,14 Eastgate Square,,Pickering,,,YO18 7DP,Tel: 01751 472737, - ,,,No ratings yet Rate it yourself - /Services/opticians/LeaveReview/DefaultView.aspx?id=OP_5KK_1041__000002_YO187DP,0,0,
Page Opticians,OP_5E2_8050__000001_YO613JA,OPT,134 Long Street,Easingwold,York,,,YO61 3JA,Tel: 01347 822172, - ,,,No ratings yet Rate it yourself - /Services/opticians/LeaveReview/DefaultView.aspx?id=OP_5E2_8050__000001_YO613JA,0,0,
K Malyn Opticians,01-12658,OPT,,91 Long Street,,"Easingwold, York",North Yorkshire,YO61 3HY,Tel: 01347 824131, - ,,,No ratings yet Rate it yourself - /Services/opticians/LeaveReview/DefaultView.aspx?id=01-12658,0,0,
Haxby Opticians,OP_5E2_5121__000001_YO323SA,OPT,,6 Ryedale Court,York,Haxby,,YO32 3SA,Tel: 01904 761216, - ,,,No ratings yet Rate it yourself - /Services/opticians/LeaveReview/DefaultView.aspx?id=OP_5E2_5121__000001_YO323SA,0,0,
Asda Opticians,OPT_YO32 9LF,OPT,,JOCKEY LANE,MONKS CROSS,YORK,,YO32 9LF,Tel: 01904 689412, - ,,,No ratings yet Rate it yourself - /Services/opticians/LeaveReview/DefaultView.aspx?id=OPT_YO32 9LF,0,0,
Boots-York - Clifton Moor,YO30 4XZ_18270,OPT,,7-8 Stirling Road,,Clifton Moor Centre,Yorkshire,YO30 4XZ,Tel: 01904 690337, - ,,,No ratings yet Rate it yourself - /Services/opticians/LeaveReview/DefaultView.aspx?id=YO30 4XZ_18270,0,0,
Groves Opticians ,OP_5E2_14410__000002_YO304RZ,OPT,Tower Court Health Centre,Oakdale Road,Clifton Moor,,,YO30 4RZ,Tel: 01904 479555, - ,,,No ratings yet Rate it yourself - /Services/opticians/LeaveReview/DefaultView.aspx?id=OP_5E2_14410__000002_YO304RZ,0,0,
Boots-York - Parliament St,OP_5E2_11397__000001_YO18RS,OPT,22 Parliament Street,,York,North Yorkshire,,YO1 8RS,Tel: 01904 638827, - ,,,1 rating Rate it yourself - /Services/opticians/LeaveReview/DefaultView.aspx?id=OP_5E2_11397__000001_YO18RS,,,
Optical Express,OP_5E2_13079__000001_YO19NJ,OPT,16 Parliament Street,,,York,North Yorkshire,YO1 8SG,Tel: 0800 023 2020, - ,,,No ratings yet Rate it yourself - /Services/opticians/LeaveReview/DefaultView.aspx?id=OP_5E2_13079__000001_YO19NJ,0,0,
Vision Value Opticians,OP_5E2_4282__000001_YO18SG,OPT,21 Parliament Street,,York,,,YO1 8SG,Tel: 01904 637763, - ,,,No ratings yet Rate it yourself - /Services/opticians/LeaveReview/DefaultView.aspx?id=OP_5E2_4282__000001_YO18SG,0,0,
Viewpoint,OP_5E2_14411__000001_YO18BA,OPT,,9 Feasegate,,York,,YO1 8SH,Tel: 01904 667000, - ,,,1 rating Rate it yourself - /Services/opticians/LeaveReview/DefaultView.aspx?id=OP_5E2_14411__000001_YO18BA,,,
Vision Express (UK) Ltd,OP_5E2_10037__000001_YO18SE,OPT,8-10 Parliament Street,,York,,,YO1 8SE,Tel: 01904 541104, - ,,,No ratings yet Rate it yourself - /Services/opticians/LeaveReview/DefaultView.aspx?id=OP_5E2_10037__000001_YO18SE,0,0,
Boots-York - Coney St,OP_5E2_11218__000002_YO19NH,OPT,43 Coney Street,,York,York,Yorkshire,YO1 9QL,Tel: 01904 642617, - ,,,No ratings yet Rate it yourself - /Services/opticians/LeaveReview/DefaultView.aspx?id=OP_5E2_11218__000002_YO19NH,0,0,
Coverdales Opticians,OP_5E2_7362__000001_YO19TY,OPT,53 Walmgate,,York,,,YO1 9TY,Tel: 01904 631793, - ,,,No ratings yet Rate it yourself - /Services/opticians/LeaveReview/DefaultView.aspx?id=OP_5E2_7362__000001_YO19TY,0,0,
Specsavers Opticians,OP_5E2_7514__000001_YO19QX,OPT,15 Low Ousegate,,York,,,YO1 9QX,Tel: 01904 655611, - ,,,No ratings yet Rate it yourself - /Services/opticians/LeaveReview/DefaultView.aspx?id=OP_5E2_7514__000001_YO19QX,0,0,
Binnington & Thurling Opticians,OP_5E2_10869__000001_YO16JH,OPT,17 Micklegate,,York,,,YO1 6JH,Tel: 01904 653297, - ,,,No ratings yet Rate it yourself - /Services/opticians/LeaveReview/DefaultView.aspx?id=OP_5E2_10869__000001_YO16JH,0,0,
Rae & Rae Opticians,OP_5E2_6184__000001_YO231NA,OPT,33 Bishopthorpe Road,,York,York,,YO23 1NA,Tel: 01904 611553, - ,,,2 ratings Rate it yourself - /Services/opticians/LeaveReview/DefaultView.aspx?id=OP_5E2_6184__000001_YO231NA,,,
VisionCare Optometry with Ruth Perrott,OP_5E2_3755__000002_YO244LZ,OPT,30 York Road,Acomb,,York,,YO24 4LZ,Tel: 01904 784040, - ,,,1 rating Rate it yourself - /Services/opticians/LeaveReview/DefaultView.aspx?id=OP_5E2_3755__000002_YO244LZ,,,
Rayner Opticians,OP_5E2_10720__000003_YO244LZ,OPT,,50a York Road,Acomb,York,Yorkshire,YO24 4LZ,Tel: 01904 785233, - ,,,No ratings yet Rate it yourself - /Services/opticians/LeaveReview/DefaultView.aspx?id=OP_5E2_10720__000003_YO244LZ,0,0,
David Dowley Eyecare Opticians,OP_5E2_13997__000002_YO243BL,OPT,50 York Road,Acomb`,,York,North Yorkshire,YO24 4LZ,Tel: 01904 788811, - ,,,1 rating Rate it yourself - /Services/opticians/LeaveReview/DefaultView.aspx?id=OP_5E2_13997__000002_YO243BL,,,
Row Opticians,OP_5KH_8808__000001_YO71AA,OPT,4 Millgate,,Thirsk,,,YO7 1AA,Tel: 01845 523093, - ,,,No ratings yet Rate it yourself - /Services/opticians/LeaveReview/DefaultView.aspx?id=OP_5KH_8808__000001_YO71AA,0,0,
E G E Hall Opticians,OP_5KH_8543__000002_YO71HQ,OPT,13 Market Place,,,Thirsk,,YO7 1HQ,Tel: 01845 525996, - ,,,No ratings yet Rate it yourself - /Services/opticians/LeaveReview/DefaultView.aspx?id=OP_5KH_8543__000002_YO71HQ,0,0,
Cooper & Barr Opticians,TP8RH,OPT,,21 Market Place,,Thirsk,,YO7 1HD,Tel: 01845 202007, - ,,,No ratings yet Rate it yourself - /Services/opticians/LeaveReview/DefaultView.aspx?id=TP8RH,0,0,
Tesco Opticians,OPT_YO241LW_4,OPT,,"Askham Bar, Tadcaster Rd",,York,,YO24 1LW,, - ,,,No ratings yet Rate it yourself - /Services/opticians/LeaveReview/DefaultView.aspx?id=OPT_YO241LW_4,0,0,
Tesco Opticians,OPT_YO241LW_6,OPT,Askham Bar,Tadcaster Rd,,York,,YO24 1LW,Tel: 0345 601 3479, - ,,,No ratings yet Rate it yourself - /Services/opticians/LeaveReview/DefaultView.aspx?id=OPT_YO241LW_6,0,0,
Scrivens Opticians,OP_5E4_10770__000001_YO422DG,OPT,4 George Street,,Pocklington,E Yorkshire,,YO42 2DG,Tel: 01759 303150, - ,,,No ratings yet Rate it yourself - /Services/opticians/LeaveReview/DefaultView.aspx?id=OP_5E4_10770__000001_YO422DG,0,0,
Specsavers,TP730,OPT,,17-21 Market Place,,Pocklington,,YO42 2AS,, - ,,,No ratings yet Rate it yourself - /Services/opticians/LeaveReview/DefaultView.aspx?id=TP730,0,0,
The Vale Opticians,OP_5KJ_12411__000002_YO519AW,OPT,22 High Street,,York,Boroughbridge,,YO51 9AW,Tel: 01423 323450, - ,,,No ratings yet Rate it yourself - /Services/opticians/LeaveReview/DefaultView.aspx?id=OP_5KJ_12411__000002_YO519AW,0,0,
Alexander Optometrists,01-122315,OPT,,145-146 High Street,,Northallerton,,DL7 8PE,Tel: 01609 760606, - ,,,No ratings yet Rate it yourself - /Services/opticians/LeaveReview/DefaultView.aspx?id=01-122315,0,0,
McBride Opticians,OP_5KH_14774__000001_DL78SE,OPT,4 South Parade,Northallerton,North Yorkshire,,,DL7 8SE,Tel: 01609 772989, - ,,,No ratings yet Rate it yourself - /Services/opticians/LeaveReview/DefaultView.aspx?id=OP_5KH_14774__000001_DL78SE,0,0,
Spectacle Warehouse,OP_5KH_11785__000001_DL78PP,OPT,108 High Street,,Northallerton,,,DL7 8PP,Tel: 01609 777225, - ,,,No ratings yet Rate it yourself - /Services/opticians/LeaveReview/DefaultView.aspx?id=OP_5KH_11785__000001_DL78PP,0,0,
Boots-Northallerton - High St,OP_5E2_14406__000002_DL78PP,OPT,84 High Street,,North Yorkshire,Northallerton,,DL7 8PP,Tel: 01609 772150, - ,,,No ratings yet Rate it yourself - /Services/opticians/LeaveReview/DefaultView.aspx?id=OP_5E2_14406__000002_DL78PP,0,0,
Boots-Northallerton - High St (in Boots UK),OP_5KH_1596__000002_DL78LW,OPT,203-204 High Street,,,Northallerton,North Yorkshire,DL7 8LW,Tel: 01609 777461, - ,,,No ratings yet Rate it yourself - /Services/opticians/LeaveReview/DefaultView.aspx?id=OP_5KH_1596__000002_DL78LW,0,0,
Peacock & Row Opticians,OP_5KJ_1160__000001_HG41AG,OPT,,2 Moss Arcade,Ripon,Ripon,,HG4 1AG,Tel: 01765 603484, - ,,,No ratings yet Rate it yourself - /Services/opticians/LeaveReview/DefaultView.aspx?id=OP_5KJ_1160__000001_HG41AG,0,0,
Scrivens,OP_5KJ_9181__000001_HG41BP,OPT,"Unit 1, 8 The Arcade",Market Place,,Ripon,Yorkshire(North Riding),HG4 1BP,Tel: 01765 602820, - ,,,No ratings yet Rate it yourself - /Services/opticians/LeaveReview/DefaultView.aspx?id=OP_5KJ_9181__000001_HG41BP,0,0,
Moorhouse Opticians Ltd,OP_5E2_2897__000001_LS249JB,OPT,13 Westgate,,Tadcaster,,,LS24 9JB,Tel: 01937 832257, - ,,,No ratings yet Rate it yourself - /Services/opticians/LeaveReview/DefaultView.aspx?id=OP_5E2_2897__000001_LS249JB,0,0,
Specsavers,OP_5KJ_2638__000001_HG41DY,OPT,,28-29 Market Place West,Ripon,North Yorkshire,,HG4 1BN,Tel: 01765 694777, - ,,,1 rating Rate it yourself - /Services/opticians/LeaveReview/DefaultView.aspx?id=OP_5KJ_2638__000001_HG41DY,,,
Cooper & Barr Opticians,OP_5KH_2940__000001_TS95AD,OPT,,35 High Street,Stokesley,Middlesbrough,,TS9 5AD,Tel: 01642 710832, - ,,,No ratings yet Rate it yourself - /Services/opticians/LeaveReview/DefaultView.aspx?id=OP_5KH_2940__000001_TS95AD,0,0,yes
Cowen & Morgan,OP_5KJ_11943__000001_HG42BQ,OPT,22 Westgate,,Ripon,,,HG4 2BQ,Tel: 01765 600561, - ,,,No ratings yet Rate it yourself - /Services/opticians/LeaveReview/DefaultView.aspx?id=OP_5KJ_11943__000001_HG42BQ,0,0,
Onlookers Ltd,OP_5NW_ONLOOKERS__000002_YO259DJ,OPT,,83 Kelleythorpe Industrial Estate,,Driffield,Yorkshire(East Riding),YO25 9DJ,Tel: 01377 200040, - ,,,No ratings yet Rate it yourself - /Services/opticians/LeaveReview/DefaultView.aspx?id=OP_5NW_ONLOOKERS__000002_YO259DJ,0,0,
KINGSTON WHITE OPTICIANS,OP-12353-5NV__000001_HG50ER,OPT,2 Park  Place,,Knaresborough,,,HG5 0ER,, - ,,,No ratings yet Rate it yourself - /Services/opticians/LeaveReview/DefaultView.aspx?id=OP-12353-5NV__000001_HG50ER,0,0,
Darryl Taylor Opticians,OP_5KJ_9963__000001_HG50EA,OPT,84 High Street,,Knaresborough,,,HG5 0EA,Tel: 01423 862142, - ,,,No ratings yet Rate it yourself - /Services/opticians/LeaveReview/DefaultView.aspx?id=OP_5KJ_9963__000001_HG50EA,0,0,
Samantha Parker Optometrist,OP_5KJ_12955__000002_HG50ET,OPT,13 Market Place,,Knaresborough,,,HG5 8AL,Tel: 01423 866475, - ,,,No ratings yet Rate it yourself - /Services/opticians/LeaveReview/DefaultView.aspx?id=OP_5KJ_12955__000002_HG50ET,0,0,
David Horn & A E Pierce,OP_5KK_3952__000001_YO111JR,OPT,Bradshaw House,21 Alma Square,Scarborough,,,YO11 1JR,Tel: 01723 364045, - ,,,No ratings yet Rate it yourself - /Services/opticians/LeaveReview/DefaultView.aspx?id=OP_5KK_3952__000001_YO111JR,0,0,
Specsavers Opticians,OP_5E4_14669__000001_YO256AP,OPT,7 Market Place,,Driffield,E Yorkshire,,YO25 6AP,Tel: 01377 249710, - ,,,No ratings yet Rate it yourself - /Services/opticians/LeaveReview/DefaultView.aspx?id=OP_5E4_14669__000001_YO256AP,0,0,
Specsavers Opticians,OP_5J6_4803__000002_LS226FL,OPT,The Horsefair Centre,,,Wetherby,,LS22 6FL,Tel: 01937 545 370, - ,,,No ratings yet Rate it yourself - /Services/opticians/LeaveReview/DefaultView.aspx?id=OP_5J6_4803__000002_LS226FL,0,0,
Cameron Beaumont Opticians,CO-5155,OPT,,2-4 North Street,,Wetherby,Yorkshire,LS22 6NN,Tel: 01937 585742, - ,,,No ratings yet Rate it yourself - /Services/opticians/LeaveReview/DefaultView.aspx?id=CO-5155,0,0,
Boots-Scarborough - Westborough,OP_5KK_869__000002_YO111LN,OPT,100 - 101 Westborough,,,Scarborough,North Yorkshire,YO11 1LN,Tel: 01723 500661, - ,,,4 ratings Rate it yourself - /Services/opticians/LeaveReview/DefaultView.aspx?id=OP_5KK_869__000002_YO111LN,,,
Pagan & McQuade,OP_5KK_3608__000001_YO111LD,OPT,108 Westborough,,,Scarborough,North Yorkshire,YO11 1LD,Tel: 01723 371250, - ,,,2 ratings Rate it yourself - /Services/opticians/LeaveReview/DefaultView.aspx?id=OP_5KK_3608__000001_YO111LD,,,no
 Scarborough Visionplus Ltd,OP_5KK_5660__000002_YO111LD,OPT,94 Westborough,94 Westborough,Scarborough, Scarborough,,YO11 1LD,Tel: 01723 501990, - ,,,No ratings yet Rate it yourself - /Services/opticians/LeaveReview/DefaultView.aspx?id=OP_5KK_5660__000002_YO111LD,0,0,
Appleson Optometrists,OP_5HJ_14027__000001_LS226LN,OPT,Appleson Optometrists / Wetherby Eye Clinic,43 Market Place,Wetherby,Leeds,,LS22 6LN,Tel: 01937 583278, - ,,,171 ratings Rate it yourself - /Services/opticians/LeaveReview/DefaultView.aspx?id=OP_5HJ_14027__000001_LS226LN,,,
Mackenzie Shaw Ltd,OP_5HJ_4077__000001_LS224LL,OPT,14 Westgate,,Wetherby,,,LS22 6LL,Tel: 01937 583185, - ,,,1 rating Rate it yourself - /Services/opticians/LeaveReview/DefaultView.aspx?id=OP_5HJ_4077__000001_LS224LL,,,
Scrivens Opticians,OP_5E4_6784__000001_YO256QF,OPT,71 Middle Street South,,,Driffield,Yorkshire(East Riding),YO25 6QF,Tel: 01377 253145, - ,,,No ratings yet Rate it yourself - /Services/opticians/LeaveReview/DefaultView.aspx?id=OP_5E4_6784__000001_YO256QF,0,0,
Glens Optical Ltd,OP_5E4_2457__000002_YO256PS,OPT,23/3 Middle Street South,,Driffield,Driffield,,YO25 6PS,Tel: 01377 257252, - ,,,No ratings yet Rate it yourself - /Services/opticians/LeaveReview/DefaultView.aspx?id=OP_5E4_2457__000002_YO256PS,0,0,
Vision Express (UK) Ltd,OP_5HJ_6604__000001_LS224NE,OPT,,25A Market Place,,Wetherby,West Yorkshire,LS22 6LQ,Tel: 01937 581142, - ,,,No ratings yet Rate it yourself - /Services/opticians/LeaveReview/DefaultView.aspx?id=OP_5HJ_6604__000001_LS224NE,0,0,
Boots-Wetherby,LDS194__000004_LS226LQ,OPT,25B Market Place,,,Wetherby,West Yorkshire,LS22 6LQ,Tel: 01937 588635, - ,,,1 rating Rate it yourself - /Services/opticians/LeaveReview/DefaultView.aspx?id=LDS194__000004_LS226LQ,,,
Andrew Morgan Optometrist,OP_5HJ_14030__000002_LS236BW,OPT,170 High Street,Boston Spa,Leeds,,,LS23 6BW,Tel: 01937 849933, - ,,,2 ratings Rate it yourself - /Services/opticians/LeaveReview/DefaultView.aspx?id=OP_5HJ_14030__000002_LS236BW,,,
Vision Express (UK) Ltd,OP_5KK_10368__000001_YO111LP,OPT,1 Bar House,Westborough,Scarborough,,,YO11 1LP,Tel: 01723 507667, - ,,,No ratings yet Rate it yourself - /Services/opticians/LeaveReview/DefaultView.aspx?id=OP_5KK_10368__000001_YO111LP,0,0,
R M Higson Optometrist ,OP_5E4_1270__000001_YO256QE,OPT,100 Middle Street South,,Driffield,,,YO25 6QE,Tel: 01377 253039, - ,,,1 rating Rate it yourself - /Services/opticians/LeaveReview/DefaultView.aspx?id=OP_5E4_1270__000001_YO256QE,,,
Brown & Humhreys Opticians,OP_5KK_5719__000001_YO112EF,OPT,42 Huntriss Row,,,Scarborough,,YO11 2EF,Tel: 01723 361957, - ,,,No ratings yet Rate it yourself - /Services/opticians/LeaveReview/DefaultView.aspx?id=OP_5KK_5719__000001_YO112EF,0,0,
Edwards Opticians,OP_5E4_9059__000001_YO43AF,OPT,17-19 Southgate,,Market Weighton,E Yorkshire,,YO43 3AF,Tel: 01430 873288, - ,,,No ratings yet Rate it yourself - /Services/opticians/LeaveReview/DefaultView.aspx?id=OP_5E4_9059__000001_YO43AF,0,0,
Local Eyes,,OPT,,4 Newborough,,Scarborough,,YO11 1NA,Tel: 01723 364045, - ,,,N/A - Data not available,,,
Christopher Nixon Optometrists,OP_5KJ_4191__000001_HG27LQ,OPT,Kinnersley House,35 High Street,"Starbeck, Harrogate",,,HG2 7LQ,Tel: 01423 885764, - ,,,No ratings yet Rate it yourself - /Services/opticians/LeaveReview/DefaultView.aspx?id=OP_5KJ_4191__000001_HG27LQ,0,0,
John Tomlinson Mobile Optician,OP_5E4_14668__000003_YO259QZ,OPT,Mobile Unit,Station Yard (Friday (Pm),Hutton Cranswick,,,YO25 9QZ,Tel: 07976 567487, - ,,,No ratings yet Rate it yourself - /Services/opticians/LeaveReview/DefaultView.aspx?id=OP_5E4_14668__000003_YO259QZ,0,0,
Eyecatchers,OP_5KJ_5664__000001_HG14LF,OPT,87a Skipton Road,,Harrogate,,,HG1 4LF,Tel: 01423 568083, - ,,,3 ratings Rate it yourself - /Services/opticians/LeaveReview/DefaultView.aspx?id=OP_5KJ_5664__000001_HG14LF,,,yes
Rayner Opticians,OP_5KK_10738__000001_YO211DY,OPT,,3-4 Wellington Road,,Whitby,North Yorkshire,YO21 1DY,Tel: 01947 603358, - ,,,No ratings yet Rate it yourself - /Services/opticians/LeaveReview/DefaultView.aspx?id=OP_5KK_10738__000001_YO211DY,0,0,
Asda Opticians,OPT_HG1 5DE,OPT,,BOWER ROAD,,HARROGATE,,HG1 5DE,Tel: 01423 704 512, - ,,,1 rating Rate it yourself - /Services/opticians/LeaveReview/DefaultView.aspx?id=OPT_HG1 5DE,,,
Specsavers Opticians Harrogate,TP6N1,OPT,18 Beulah Street,18 BEULAH STREET,Harrogate,Harrogate,,HG1 1QH,Tel: 01423 564515, - ,,,4 ratings Rate it yourself - /Services/opticians/LeaveReview/DefaultView.aspx?id=TP6N1,,,
M&S Opticians,,OPT,M&S,18-20 Cambridge Street,,Harrogate,,HG1 1RX,Tel: 01423 802696, - ,,,N/A - Data not available,,,
Boots-Harrogate - Cambridge St (in Boots UK),HG1 1RX_19172,OPT,,26 - 28 Cambridge Street,,Harrogate,,HG1 1RX,Tel: 01423 530 335, - ,,,1 rating Rate it yourself - /Services/opticians/LeaveReview/DefaultView.aspx?id=HG1 1RX_19172,,,
Catherine Veen Opticians,OP_5KJ_8782__000001_HG11EB,OPT,6 Victoria Avenue,,,Harrogate,,HG1 1ED,Tel: 01423 520888, - ,,,1 rating Rate it yourself - /Services/opticians/LeaveReview/DefaultView.aspx?id=OP_5KJ_8782__000001_HG11EB,,,
Vision Express (UK) Ltd,OP_5KJ_10948__000002_HG11RH,OPT,5-5a Prospect Crescent,,Harrogate,,,HG1 1RH,Tel: 01423 523477, - ,,,No ratings yet Rate it yourself - /Services/opticians/LeaveReview/DefaultView.aspx?id=OP_5KJ_10948__000002_HG11RH,0,0,
M Procter,OP_5KJ_12429__000001_HG12QU,OPT,3 Parliament Street,,Harrogate,Harrogate,,HG1 2QU,Tel: 01423 531700, - ,,,No ratings yet Rate it yourself - /Services/opticians/LeaveReview/DefaultView.aspx?id=OP_5KJ_12429__000001_HG12QU,0,0,
Page & Smith Opticians,OP_5KJ_3115__000001_HG12TG,OPT,,4 Royal Parade,Harrogate,Harrogate,Yorkshire(North Riding),HG1 2SZ,Tel: 01423 562 616, - ,,,No ratings yet Rate it yourself - /Services/opticians/LeaveReview/DefaultView.aspx?id=OP_5KJ_3115__000001_HG12TG,0,0,
Specsavers ,OP_5KM__000004_TS80TJ,OPT,Unit 9 Parkway Shopping Centre,Coulby Newham,Middlesbrough,,,TS8 0TJ,Tel: 01642 579 010, - ,,,No ratings yet Rate it yourself - /Services/opticians/LeaveReview/DefaultView.aspx?id=OP_5KM__000004_TS80TJ,0,0,
John Tomlinson Mobile Optician,OP_5E3_13033__000001_YO433SN,OPT,Mobile Unit,Newbald Village Hall Car Park,Westgate (Thur 4.45pm-7pm Alt),,,YO43 4SE,Tel: 07976 567487, - ,,,No ratings yet Rate it yourself - /Services/opticians/LeaveReview/DefaultView.aspx?id=OP_5E3_13033__000001_YO433SN,0,0,
Hepworth Opticians,TS17 0WA,OPT,,Myton Park,26 Myton Road,Ingleby Barwick,Yorkshire(North Riding),TS17 0WA,Tel: 01642 767734, - ,,,5 ratings Rate it yourself - /Services/opticians/LeaveReview/DefaultView.aspx?id=TS17 0WA,,,
McCormick & Gorman Opticians,OP_5E1_4148__000002_TS170RR,OPT,17 Greenside,Lowfields,Ingleby Barwick,,,TS17 0RR,Tel: 01642 764441, - ,,,No ratings yet Rate it yourself - /Services/opticians/LeaveReview/DefaultView.aspx?id=OP_5E1_4148__000002_TS170RR,0,0,
Wade Optometry Ltd,OP_5E1_8665__000001_TS159BW,OPT,35 High Street,.,Yarm,.,,TS15 9BW,Tel: 01642 790990, - ,,,No ratings yet Rate it yourself - /Services/opticians/LeaveReview/DefaultView.aspx?id=OP_5E1_8665__000001_TS159BW,0,0,
Vision Express,TS15 9AH,OPT,,64 High Street,,Yarm,,TS15 9AH,, - ,,,No ratings yet Rate it yourself - /Services/opticians/LeaveReview/DefaultView.aspx?id=TS15 9AH,0,0,
Henderson Opticians,OP_5E1_9456__000001_TS159AY,OPT,Winpenny House,135 High Street,Yarm,,,TS15 9AY,Tel: 01642 783340, - ,,,No ratings yet Rate it yourself - /Services/opticians/LeaveReview/DefaultView.aspx?id=OP_5E1_9456__000001_TS159AY,0,0,
Andrew and Rogers,OP_5E3_13038__000001_HU178AJ,OPT,15 North Bar Within,,Beverley,E Yorkshire,,HU17 8AP,Tel: 01482 860362, - ,,,1 rating Rate it yourself - /Services/opticians/LeaveReview/DefaultView.aspx?id=OP_5E3_13038__000001_HU178AJ,,,
Edwards Opticians,OP_5E3_487__000002_HU178BB,OPT,8 Saturday Market,,Beverley,,,HU17 8BB,Tel: 01482 868428, - ,,,1 rating Rate it yourself - /Services/opticians/LeaveReview/DefaultView.aspx?id=OP_5E3_487__000002_HU178BB,,,
Eyesite,OPT_5E3_HARRODS__000003_HU178BB,OPT,13a Saturday Market Place,Beverley,,East Yorkshire,,HU17 8BB,Tel: 01482 868039, - ,,,1 rating Rate it yourself - /Services/opticians/LeaveReview/DefaultView.aspx?id=OPT_5E3_HARRODS__000003_HU178BB,,,
Beverley Vision Express,5NW VE__000003_HU179AJ,OPT,,12 Toll Gavel,,Beverley,Yorkshire(East Riding),HU17 9AJ,Tel: 01482 863547, - ,,,1 rating Rate it yourself - /Services/opticians/LeaveReview/DefaultView.aspx?id=5NW VE__000003_HU179AJ,,,
Boots-Beverley,OP_5E3_11631__000001_HU179AJ,OPT,43-45 Toll Gavel,,,Beverley,Yorkshire,HU17 9AA,Tel: 01482 872333, - ,,,No ratings yet Rate it yourself - /Services/opticians/LeaveReview/DefaultView.aspx?id=OP_5E3_11631__000001_HU179AJ,0,0,
Specsavers Opticians,OP_5E3_7142__000001_HU179BN,OPT,52 Toll Gavel,,Beverley,,,HU17 9BN,Tel: 01482 679933, - ,,,No ratings yet Rate it yourself - /Services/opticians/LeaveReview/DefaultView.aspx?id=OP_5E3_7142__000001_HU179BN,0,0,
Tesco Opticians,OP_LS146LU_34680,OPT,,York Road,Seacroft,Leeds,West Yorkshire,LS14 6LU,Tel: 00000000000, - ,,,No ratings yet Rate it yourself - /Services/opticians/LeaveReview/DefaultView.aspx?id=OP_LS146LU_34680,0,0,
Brosgill Opticians,OP_5HL_12901__000001_LS16BE,OPT,,55 Street Lane,Roundhay,Leeds,West Yorkshire,LS8 1AP,Tel: 0113 266 3818, - ,,,No ratings yet Rate it yourself - /Services/opticians/LeaveReview/DefaultView.aspx?id=OP_5HL_12901__000001_LS16BE,0,0,yes
Harrison Eye Care,OPT_LS178AE_1,OPT,,141 Shadwell Lane,,Leeds,,LS17 8AE,, - ,,,1 rating Rate it yourself - /Services/opticians/LeaveReview/DefaultView.aspx?id=OPT_LS178AE_1,,,
Mr M Young,OP_5HK_14021__000003_LS158BA,OPT,23 Austhorpe Road,Crossgates,Leeds,,,LS15 8BA,Tel: 0113 260 0972, - ,,,No ratings yet Rate it yourself - /Services/opticians/LeaveReview/DefaultView.aspx?id=OP_5HK_14021__000003_LS158BA,0,0,
S McNicholas Opticians,OP_5HK_9873__000001_LS158EU,OPT,20 Crossgates Centre,Crossgates,,Leeds,,LS15 8ET,Tel: 0113 2643958, - ,,,No ratings yet Rate it yourself - /Services/opticians/LeaveReview/DefaultView.aspx?id=OP_5HK_9873__000001_LS158EU,0,0,
Specsavers,OP_5HK_7008__000002_LS158ET,OPT,10 Crossgates Centre,Crossgates,Leeds,LEEDS,,LS15 8ET,Tel: 0113 232 8088, - ,,,No ratings yet Rate it yourself - /Services/opticians/LeaveReview/DefaultView.aspx?id=OP_5HK_7008__000002_LS158ET,0,0,
James Daly Opticians,OP_5HJ_14024__000002_LS176PY,OPT,398 Harrogate Road,Moortown,Leeds,Leeds,,LS17 6PY,Tel: 0113 288 8820, - ,,,2 ratings Rate it yourself - /Services/opticians/LeaveReview/DefaultView.aspx?id=OP_5HJ_14024__000002_LS176PY,,,
Simon Falk Eyecare,OP_5HJ_9803__000001_LS82HU,OPT,456 Roundhay Road,Oakwood,,Leeds,West Yorkshire,LS8 2HU,Tel: 0330 9002020, - ,,,2 ratings Rate it yourself - /Services/opticians/LeaveReview/DefaultView.aspx?id=OP_5HJ_9803__000001_LS82HU,,,
Asda Stores Ltd,OP_5HK_14161__000001_LS146UT,OPT,Killingbeck Drive,York Road,,Killingbeck,,LS14 6UT,Tel: 0113 201 9582, - ,,,No ratings yet Rate it yourself - /Services/opticians/LeaveReview/DefaultView.aspx?id=OP_5HK_14161__000001_LS146UT,0,0,