Organisation Name,NACS Code,Organisation Type,Address1,Address2,Address3,Address4,Address5,PostCode,Telephone Number,Opening time,Value  (Opening time),Banding Classification  (Opening time),NHS.UK users rating,Value  (NHS.UK users rating),Banding Classification  (NHS.UK users rating),Car parking (Is there car parking at this organisation?)
Browetts Opticians,OP_5MQ_1346__000001_CV344HS,OPT,Browett Opticians,3 Market Street,,Warwick,,CV34 4DH,Tel: 01926 493157, - ,,,2 ratings Rate it yourself - /Services/opticians/LeaveReview/DefaultView.aspx?id=OP_5MQ_1346__000001_CV344HS,,,
Vision Express,OP_5MQ_7813__000001_CV344SD,OPT,,72 Market Place,,Warwick,Warwickshire,CV34 4SD,Tel: 01926 419100, - ,,,No ratings yet Rate it yourself - /Services/opticians/LeaveReview/DefaultView.aspx?id=OP_5MQ_7813__000001_CV344SD,0,0,
McConnell Optometrist,OP_5MQ_2263__000001_CV344AB,OPT,,6 Swan Street,,Warwick,Warwickshire,CV34 4BJ,Tel: 01926 492487, - ,,,No ratings yet Rate it yourself - /Services/opticians/LeaveReview/DefaultView.aspx?id=OP_5MQ_2263__000001_CV344AB,0,0,
B S Breakwell Optometrists,OP_5MQ_7876__000001_CV344EW,OPT,16 Jury Street,,Warwick,,,CV34 4EW,Tel: 01926 491426, - ,,,No ratings yet Rate it yourself - /Services/opticians/LeaveReview/DefaultView.aspx?id=OP_5MQ_7876__000001_CV344EW,0,0,
Walford & Round,OP_5MQ_9501__000001_CV376EF,OPT,25 Sheep Street,,Stratford-upon-Avon,,,CV37 6EF,Tel: 01789 205941, - ,,,No ratings yet Rate it yourself - /Services/opticians/LeaveReview/DefaultView.aspx?id=OP_5MQ_9501__000001_CV376EF,0,0,
Vision Express,OP - 5PM__000002_CV376JE,OPT,2 Wood Street,,Stratford-upon-Avon,Warwickshire,,CV37 6JE,Tel: 01789 290007, - ,,,1 rating Rate it yourself - /Services/opticians/LeaveReview/DefaultView.aspx?id=OP - 5PM__000002_CV376JE,,,
Specsavers Opticians,OP_5MQ_1955__000001_CV376JE,OPT,8 Wood Street,,Stratford-upon-Avon,,,CV37 6JE,Tel: 01789 262606, - ,,,1 rating Rate it yourself - /Services/opticians/LeaveReview/DefaultView.aspx?id=OP_5MQ_1955__000001_CV376JE,,,
Boots-Stratford Upon-Avon,OP_5MQ_2401__000002_CV376JG,OPT,36 Wood Street,,,Stratford Upon Avon,Warwickshire,CV37 6JG,Tel: 01789 292161, - ,,,No ratings yet Rate it yourself - /Services/opticians/LeaveReview/DefaultView.aspx?id=OP_5MQ_2401__000002_CV376JG,0,0,
Asda Vision Centre,OP_5MQ_14440__000001_CV311YD,OPT,Chesterton Drive,Leamington Spa,Warwickshire,,,CV31 1YD,Tel: 01926 459112, - ,,,No ratings yet Rate it yourself - /Services/opticians/LeaveReview/DefaultView.aspx?id=OP_5MQ_14440__000001_CV311YD,0,0,
Greys Opticians,OP_5MQ_6922__000002_CV376LF,OPT,,11 Chapel Street,,Stratford-upon-Avon,Warwickshire,CV37 6EP,Tel: 01789 266941, - ,,,No ratings yet Rate it yourself - /Services/opticians/LeaveReview/DefaultView.aspx?id=OP_5MQ_6922__000002_CV376LF,0,0,
Zeiss Opticians,OP_5MQ_4968__000001_CV376EP,OPT,5a Chapel Street,,Stratford-upon-Avon,,,CV37 6EP,Tel: 01789 269555, - ,,,No ratings yet Rate it yourself - /Services/opticians/LeaveReview/DefaultView.aspx?id=OP_5MQ_4968__000001_CV376EP,0,0,
CGOptical,OP_5MQ_11227__000001_CV376LN,OPT,57 Ely Street,,Stratford-upon-Avon,Stratford-upon-Avon,,CV37 6LN,Tel: 01789 268828, - ,,,No ratings yet Rate it yourself - /Services/opticians/LeaveReview/DefaultView.aspx?id=OP_5MQ_11227__000001_CV376LN,0,0,
My Specs Direct T/A Gohil and Grey Opticians,CO-4010,OPT,,53 Parade,,leamington Spa,,CV32 4BA,, - ,,,No ratings yet Rate it yourself - /Services/opticians/LeaveReview/DefaultView.aspx?id=CO-4010,0,0,
Charnley's Opticians,OP_5MQ_832__000002_CV324BA,OPT,,71 Parade,,Leamington Spa,Warwickshire,CV32 4BA,Tel: 01926 424820, - ,,,No ratings yet Rate it yourself - /Services/opticians/LeaveReview/DefaultView.aspx?id=OP_5MQ_832__000002_CV324BA,0,0,
Specsavers Opticians,OP_5MQ_2679__000003_CV324BA,OPT,69 The Parade,Leamington Spa,Warwickshire,,,CV32 4BA,Tel: 01926 427822, - ,,,1 rating Rate it yourself - /Services/opticians/LeaveReview/DefaultView.aspx?id=OP_5MQ_2679__000003_CV324BA,,,
Vision Express ,OP_5MQ_1910__000001_CV324XU,OPT,Royal Priors Shopping Centre,,Leamington Spa,,,CV32 4XU,Tel: 01926 831989, - ,,,1 rating Rate it yourself - /Services/opticians/LeaveReview/DefaultView.aspx?id=OP_5MQ_1910__000001_CV324XU,,,
Boots-Leamington Spa - The Parade (in Boots UK),OP_5MQ_1847__000001_CV324BL,OPT,31 The Parade,,,Leamington Spa,Warwickshire,CV32 4BL,Tel: 01926 332404, - ,,,2 ratings Rate it yourself - /Services/opticians/LeaveReview/DefaultView.aspx?id=OP_5MQ_1847__000001_CV324BL,,,
Kineton Optometrists,OP_5MQ_8887__000001_CV350JZ,OPT,The Bank House,Banbury Street,Kineton,Warwick,Warwickshire,CV35 0JS,Tel: 01926 641093, - ,,,No ratings yet Rate it yourself - /Services/opticians/LeaveReview/DefaultView.aspx?id=OP_5MQ_8887__000001_CV350JZ,0,0,
Keith Murphy Opticians Ltd,OP_5MQ_14437__000001_CV81HN,OPT,69 Warwick Road,Kenilworth,Warwickshire,,,CV8 1HN,Tel: 01926 853366, - ,,,7 ratings Rate it yourself - /Services/opticians/LeaveReview/DefaultView.aspx?id=OP_5MQ_14437__000001_CV81HN,,,
Vision Express,OP_5MQ_7051__000001_CV81HE,OPT,,28 Warwick Rd,,Kenilworth,Warwickshire,CV8 1HE,Tel: 01926 853331, - ,,,No ratings yet Rate it yourself - /Services/opticians/LeaveReview/DefaultView.aspx?id=OP_5MQ_7051__000001_CV81HE,0,0,
Boots-Kenilworth,5PM-CV8 1JB__000002_CV81JB,OPT,20 Talisman Square,,,Kenilworth,Warwickshire,CV8 1JB,Tel: 01926 856025, - ,,,No ratings yet Rate it yourself - /Services/opticians/LeaveReview/DefaultView.aspx?id=5PM-CV8 1JB__000002_CV81JB,0,0,
Specsavers Opticians,5PM-CV8 1EF__000003_CV81EF,OPT,17 The Square,,Kenilworth,Warwickshire,,CV8 1EF,Tel: 01926 865030, - ,,,2 ratings Rate it yourself - /Services/opticians/LeaveReview/DefaultView.aspx?id=5PM-CV8 1EF__000003_CV81EF,,,
A Tissington,OP_5MQ_8857__000001_B955AU,OPT,133 High Street,Henley-In-Arden,Solihull,Warwickshire,,B95 5AU,Tel: 01564 792334, - ,,,No ratings yet Rate it yourself - /Services/opticians/LeaveReview/DefaultView.aspx?id=OP_5MQ_8857__000001_B955AU,0,0,
ZMP:  Charles Barlow (domiciliary),OL/01-10826/5EY__000003_B946JG,OPT,171 Station Lane,Lapworth,Solihull,West Midlands,,B94 6JG,Tel: 0800 652 5505, - ,,,No ratings yet Rate it yourself - /Services/opticians/LeaveReview/DefaultView.aspx?id=OL/01-10826/5EY__000003_B946JG,0,0,
Janet Porter Opticians,OP_5MQ_3828__000001_CV470EP,OPT,,52 Coventry Street,,Southam,Warwickshire,CV47 0EP,Tel: 01926 813113, - ,,,No ratings yet Rate it yourself - /Services/opticians/LeaveReview/DefaultView.aspx?id=OP_5MQ_3828__000001_CV470EP,0,0,
My Optician,OP_5MD_8278__000002_CV47EH,OPT,8 Cannon Park Centre,Lynchgate Road,,Coventry,,CV4 7EH,Tel: 024 7641 6667, - ,,,5 ratings Rate it yourself - /Services/opticians/LeaveReview/DefaultView.aspx?id=OP_5MD_8278__000002_CV47EH,,,
Eye Tech Optometrists,CV36BP1901,OPT,Eyetech Optometrists,42 Kenpas Highway,,Coventry,,CV3 6BP,Tel: 02476 233 993, - ,,,No ratings yet Rate it yourself - /Services/opticians/LeaveReview/DefaultView.aspx?id=CV36BP1901,0,0,
Michael Beaver Optician,OP_5MQ_11665__000001_B495AD,OPT,20 High Street,Alcester,Warwickshire,Alcester,,B49 5AD,Tel: 01789 763183, - ,,,No ratings yet Rate it yourself - /Services/opticians/LeaveReview/DefaultView.aspx?id=OP_5MQ_11665__000001_B495AD,0,0,
Alcester Opticians,OP_5MQ_14436__000002_B495AF,OPT,65 High Street,Alcester,Warwickshire,,,B49 5AA,Tel: 01789 762692, - ,,,No ratings yet Rate it yourself - /Services/opticians/LeaveReview/DefaultView.aspx?id=OP_5MQ_14436__000002_B495AF,0,0,
Specsavers - Alcester,TP9D3,OPT,,36 High Street,,Alcester,Warwickshire,B49 5AA,Tel: 01789764705, - ,,,No ratings yet Rate it yourself - /Services/opticians/LeaveReview/DefaultView.aspx?id=TP9D3,0,0,
Maginnis Opticians (Optometrists) Ltd,OP_5D1_4086__000001_CV77ER,OPT,384 Kenilworth Road,Balsall Common,Coventry,,,CV7 7ER,Tel: 01676 532180, - ,,,1 rating Rate it yourself - /Services/opticians/LeaveReview/DefaultView.aspx?id=OP_5D1_4086__000001_CV77ER,,,
Greys Opticians,OP_5MQ_2403__000002_CV364AF,OPT,29 High Street,,,Shipston-on-Stour,Warwickshire,CV36 4AJ,Tel: 01608 662873, - ,,,No ratings yet Rate it yourself - /Services/opticians/LeaveReview/DefaultView.aspx?id=OP_5MQ_2403__000002_CV364AF,0,0,
Walford and Round,OP_5MQ_14439__000001_CV364AE,OPT,42 Sheep Street,Shipston On Stour,Warwickshire,,,CV36 4AE,Tel: 01608 661649, - ,,,No ratings yet Rate it yourself - /Services/opticians/LeaveReview/DefaultView.aspx?id=OP_5MQ_14439__000001_CV364AE,0,0,
Alan Tyler Opticians,5QW047,OPT,,11 Arden Buildings,Station Road,Solihull,,B93 8HH,Tel: 01564 772217, - ,,,No ratings yet Rate it yourself - /Services/opticians/LeaveReview/DefaultView.aspx?id=5QW047,0,0,
Healthcall Optical Services,5EJ_01582__000003_LU48EF,OPT,"Unit 3, Bow Court",Fletchworth Gate,Canley,Coventry,,CV5 6SP,Tel: 0800 198 1132, - ,,,No ratings yet Rate it yourself - /Services/opticians/LeaveReview/DefaultView.aspx?id=5EJ_01582__000003_LU48EF,0,0,
Costco Wholesale UK Ltd,CO-1833-5,OPT,,51 Torrington Avenue,,Coventry,,CV4 9AQ,Tel: 02476 854 675, - ,,,No ratings yet Rate it yourself - /Services/opticians/LeaveReview/DefaultView.aspx?id=CO-1833-5,0,0,
Katie Hattersley Opticians,CV5 6EJ__000002_CV56EJ,OPT,56 Earlsdon Street,,,Coventry,,CV5 6EJ,Tel: 024 76675885, - ,,,No ratings yet Rate it yourself - /Services/opticians/LeaveReview/DefaultView.aspx?id=CV5 6EJ__000002_CV56EJ,0,0,
Clarke Opticians Ltd,OP_5MD_3230__000001_CV35HW,OPT,8 Quinton Parade,,,Coventry,,CV3 5HW,Tel: 024 7650 6300, - ,,,No ratings yet Rate it yourself - /Services/opticians/LeaveReview/DefaultView.aspx?id=OP_5MD_3230__000001_CV35HW,0,0,
Michael P Harris (Opticians) Ltd,OP_5MD_3452__000002_CV56EP,OPT,25 Earlsdon Street,,,Coventry,,CV5 6EP,Tel: 024 7671 1620, - ,,,No ratings yet Rate it yourself - /Services/opticians/LeaveReview/DefaultView.aspx?id=OP_5MD_3452__000002_CV56EP,0,0,
Specsavers Opticians,000CV35HD,OPT,,129 Daventry Road,,"Cheylesmore, Coventry",West Midlands,CV3 5HD,Tel: 02476 507950, - ,,,No ratings yet Rate it yourself - /Services/opticians/LeaveReview/DefaultView.aspx?id=000CV35HD,0,0,
Susan Bowers Opticians,OP_5MD_12273__000002_CV49DU,OPT,349 Tile Hill Lane,Tile Hill,Coventry,Coventry,West Midlands,CV4 9DU,Tel: 02476466661, - ,,,No ratings yet Rate it yourself - /Services/opticians/LeaveReview/DefaultView.aspx?id=OP_5MD_12273__000002_CV49DU,0,0,
Boots-Coventry - Daventry Rd,OP_5MD_7170__000001_CV35HF,OPT,179 Daventry Road,Cheylesmore,Coventry,West Midlands,,CV3 5HF,Tel: 02476 502825, - ,,,2 ratings Rate it yourself - /Services/opticians/LeaveReview/DefaultView.aspx?id=OP_5MD_7170__000001_CV35HF,,,
Greys Opticians,OP_5D1_4664__000001_B93ONA,OPT,1642 High Street,Knowle,,Solihull,West Midlands,B93 0NA,Tel: 01564 773466, - ,,,No ratings yet Rate it yourself - /Services/opticians/LeaveReview/DefaultView.aspx?id=OP_5D1_4664__000001_B93ONA,0,0,
Eyesite Eyecare Centres,OP_5MD_9954__000001_CV49PQ,OPT,44 Jardine Crescent,,,Coventry,,CV4 9PQ,Tel: 024 7647 3739, - ,,,No ratings yet Rate it yourself - /Services/opticians/LeaveReview/DefaultView.aspx?id=OP_5MD_9954__000001_CV49PQ,0,0,
Bannister Opticians Ltd,OP_5D1_8378__000001_B930LE,OPT,,17 St. Johns Way,Knowle,Solihull,,B93 0LE,Tel: 01564 778206, - ,,,3 ratings Rate it yourself - /Services/opticians/LeaveReview/DefaultView.aspx?id=OP_5D1_8378__000001_B930LE,,,
Boots-Coventry - Central Six Retail Park,OP_5MD_6233__000002_CV36TA,OPT,Unit 7,Central Six Retail Park,,Coventry,West Midlands,CV3 6TA,Tel: 0247 6226051, - ,,,No ratings yet Rate it yourself - /Services/opticians/LeaveReview/DefaultView.aspx?id=OP_5MD_6233__000002_CV36TA,0,0,
Lees & Thomas Optometrist,OP_5MQ_9995__000001_B807NJ,OPT,57 Alcester Road,,Studley,,,B80 7NJ,Tel: 01527 853932, - ,,,No ratings yet Rate it yourself - /Services/opticians/LeaveReview/DefaultView.aspx?id=OP_5MQ_9995__000001_B807NJ,0,0,
ZMP:  Healthcall Optical Services,OL/CO-2008/5EY__000001_CV13EZ,OPT,25 Warwick Road,,Coventry,,,CV1 3EZ,Tel: 0845 601 7241, - ,,,No ratings yet Rate it yourself - /Services/opticians/LeaveReview/DefaultView.aspx?id=OL/CO-2008/5EY__000001_CV13EZ,0,0,
C R Williams Opticians,OP_5MD_982__000001_CV59JE,OPT,1 Whitaker Road,,,Coventry,,CV5 9JE,Tel: 024 7667 7511, - ,,,No ratings yet Rate it yourself - /Services/opticians/LeaveReview/DefaultView.aspx?id=OP_5MD_982__000001_CV59JE,0,0,
Opticial Express,OP_12345_CV1 2JZ,OPT,4th Floor Sun Alliance House,Little Park Street,,Coventry,West Midlands,CV1 2JZ,Tel: 0800 023 2020, - ,,,No ratings yet Rate it yourself - /Services/opticians/LeaveReview/DefaultView.aspx?id=OP_12345_CV1 2JZ,0,0,
Specsavers Opticians,OP_5MD_12567__000001_CV11DX,OPT,56-58 Lower Precinct,,Coventry,West Midlands,,CV1 1DS,Tel: 024 7663 3378, - ,,,No ratings yet Rate it yourself - /Services/opticians/LeaveReview/DefaultView.aspx?id=OP_5MD_12567__000001_CV11DX,0,0,
Boots-Coventry - Lower Precinct,CV1 1DS_01918,OPT,,49 Lower Precinct,,Coventry,West Midlands,CV1 1DS,Tel: 02476226561, - ,,,1 rating Rate it yourself - /Services/opticians/LeaveReview/DefaultView.aspx?id=CV1 1DS_01918,,,
Vision Express (UK) Ltd,OP_5MD_11409__000001_CV11QS,OPT,11 West Orchard Shopping Centre,,Coventry,,,CV1 1QS,Tel: 024 7623 1123, - ,,,No ratings yet Rate it yourself - /Services/opticians/LeaveReview/DefaultView.aspx?id=OP_5MD_11409__000001_CV11QS,0,0,
Boots Opticians Ltd,OP_5MD_6983__000002_CV11HF,OPT,49 Lower Precinct,,Coventry,,,CV1 1HF,Tel: 024 7622 2225, - ,,,No ratings yet Rate it yourself - /Services/opticians/LeaveReview/DefaultView.aspx?id=OP_5MD_6983__000002_CV11HF,0,0,
Tesco Stores Ltd,OL/CO-1998/TAM__000001_B904EN,OPT,,1505 Stratford Road,Shirley,Solihull,,B90 4EN,Tel: 0121 253 7538, - ,,,No ratings yet Rate it yourself - /Services/opticians/LeaveReview/DefaultView.aspx?id=OL/CO-1998/TAM__000001_B904EN,0,0,
Winyates Opticians,0000050__000004_B980NR,OPT,17 Winyates Shopping Centre,Winyates,Redditch,Worcestershire,,B98 0NR,Tel: 01527 529010, - ,,,No ratings yet Rate it yourself - /Services/opticians/LeaveReview/DefaultView.aspx?id=0000050__000004_B980NR,0,0,
Home Eyecare,5MX063,OPT,,"Unit 8, 17 Winyates Centre",,Redditch,,B98 0NR,Tel: 01527 529010, - ,,,No ratings yet Rate it yourself - /Services/opticians/LeaveReview/DefaultView.aspx?id=5MX063,0,0,
The Eyewear House,76594999__000002_CV58HU,OPT,467 Holyhead Road,,,Coventry,,CV5 8HU,Tel: 024 76594999, - ,,,No ratings yet Rate it yourself - /Services/opticians/LeaveReview/DefaultView.aspx?id=76594999__000002_CV58HU,0,0,
Eye C Healthcare (Domiciliary Only) BY APPOINTMENT ONLY  ,DOM04__000001_B904UZ,OPT,,11 Horton Grove,,Solihull,West Midlands,B90 4UZ,Tel: 07957 652170, - ,,,No ratings yet Rate it yourself - /Services/opticians/LeaveReview/DefaultView.aspx?id=DOM04__000001_B904UZ,0,0,
Stoke Opticians ,CV3 1FQ__000003_CV31FQ,OPT,106 Binley Road,Stoke Green,,Coventry,,CV3 1FQ,Tel: 024 76456123, - ,,,No ratings yet Rate it yourself - /Services/opticians/LeaveReview/DefaultView.aspx?id=CV3 1FQ__000003_CV31FQ,0,0,
J & D Mason Opticians,5M144__000001_B296AU,OPT,,18 Farmhouse Way,Shirley,Solihull,,B90 4EH,Tel: 0121 705 8139, - ,,,No ratings yet Rate it yourself - /Services/opticians/LeaveReview/DefaultView.aspx?id=5M144__000001_B296AU,0,0,
The Eye Clinics(Ball Hill),19042017115402,OPT,,213 Walsgrave Road,,Coventry,,CV2 4HH,, - ,,,No ratings yet Rate it yourself - /Services/opticians/LeaveReview/DefaultView.aspx?id=19042017115402,0,0,
C R Williams Opticians,OP_5MD_13721__000001_CV31HX,OPT,,27 Princethorpe Way,Ernesford Grange,Coventry,,CV3 2HE,Tel: 024 7645 5187, - ,,,9 ratings Rate it yourself - /Services/opticians/LeaveReview/DefaultView.aspx?id=OP_5MD_13721__000001_CV31HX,,,
Eyesite Eyecare Centre,OP_5MD_9156__000002_CV24BA,OPT,249 Walsgrave Road,"249 Walsgrave Road, Ball Hill",,Coventry,,CV2 4BA,Tel: 024 76443366, - ,,,No ratings yet Rate it yourself - /Services/opticians/LeaveReview/DefaultView.aspx?id=OP_5MD_9156__000002_CV24BA,0,0,
The Eyewear House,OP_5MD_9650__000001_CV14FW,OPT,65 Stoney Stanton Road,,,Coventry,,CV1 4FW,Tel: 024 7655 5573, - ,,,No ratings yet Rate it yourself - /Services/opticians/LeaveReview/DefaultView.aspx?id=OP_5MD_9650__000001_CV14FW,0,0,
I-Care Vision Specialists,OP_CV24BE_29819,OPT,,291-293 Walsgrave Road,,Coventry,,CV2 4BE,Tel: 024 76442272, - ,,,1 rating Rate it yourself - /Services/opticians/LeaveReview/DefaultView.aspx?id=OP_CV24BE_29819,,,
S W Optics Ltd,5PG183,OPT,,3 Libbards Gate,Solihull,West Midlands,,B91 3XQ,Tel: 0121 704 1429, - ,,,No ratings yet Rate it yourself - /Services/opticians/LeaveReview/DefaultView.aspx?id=5PG183,0,0,
The Eye Clinics (Binley),190420171152,OPT,,"Unit 19, Warwickshire shopping park",,Coventry,,CV3 2SB,, - ,,,3 ratings Rate it yourself - /Services/opticians/LeaveReview/DefaultView.aspx?id=190420171152,,,
Jason Rice i-Care,OP_5MD_8668__000001_CV61JF,OPT,1a Engleton Road,,Coventry,,,CV6 1JF,Tel: 024 7659 2173, - ,,,1 rating Rate it yourself - /Services/opticians/LeaveReview/DefaultView.aspx?id=OP_5MD_8668__000001_CV61JF,,,
Boots-Coventry - Radford Rd,OP_5MD_9322__000001_CV63BU,OPT,258 Radford Road,,,Coventry,Warwickshire,CV6 3BU,Tel: 02476 598 233, - ,,,1 rating Rate it yourself - /Services/opticians/LeaveReview/DefaultView.aspx?id=OP_5MD_9322__000001_CV63BU,,,
Community Eyecare trading as Vision Call,OP_B920AJ_20418,OPT,463-465 Warwick Road,"Cleeves House, Hampton Court, 55 Marsh Lane, Hampton-in-Arden",,Solihull,,B92 0AJ,Tel: 01675 446 065, - ,,,No ratings yet Rate it yourself - /Services/opticians/LeaveReview/DefaultView.aspx?id=OP_B920AJ_20418,0,0,
First Care Optical Ltd,T3F4,OPT,,"16 GAINFORD RISE, BINLEY",,COVENTRY,,CV3 2RH,Tel: 07854401178, - ,,,No ratings yet Rate it yourself - /Services/opticians/LeaveReview/DefaultView.aspx?id=T3F4,0,0,
Eye Tech Optometrists,OP_5MD_13717__000001_CV23FJ,OPT,EYETECH Optometrists,175 Ansty Road,,Coventry,,CV2 3FJ,Tel: 024 76444566, - ,,,No ratings yet Rate it yourself - /Services/opticians/LeaveReview/DefaultView.aspx?id=OP_5MD_13717__000001_CV23FJ,0,0,
Adams Eyehealth Eyeheath Opticians,CV2 3PD__000001_CV23PD,OPT,219 Sewall Highway,Wyken,,Coventry,,CV2 3PD,Tel: 024 76 458600, - ,,,No ratings yet Rate it yourself - /Services/opticians/LeaveReview/DefaultView.aspx?id=CV2 3PD__000001_CV23PD,0,0,
"Standell, Teers & Davies",OP_5MD_8223__000001_CV65GA,OPT,639a Stoney Stanton Road,,Coventry,,,CV6 5GA,Tel: 024 7668 9594, - ,,,No ratings yet Rate it yourself - /Services/opticians/LeaveReview/DefaultView.aspx?id=OP_5MD_8223__000001_CV65GA,0,0,
Eyesite Eyecare Centre,OP_5MD_4162__000002_CV63ET,OPT,50 Jubilee Crescent,"50 Jubilee Crescent, Radford",Coventry,Coventry,,CV6 3ET,Tel: 024 7660 1113, - ,,,No ratings yet Rate it yourself - /Services/opticians/LeaveReview/DefaultView.aspx?id=OP_5MD_4162__000002_CV63ET,0,0,yes
Dickens Eye Clinic,DICKENS__000001_B901UB,OPT,39 Main Street,Dickens Heath,Solihull,West Midlands,,B90 1UB,Tel: 0121 744 5544, - ,,,2 ratings Rate it yourself - /Services/opticians/LeaveReview/DefaultView.aspx?id=DICKENS__000001_B901UB,,,
Taylor Opticians,OP_5MD_9953__000001_CV65AU,OPT,515 Foleshill Road,,,Coventry,,CV6 5AU,Tel: 024 7668 5258, - ,,,No ratings yet Rate it yourself - /Services/opticians/LeaveReview/DefaultView.aspx?id=OP_5MD_9953__000001_CV65AU,0,0,
Greys Opticians,5KY 20001__000002_GL556AT,OPT,,"Drury House, The Square",High Street,Chipping Campden,Gloucestershire,GL55 6AL,Tel: 01386 848884, - ,,,No ratings yet Rate it yourself - /Services/opticians/LeaveReview/DefaultView.aspx?id=5KY 20001__000002_GL556AT,0,0,
Foleshill Eye Centre,OP_5MD_4758__000002_CV65JX,OPT,436c Foleshill Road,,,Coventry,,CV6 5JX,Tel: 024 7663 8399, - ,,,1 rating Rate it yourself - /Services/opticians/LeaveReview/DefaultView.aspx?id=OP_5MD_4758__000002_CV65JX,,,
Perspective Opticians ,OP_5D1_5333__000001_B913BH,OPT,56 Drury Lane,Mell Square,Solihull,Solihull,,B91 3BH,Tel: 0121 709 1000, - ,,,No ratings yet Rate it yourself - /Services/opticians/LeaveReview/DefaultView.aspx?id=OP_5D1_5333__000001_B913BH,0,0,
Specsavers Opticians,OP_5D1_3685__000001_B913TA,OPT,,90 High Street,,Solihull,,B91 3TA,Tel: 0121 711 3411, - ,,,No ratings yet Rate it yourself - /Services/opticians/LeaveReview/DefaultView.aspx?id=OP_5D1_3685__000001_B913TA,0,0,
Boots-Solihull,OP_5D1_3193__000001_B913AT,OPT,57 Mill Lane,,,Solihull,West Midlands,B91 3AT,Tel: 0121 705 2152, - ,,,No ratings yet Rate it yourself - /Services/opticians/LeaveReview/DefaultView.aspx?id=OP_5D1_3193__000001_B913AT,0,0,
A B Optics,OP_5D1_13858__000001_B913DA,OPT,,681 Warwick Road,,Solihull,,B91 3DA,Tel: 0121 704 2615, - ,,,5 ratings Rate it yourself - /Services/opticians/LeaveReview/DefaultView.aspx?id=OP_5D1_13858__000001_B913DA,,,
Vision Express (UK) Ltd,5QW005,OPT,,Touchwood Shopping Centre,,Solihull,,B91 3QE,Tel: 0121 704 7150, - ,,,No ratings yet Rate it yourself - /Services/opticians/LeaveReview/DefaultView.aspx?id=5QW005,0,0,
Asda Opticians,OPT_B98 7ER,OPT,,JINNAH ROAD,SMALLWOOD,REDDITCH,,B98 7ER,Tel: 01527 509344, - ,,,No ratings yet Rate it yourself - /Services/opticians/LeaveReview/DefaultView.aspx?id=OPT_B98 7ER,0,0,
Pike Opticians Ltd,OP_5D1_13856__000001_B903BB,OPT,,452 Stratford Road,Shirley,Solihull,,B90 4AQ,Tel: 0121 744 9093, - ,,,No ratings yet Rate it yourself - /Services/opticians/LeaveReview/DefaultView.aspx?id=OP_5D1_13856__000001_B903BB,0,0,
Specsavers Opticians,OP_5MR_655__000001_B974YP,OPT,13 New Walk,Kingfisher Centre,Redditch,Worcestershire,,B97 4YP,Tel: 01527 595558, - ,,,No ratings yet Rate it yourself - /Services/opticians/LeaveReview/DefaultView.aspx?id=OP_5MR_655__000001_B974YP,0,0,
Vision Express (UK) Ltd,OP_5MR_9135__000001_B974HA,OPT,7 New Walk,Kingfisher Centre,Redditch,Worcestershire,,B97 4HA,Tel: 01527 69633, - ,,,No ratings yet Rate it yourself - /Services/opticians/LeaveReview/DefaultView.aspx?id=OP_5MR_9135__000001_B974HA,0,0,
Peter Bainbridge Opticians,OP_5MR_341__000003_B974EY,OPT,18 Kingfisher Walk,Redditch,Worcestershire,,,B97 4EY,Tel: 01527 64691, - ,,,2 ratings Rate it yourself - /Services/opticians/LeaveReview/DefaultView.aspx?id=OP_5MR_341__000003_B974EY,,,
Boots-Redditch,OP_5MR_9389__000002_B974EY,OPT,7 Kingfisher Walk,,,Redditch,Worcestershire,B97 4EY,Tel: 01527 63068, - ,,,No ratings yet Rate it yourself - /Services/opticians/LeaveReview/DefaultView.aspx?id=OP_5MR_9389__000002_B974EY,0,0,yes
Sims Opticians,OP_5D1_11728__000002_B903BT,OPT,,1 Union Road,Solihull,Solihull,,B90 3BT,Tel: 0121 744 6036, - ,,,No ratings yet Rate it yourself - /Services/opticians/LeaveReview/DefaultView.aspx?id=OP_5D1_11728__000002_B903BT,0,0,
Specsavers - Redditch Alvechurch,M2Y9H,OPT,,"Sainsburys, Abbey Trading Centre,Alvechurch Highway",,Redditch,,B97 6RF,Tel: 01527 913585, - ,,,No ratings yet Rate it yourself - /Services/opticians/LeaveReview/DefaultView.aspx?id=M2Y9H,0,0,
Homespecs,5QW052,OPT,,383 Stratford Road,Shirley,Birmingham,,B90 3BW,Tel: 0121 733 1232, - ,,,No ratings yet Rate it yourself - /Services/opticians/LeaveReview/DefaultView.aspx?id=5QW052,0,0,
Eyecare at Home,EYECAREATHOME1,OPT,208 Wharf lane,,,Solihull,West Midlands,B91 2UN,Tel: 0845 299 6069, - ,,,No ratings yet Rate it yourself - /Services/opticians/LeaveReview/DefaultView.aspx?id=EYECAREATHOME1,0,0,
Eyesite Eyecare Centre,OP_5MD_6988__000001_CV21LP,OPT,8 Henley Road,8 Henley Road,Coventry,Coventry,,CV2 1LP,Tel: 024 76663583, - ,,,No ratings yet Rate it yourself - /Services/opticians/LeaveReview/DefaultView.aspx?id=OP_5MD_6988__000001_CV21LP,0,0,
Tesco Opticians,CV6 6AS__000003_CV66AS,OPT,Arena Retail Park,,,Coventry,,CV6 6AS,Tel: 024 76817238, - ,,,No ratings yet Rate it yourself - /Services/opticians/LeaveReview/DefaultView.aspx?id=CV6 6AS__000003_CV66AS,0,0,
Hayward Opticians,OP_5MD_3483__000001_CV22QZ,OPT,Brade Drive,Coventry,,,,CV2 2QZ,Tel: 024 7661 7823, - ,,,No ratings yet Rate it yourself - /Services/opticians/LeaveReview/DefaultView.aspx?id=OP_5MD_3483__000001_CV22QZ,0,0,
Asda Opticians,OPT_CV2 2PN,OPT,,BRADE DRIVE,,COVENTRY,,CV2 2PN,Tel: 02476 625 812, - ,,,No ratings yet Rate it yourself - /Services/opticians/LeaveReview/DefaultView.aspx?id=OPT_CV2 2PN,0,0,