Organisation Name,NACS Code,Organisation Type,Address1,Address2,Address3,Address4,Address5,PostCode,Telephone Number,Opening time,Value  (Opening time),Banding Classification  (Opening time),NHS.UK users rating,Value  (NHS.UK users rating),Banding Classification  (NHS.UK users rating),Car parking (Is there car parking at this organisation?)
Vision Express (UK) Ltd,OP_5DN_1223__000001_RG109DN,OPT,7 Church Street,Twyford,Reading,Berkshire,,RG10 9DN,Tel: 0118 934 5566, - ,,,No ratings yet Rate it yourself - /Services/opticians/LeaveReview/DefaultView.aspx?id=OP_5DN_1223__000001_RG109DN,0,0,
Bunker Opticians,OP_5DX_8715__000001_RG91AN,OPT,45 - 47 Duke Street,,Henley-on-Thames,,,RG9 1UR,Tel: 01491 412020, - ,,,No ratings yet Rate it yourself - /Services/opticians/LeaveReview/DefaultView.aspx?id=OP_5DX_8715__000001_RG91AN,0,0,
Boots-Henley On Thames,BOOTSHENLEY1,OPT,23 Duke Street,,,Henley On Thames,Oxfordshire,RG9 1UR,Tel: 01491 637763, - ,,,No ratings yet Rate it yourself - /Services/opticians/LeaveReview/DefaultView.aspx?id=BOOTSHENLEY1,0,0,
Specsavers Opticians,OP_RG53JH_85780,OPT,,176 Crockhamwell Road,,Woodley,,RG5 3JH,, - ,,,No ratings yet Rate it yourself - /Services/opticians/LeaveReview/DefaultView.aspx?id=OP_RG53JH_85780,0,0,
Leightons Opticians & Hearing Care,OP_5DN_6941__000002_RG53JH,OPT,,124 Crockhamwell Road,Woodley,Reading,Berkshire,RG5 3JH,Tel: 0118 969 1139, - ,,,No ratings yet Rate it yourself - /Services/opticians/LeaveReview/DefaultView.aspx?id=OP_5DN_6941__000002_RG53JH,0,0,
Home Care Optician,OP_RG46PH_46763,OPT,,4 Highbridge Close,Caversham Park Village,Reading,Berkshire,RG4 6PH,Tel: 07909 335211, - ,,,No ratings yet Rate it yourself - /Services/opticians/LeaveReview/DefaultView.aspx?id=OP_RG46PH_46763,0,0,
Vision Express,OP_RG18DF_85776,OPT,,"Tesco Express, Napier Road",,Reading,,RG1 8DF,, - ,,,No ratings yet Rate it yourself - /Services/opticians/LeaveReview/DefaultView.aspx?id=OP_RG18DF_85776,0,0,
Stephen Abery Opticians,OP_5DN_8100__000001_RG67HD,OPT,,46 Gipsy Lane,Reading,Earley,Buckinghamshire,RG6 7HD,Tel: 0118 935 1975, - ,,,No ratings yet Rate it yourself - /Services/opticians/LeaveReview/DefaultView.aspx?id=OP_5DN_8100__000001_RG67HD,0,0,
Robin James Opticians Ltd,OP_5DL_844__000002_RG48AU,OPT,44 Church Street,Caversham,Reading,,,RG4 8AU,Tel: 0118 947 2099, - ,,,No ratings yet Rate it yourself - /Services/opticians/LeaveReview/DefaultView.aspx?id=OP_5DL_844__000002_RG48AU,0,0,
Opticial Express,OP_12345_RG1 4BP,OPT,"Lower Ground, Havell House",62-66 Queens Road,,Reading,Berkshire,RG1 4BP,Tel: 0800 023 2020, - ,,,No ratings yet Rate it yourself - /Services/opticians/LeaveReview/DefaultView.aspx?id=OP_12345_RG1 4BP,0,0,
Optical Express,,OPT,,Havell House,,Reading,,RG1 4BP,, - ,,,N/A - Data not available,,,
Leightons Opticians & Hearing Care,OP_5DL_8141__000001_RG17UJ,OPT,,12-14 Queen Victoria Street,,Reading,Berkshire,RG1 1TG,Tel: 0118 959 0055, - ,,,No ratings yet Rate it yourself - /Services/opticians/LeaveReview/DefaultView.aspx?id=OP_5DL_8141__000001_RG17UJ,0,0,
Eyesite Opticians,OP_5DL_297__000001_RG11EP,OPT,142 Friar Street,,,Reading,Berkshire,RG1 1EX,Tel: 0118 950 9098, - ,,,No ratings yet Rate it yourself - /Services/opticians/LeaveReview/DefaultView.aspx?id=OP_5DL_297__000001_RG11EP,0,0,
Specsavers Opticians,OP_RG12AA_85781,OPT,,45 Broad Street,,Reading,,RG1 2AA,, - ,,,No ratings yet Rate it yourself - /Services/opticians/LeaveReview/DefaultView.aspx?id=OP_RG12AA_85781,0,0,
Boots-Reading - Oracle Centre (in Boots UK),OP_5DL_1822__000002_RG12AH,OPT,Unit 5 Upper Ground Level,The Oracle Centre,,Reading,Berkshire,RG1 2AH,Tel: 0118 958 9783, - ,,,No ratings yet Rate it yourself - /Services/opticians/LeaveReview/DefaultView.aspx?id=OP_5DL_1822__000002_RG12AH,0,0,
Vision Express (UK) Ltd,OP_5DL_2333__000003_RG12AH,OPT,"5a, Town Mall Walk, Upper Ground Level",The Oracle Centre,Reading,,,RG1 2AH,Tel: 0118 950 4504, - ,,,No ratings yet Rate it yourself - /Services/opticians/LeaveReview/DefaultView.aspx?id=OP_5DL_2333__000003_RG12AH,0,0,
D & R Kirk Opticians,OP_RG20EG_85771,OPT,D & R Kirk Opticians,47 Whitley Street,,READING,Berkshire,RG2 0EG,Tel: 0118 9871020, - ,,,No ratings yet Rate it yourself - /Services/opticians/LeaveReview/DefaultView.aspx?id=OP_RG20EG_85771,0,0,
ASDA Stores Ltd,OP_RG65TT_85766,OPT,,Lower Earley District Centre,,READING,,RG6 5TT,Tel: 01189 870 320, - ,,,No ratings yet Rate it yourself - /Services/opticians/LeaveReview/DefaultView.aspx?id=OP_RG65TT_85766,0,0,
Stewart-Robinson Opticians,OP_5G5_11132__000001_SL72LS,OPT,49 West Street,49 West Street,,Marlow,Buckinghamshire,SL7 2LS,Tel: 01628 482906, - ,,,No ratings yet Rate it yourself - /Services/opticians/LeaveReview/DefaultView.aspx?id=OP_5G5_11132__000001_SL72LS,0,0,
Specsavers Opticians,TP9GH,OPT,,15-17 West Street,,Marlow,Buckinghamshire,SL7 2LS,Tel: 01628 957610, - ,,,No ratings yet Rate it yourself - /Services/opticians/LeaveReview/DefaultView.aspx?id=TP9GH,0,0,
Specsavers Opticians,OP_RG28HA_85773,OPT,,"203 - 205 Shinfield Road,",,"Earley, Reading",,RG2 8HA,, - ,,,No ratings yet Rate it yourself - /Services/opticians/LeaveReview/DefaultView.aspx?id=OP_RG28HA_85773,0,0,
Leightons Insight,OP_5G5_14309__000002_SL71AB,OPT,,73 High Street,,Marlow,Buckinghamshire,SL7 1AE,Tel: 01628 477998, - ,,,No ratings yet Rate it yourself - /Services/opticians/LeaveReview/DefaultView.aspx?id=OP_5G5_14309__000002_SL71AB,0,0,
Boots-Marlow,OP_5G5_10586__000003_SL71AB,OPT,93 High Street,,,Marlow,Buckinghamshire,SL7 1AB,Tel: 01628 483 052, - ,,,No ratings yet Rate it yourself - /Services/opticians/LeaveReview/DefaultView.aspx?id=OP_5G5_10586__000003_SL71AB,0,0,
David Clulow Marlow,OP_SL71AW_46730,OPT,42 High Street,,,Marlow,Buckinghamshire,SL7 1AW,Tel: 01628 484544, - ,,,No ratings yet Rate it yourself - /Services/opticians/LeaveReview/DefaultView.aspx?id=OP_SL71AW_46730,0,0,
Vision Express (UK) Ltd,OP_5DN_10002__000002_RG401XZ,OPT,4 Old Row Court,Rose Street,Wokingham,Berkshire,,RG40 1XZ,Tel: 0118 978 0937, - ,,,No ratings yet Rate it yourself - /Services/opticians/LeaveReview/DefaultView.aspx?id=OP_5DN_10002__000002_RG401XZ,0,0,
Scrivens Opticians,OP_5G3_13127__000001_SL61JX,OPT,Scrivens Opticians,79 High Street,,Maidenhead,,SL6 1JX,Tel: 01628 624632, - ,,,No ratings yet Rate it yourself - /Services/opticians/LeaveReview/DefaultView.aspx?id=OP_5G3_13127__000001_SL61JX,0,0,
Insight Opticians,OP_SL61EF_34403,OPT,,91A High Street,,Maidenhead,,SL6 1JX,Tel: 01628 671908, - ,,,No ratings yet Rate it yourself - /Services/opticians/LeaveReview/DefaultView.aspx?id=OP_SL61EF_34403,0,0,
Specsavers Opticians,OP_5G3_7069__000002_SL61JX,OPT,85 High Street,Maidenhead,Berkshire,,,SL6 1JX,Tel: 01628 777 220, - ,,,No ratings yet Rate it yourself - /Services/opticians/LeaveReview/DefaultView.aspx?id=OP_5G3_7069__000002_SL61JX,0,0,
Boots-Wokingham,OP_5DN_11548__000001_RG401XS,OPT,41 Market Place,,Wokingham,Wokingham,Berkshire,RG40 1AT,Tel: 01189796392, - ,,,No ratings yet Rate it yourself - /Services/opticians/LeaveReview/DefaultView.aspx?id=OP_5DN_11548__000001_RG401XS,0,0,
Boots-Maidenhead - High St (in Boots UK),OP_5G3_2047__000004_SL61PY,OPT,54-58 High Street,,,Maidenhead,Berkshire,SL6 1PY,Tel: 01628 782880, - ,,,No ratings yet Rate it yourself - /Services/opticians/LeaveReview/DefaultView.aspx?id=OP_5G3_2047__000004_SL61PY,0,0,
Boots-Maidenhead - High St,OP_5G3_564__000003_SL61PY,OPT,,54/58 High Street,Maidenhead,Maidenhead,,SL6 1PY,Tel: 01628 674545, - ,,,No ratings yet Rate it yourself - /Services/opticians/LeaveReview/DefaultView.aspx?id=OP_5G3_564__000003_SL61PY,0,0,
Optico Opticians,OP_5G3_5994__000002_SL61PY,OPT,Optico Opticians,80 High Street,,Maidenhead,Berkshire,SL6 1PY,Tel: 01628 770607, - ,,,No ratings yet Rate it yourself - /Services/opticians/LeaveReview/DefaultView.aspx?id=OP_5G3_5994__000002_SL61PY,0,0,
Leightons Opticians & Hearing Care,OP_RG401XJ_85767,OPT,,15 Peach Street,,Wokingham,Berkshire,RG40 1XJ,Tel: 0118 9786 744, - ,,,No ratings yet Rate it yourself - /Services/opticians/LeaveReview/DefaultView.aspx?id=OP_RG401XJ_85767,0,0,
Specsavers Opticians,OP_RG401AL_85779,OPT,,18 Market Place,,Wokingham,Berkshire,RG40 1AL,Tel: 0118 978 3525, - ,,,No ratings yet Rate it yourself - /Services/opticians/LeaveReview/DefaultView.aspx?id=OP_RG401AL_85779,0,0,
the eye people,OP_5DN_5493__000002_RG401XJ,OPT,,the eye people,22 Market Place,Wokingham,Berkshire,RG40 1AP,Tel: 0118 978 9311, - ,,,No ratings yet Rate it yourself - /Services/opticians/LeaveReview/DefaultView.aspx?id=OP_5DN_5493__000002_RG401XJ,0,0,
Vision Express,OP_RG301AH_85777,OPT,,"Tesco Express, Portman Road",,Reading,,RG30 1AH,, - ,,,No ratings yet Rate it yourself - /Services/opticians/LeaveReview/DefaultView.aspx?id=OP_RG301AH_85777,0,0,
Vision Express,TP79L,OPT,,47 High Street,Nicholson Centre,Maidenhead,Berkshire,SL6 1QB,Tel: 01628 781180, - ,,,No ratings yet Rate it yourself - /Services/opticians/LeaveReview/DefaultView.aspx?id=TP79L,0,0,
Vision Express,TP8HJ,OPT,The Lexicon,26 Braccan Walk,,Bracknell,Berkshire,RG12 1EN,Tel: 01344 304217, - ,,,No ratings yet Rate it yourself - /Services/opticians/LeaveReview/DefaultView.aspx?id=TP8HJ,0,0,
Costco,OP_RG26UE_85770,OPT,,"100 South Oak Way, Green Park",,Reading,,RG2 6UE,, - ,,,No ratings yet Rate it yourself - /Services/opticians/LeaveReview/DefaultView.aspx?id=OP_RG26UE_85770,0,0,
Boots Opticians,TP6A2,OPT,,The Lexicon,19-23 Braccan Walk,Bracknell,Berkshire,RG12 1BE,Tel: 01344 420933, - ,,,No ratings yet Rate it yourself - /Services/opticians/LeaveReview/DefaultView.aspx?id=TP6A2,0,0,
Insight Opticians,OP_5G2_8738__000002_RG121LS,OPT,15b Princess Square,,Bracknell,,,RG12 1LS,Tel: 01344 454965, - ,,,No ratings yet Rate it yourself - /Services/opticians/LeaveReview/DefaultView.aspx?id=OP_5G2_8738__000002_RG121LS,0,0,
Specsavers Optician,OP_5G2_6225__000001_RG121DE,OPT,18 Princess Square,,Bracknell,,,RG12 1LS,Tel: 01344 303344, - ,,,No ratings yet Rate it yourself - /Services/opticians/LeaveReview/DefaultView.aspx?id=OP_5G2_6225__000001_RG121DE,0,0,
Scrivens Opticians,OP_5DL_10795__000002_RG315AR,OPT,11 School Road,Tilehurst,Reading,Berkshire,,RG31 5AR,Tel: 0118 9412911, - ,,,No ratings yet Rate it yourself - /Services/opticians/LeaveReview/DefaultView.aspx?id=OP_5DL_10795__000002_RG315AR,0,0,
Asda Opticians,OPT_HP124NU,OPT,,Holmers Farm Way,,High Wycombe,,HP12 4NU,Tel: 01494 899098, - ,,,No ratings yet Rate it yourself - /Services/opticians/LeaveReview/DefaultView.aspx?id=OPT_HP124NU,0,0,
Scrivens Opticians,OP_5G5_11089__000001_SL85SY,OPT,,20-24 The Parade,,Bourne End,Buckinghamshire,SL8 5SY,Tel: 01628 525999, - ,,,No ratings yet Rate it yourself - /Services/opticians/LeaveReview/DefaultView.aspx?id=OP_5G5_11089__000001_SL85SY,0,0,
Walker & Campbell,OP_5G4_1382__000001_SL17JX,OPT,47 High Street,,Burnham,,,SL1 7JX,Tel: 01628 663055, - ,,,No ratings yet Rate it yourself - /Services/opticians/LeaveReview/DefaultView.aspx?id=OP_5G4_1382__000001_SL17JX,0,0,
Complete Community Care NW London Limited,COMPLETE COMMUNITYCARENWLONDONLIMITED1,OPT,,Unit 8 Shepherd's Court,111 High Street,Burnham,Buckinghamshire,SL1 7JZ,Tel: 01895 521 461, - ,,,No ratings yet Rate it yourself - /Services/opticians/LeaveReview/DefaultView.aspx?id=COMPLETE COMMUNITYCARENWLONDONLIMITED1,0,0,
Realeyes Limited,OP_SL17JP_46732,OPT,,32 High Street,,Burnham,Buckinghamshire,SL1 7JP,Tel: 01628 559000, - ,,,No ratings yet Rate it yourself - /Services/opticians/LeaveReview/DefaultView.aspx?id=OP_SL17JP_46732,0,0,
Specsavers Opticians,TP9F3,OPT,Sainsbury's,Bath Road,Calcot,Reading,Berkshire,RG31 7SA,Tel: 0118 956 9770, - ,,,No ratings yet Rate it yourself - /Services/opticians/LeaveReview/DefaultView.aspx?id=TP9F3,0,0,
Ashton Opticians,OL124685G5__000001_HP109LS,OPT,1 Acorn House,12-16 Straight Bit,Flackwell Heath,High Wycombe,Buckinghamshire,HP10 9LS,Tel: 01628 530420, - ,,,No ratings yet Rate it yourself - /Services/opticians/LeaveReview/DefaultView.aspx?id=OL124685G5__000001_HP109LS,0,0,
Norman Prince Crowthorne Opticians,J7N9X,OPT,,85 Church Street,,Crowthorne,Berkshire,RG45 7AW,Tel: 01344 772062, - ,,,No ratings yet Rate it yourself - /Services/opticians/LeaveReview/DefaultView.aspx?id=J7N9X,0,0,
Vision Express (UK) Ltd,OP_5DL_2989__000001_RG87LR,OPT,,12 Whitchurch Road,Reading,Pangbourne,Berkshire,RG8 7BP,Tel: 0118 984 2428, - ,,,No ratings yet Rate it yourself - /Services/opticians/LeaveReview/DefaultView.aspx?id=OP_5DL_2989__000001_RG87LR,0,0,
Asda Opticians,OP_5DM_286__000001_SL19LA,OPT,,Asda Slough Superstore,Telford Drive,Slough,,SL1 9LA,Tel: 01753 894020, - ,,,No ratings yet Rate it yourself - /Services/opticians/LeaveReview/DefaultView.aspx?id=OP_5DM_286__000001_SL19LA,0,0,
High Wycombe VE Ltd,,OPT,,"Eden Shopping Centre, Newland Street",High Wycombe,Buckinghamshire,,HP11 2BY,Tel: 01494 473399, - ,,,N/A - Data not available,,,
Boots-High Wycombe - Eden Walk (in Boots UK),OP_5G5_6341__000002_HP112HR,OPT,27 Eden Walk,,Eden Centre,High Wycombe,Buckinghamshire,HP11 2AU,Tel: 01494 459610, - ,,,No ratings yet Rate it yourself - /Services/opticians/LeaveReview/DefaultView.aspx?id=OP_5G5_6341__000002_HP112HR,0,0,
David Williams ,HP11 1BA_22222,OPT,,7 Queen Victoria Road,,High Wycombe,,HP11 1BA,Tel: 01494 443448, - ,,,No ratings yet Rate it yourself - /Services/opticians/LeaveReview/DefaultView.aspx?id=HP11 1BA_22222,0,0,
A R Salter,OP_5G5_5759__000001_HP112EL,OPT,65 Bridge Street,,High Wycombe,,,HP11 2EL,Tel: 01494 527130, - ,,,No ratings yet Rate it yourself - /Services/opticians/LeaveReview/DefaultView.aspx?id=OP_5G5_5759__000001_HP112EL,0,0,
M&S Opticians (High Wycombe),N9V1C,OPT,,"M&S, 1 Eden Place",The Eden Centre,High Wycombe,,HP11 2DH,Tel: 01494 321 717, - ,,,No ratings yet Rate it yourself - /Services/opticians/LeaveReview/DefaultView.aspx?id=N9V1C,0,0,
Specsavers Opticians,OP_5G5_12596__000001_HP112DG,OPT,27/31 White Hart Street,,,High Wycombe,Buckinghamshire,HP11 2HL,Tel: 01494 520304, - ,,,No ratings yet Rate it yourself - /Services/opticians/LeaveReview/DefaultView.aspx?id=OP_5G5_12596__000001_HP112DG,0,0,
Scrivens Opticians,OP_5G5_96__000002_HP112DF,OPT,,18 Queen Square,,High Wycombe,Buckinghamshire,HP11 2DF,Tel: 01494 526058, - ,,,No ratings yet Rate it yourself - /Services/opticians/LeaveReview/DefaultView.aspx?id=OP_5G5_96__000002_HP112DF,0,0,
Redgate Opticians & Audiologists,TP8JG,OPT,,3-4 Queens Square,,High Wycombe,Buckinghamshire,HP11 2BP,Tel: 01494 258 690, - ,,,No ratings yet Rate it yourself - /Services/opticians/LeaveReview/DefaultView.aspx?id=TP8JG,0,0,
Boots-Ascot,OP_5G2_12866__000001_RG121LS,OPT,,61 High Street,,Ascot,Berkshire,SL5 7HP,Tel: 01344 622913, - ,,,No ratings yet Rate it yourself - /Services/opticians/LeaveReview/DefaultView.aspx?id=OP_5G2_12866__000001_RG121LS,0,0,
Norman Prince Ascot Opticians,B8A0O,OPT,,1 Hermitage Parade,,Ascot,Berkshire,SL5 7HE,Tel: 01344 625511, - ,,,No ratings yet Rate it yourself - /Services/opticians/LeaveReview/DefaultView.aspx?id=B8A0O,0,0,
Realeyes - The Eye Clinic,OPT_SL14XP_1,OPT,,165 Farnham Road,,Slough,,SL1 4XP,Tel: 01753 915060, - ,,,No ratings yet Rate it yourself - /Services/opticians/LeaveReview/DefaultView.aspx?id=OPT_SL14XP_1,0,0,
Healthcall Optical Services,OP_GU470UR_46762,OPT,,108 Harvard Road,Owlsmoor,Sandhurst,Berkshire,GU47 0UR,Tel: 01962 609011, - ,,,No ratings yet Rate it yourself - /Services/opticians/LeaveReview/DefaultView.aspx?id=OP_GU470UR_46762,0,0,
Leightons Eye Windsor,OP_SL41DE_34402,OPT,,45 Peascod Street,,Windsor,Berkshire,SL4 1DE,Tel: 01753 336124, - ,,,No ratings yet Rate it yourself - /Services/opticians/LeaveReview/DefaultView.aspx?id=OP_SL41DE_34402,0,0,
Specsavers Optician,OP_SL41DE_46578,OPT,Specsavers Optician,59 Peascod Street,,Windsor,Berkshire,SL4 1DE,Tel: 01753 410970, - ,,,No ratings yet Rate it yourself - /Services/opticians/LeaveReview/DefaultView.aspx?id=OP_SL41DE_46578,0,0,
Vision Express,OP_5QG_12112__000001_SL41TF,OPT,16 King Edward Court,Windsor,,Berkshire,,SL4 1TF,Tel: 01753 850550, - ,,,No ratings yet Rate it yourself - /Services/opticians/LeaveReview/DefaultView.aspx?id=OP_5QG_12112__000001_SL41TF,0,0,yes
Boots-Windsor - Peascod St,TP4QA,OPT,119 Peascod Street,,,Windsor,Berkshire,SL4 1DW,Tel: 01753 867041, - ,,,No ratings yet Rate it yourself - /Services/opticians/LeaveReview/DefaultView.aspx?id=TP4QA,0,0,
Bayfield's Opticians and Audiologists (Sunninghill and Ascot) ,L8T5A ,OPT,,7 High Street,,Ascot,,SL5 9NQ,, - ,,,No ratings yet Rate it yourself - /Services/opticians/LeaveReview/DefaultView.aspx?id=L8T5A,0,0,
Valli Opticians Stockport,E1D9Q,OPT,,15 Great Underbank,,Stockport,Greater Manchester,SL1 1LF,Tel: 01614740974, - ,,,No ratings yet Rate it yourself - /Services/opticians/LeaveReview/DefaultView.aspx?id=E1D9Q,0,0,
Thomas H Collison Ltd,OP_5DM_4323__000001_SL11EL,OPT,60 High Street,,Slough,Slough,,SL1 1EL,Tel: 01753 524392, - ,,,No ratings yet Rate it yourself - /Services/opticians/LeaveReview/DefaultView.aspx?id=OP_5DM_4323__000001_SL11EL,0,0,
The Eye Centre,OP_SL11PQ_34410,OPT,,1 Church Street,,Slough,,SL1 1PQ,Tel: 01753 691692, - ,,,No ratings yet Rate it yourself - /Services/opticians/LeaveReview/DefaultView.aspx?id=OP_SL11PQ_34410,0,0,
Vision Express (UK) Ltd,OP_5DM_12118__000001_SL11DD,OPT,33-35 Curzon Mall,Queensmere,Slough,,,SL1 1DD,Tel: 01753 693777, - ,,,No ratings yet Rate it yourself - /Services/opticians/LeaveReview/DefaultView.aspx?id=OP_5DM_12118__000001_SL11DD,0,0,
Vision Express,OP_5G2_8065__000002_GU470FD,OPT,Tesco Express,Brunel Way,Wellington Street,Slough,,SL1 1XW,Tel: 01753 306 605, - ,,,No ratings yet Rate it yourself - /Services/opticians/LeaveReview/DefaultView.aspx?id=OP_5G2_8065__000002_GU470FD,0,0,
Specsavers Opticians,OP_5DM_660__000001_SL11DB,OPT,194-196 High Street,,Slough,,,SL1 1JS,Tel: 01753 502700, - ,,,No ratings yet Rate it yourself - /Services/opticians/LeaveReview/DefaultView.aspx?id=OP_5DM_660__000001_SL11DB,0,0,
Spectacle Express,OP_5DM_4198__000001_SL11LD,OPT,1 Observatory Centre,,Slough,,,SL1 1LE,Tel: 01753 517417, - ,,,No ratings yet Rate it yourself - /Services/opticians/LeaveReview/DefaultView.aspx?id=OP_5DM_4198__000001_SL11LD,0,0,
Vision Express,OP_5G2_7146__000001_GU470FD,OPT,Tesco Extra,The Meadows,Marshall Road,Sandhurst,Berkshire,GU47 0FD,Tel: 0125 229 8186, - ,,,No ratings yet Rate it yourself - /Services/opticians/LeaveReview/DefaultView.aspx?id=OP_5G2_7146__000001_GU470FD,0,0,
Boots-Beaconsfield,OP_5G4_13334__000001_HP91HH,OPT,25 Gregories Road,,,Beaconsfield,Buckinghamshire,HP9 1HH,Tel: 01494 673627, - ,,,No ratings yet Rate it yourself - /Services/opticians/LeaveReview/DefaultView.aspx?id=OP_5G4_13334__000001_HP91HH,0,0,
S H Harrold (1937) Ltd,OP_5G4_3077__000001_HP91HQ,OPT,26 Gregories Road,,Beaconsfield,,,HP9 1HQ,Tel: 01494 672193, - ,,,No ratings yet Rate it yourself - /Services/opticians/LeaveReview/DefaultView.aspx?id=OP_5G4_3077__000001_HP91HQ,0,0,
Village Eye Clinic,TP8GH,OPT,,33 High Street,,Bagshot,Surrey,GU19 5AF,Tel: 01276 785123, - ,,,No ratings yet Rate it yourself - /Services/opticians/LeaveReview/DefaultView.aspx?id=TP8GH,0,0,
Michael Blackstone Optometrists,OP_5G4_13333__000001_HP91QQ,OPT,18 The Highway,Station Road,,Beaconsfield,Buckinghamshire,HP9 1QQ,Tel: 01494 673782, - ,,,No ratings yet Rate it yourself - /Services/opticians/LeaveReview/DefaultView.aspx?id=OP_5G4_13333__000001_HP91QQ,0,0,
Bayfields Opticians,OP_5L7_4702__000001_GU153QU,OPT,1b High Street,,Camberley,Camberley,,GU15 3QU,Tel: 01276 21791, - ,,,No ratings yet Rate it yourself - /Services/opticians/LeaveReview/DefaultView.aspx?id=OP_5L7_4702__000001_GU153QU,0,0,
Medical Eye Centre,GU17 9AA__000003_GU179AA,OPT,White Hart Parade,,Blackwater,Hampshire,,GU17 9AA,, - ,,,No ratings yet Rate it yourself - /Services/opticians/LeaveReview/DefaultView.aspx?id=GU17 9AA__000003_GU179AA,0,0,
Forsight,OP_5G6_14841__000002_GU179AA,OPT,2 Kings Parade,42 London Road,Blackwater,,,GU17 9AA,Tel: 01276 34053, - ,,,No ratings yet Rate it yourself - /Services/opticians/LeaveReview/DefaultView.aspx?id=OP_5G6_14841__000002_GU179AA,0,0,
Boots-Camberley - Obelisk Way,OP_5L7_3761__000002_GU153SD,OPT,26-30 Obelisk Way,,,Camberley,Surrey,GU15 3SD,Tel: 01276 670393, - ,,,No ratings yet Rate it yourself - /Services/opticians/LeaveReview/DefaultView.aspx?id=OP_5L7_3761__000002_GU153SD,0,0,
Boots-Camberley - Grace Reynolds Walk,OP_5L7_12539__000001_GU153SN,OPT,1B Grace Reynolds Walk,Main Square,,Camberley,,GU15 3SN,Tel: 01276 25880, - ,,,No ratings yet Rate it yourself - /Services/opticians/LeaveReview/DefaultView.aspx?id=OP_5L7_12539__000001_GU153SN,0,0,
Vision Express Camberley,E0W2O,OPT,,36 High Street,,Camberley,Surrey,GU15 3RS,Tel: 01276670222, - ,,,No ratings yet Rate it yourself - /Services/opticians/LeaveReview/DefaultView.aspx?id=E0W2O,0,0,
Leightons Opticians & Hearing Care,OP_5L7_11292__000001_GU153RS,OPT,,62 High Street,,Camberley,Surrey,GU15 3RS,Tel: 01276 23648, - ,,,No ratings yet Rate it yourself - /Services/opticians/LeaveReview/DefaultView.aspx?id=OP_5L7_11292__000001_GU153RS,0,0,
Specsavers Opticians,OP_5L7_3649__000001_GU153SP,OPT,3 Princess Way,,Camberley,,,GU15 3SP,Tel: 01276 677 686, - ,,,No ratings yet Rate it yourself - /Services/opticians/LeaveReview/DefaultView.aspx?id=OP_5L7_3649__000001_GU153SP,0,0,
Leigh Lewis Optometrists,OL01167875QD__000001_HP144TH,OPT,247 Main Road,,Walters Ash,Buckinghamshire,,HP14 4TH,Tel: 01494 564600, - ,,,No ratings yet Rate it yourself - /Services/opticians/LeaveReview/DefaultView.aspx?id=OL01167875QD__000001_HP144TH,0,0,
The Practice Opticians,OP_5G5_14974__000001_HP157BS,OPT,26 Eastern Dene,Hazlemere,,High Wycombe,Buckinghamshire,HP15 7BS,Tel: 01494 716708, - ,,,No ratings yet Rate it yourself - /Services/opticians/LeaveReview/DefaultView.aspx?id=OP_5G5_14974__000001_HP157BS,0,0,
Robert Stanley Opticians,OP_5DX_5409__000002_OX100AL,OPT,8 St. Martins Street,,,Wallingford,,OX10 0AL,Tel: 01491 837033, - ,,,No ratings yet Rate it yourself - /Services/opticians/LeaveReview/DefaultView.aspx?id=OP_5DX_5409__000002_OX100AL,0,0,
Patricia Hayselden & Partners,OP_5DX_8466__000002_OX100EL,OPT,,60 St Mary's Street,,Wallingford,Oxfordshire,OX10 0EL,Tel: 01491 835466, - ,,,No ratings yet Rate it yourself - /Services/opticians/LeaveReview/DefaultView.aspx?id=OP_5DX_8466__000002_OX100EL,0,0,
Boots-Wallingford,BOOTSWALLINGFORD1,OPT,1 Castle Street,,,Wallingford,Oxfordshire,OX10 8DL,Tel: 01491 833200, - ,,,No ratings yet Rate it yourself - /Services/opticians/LeaveReview/DefaultView.aspx?id=BOOTSWALLINGFORD1,0,0,
Englefield Green Opticians,OP_TW200QX_34400,OPT,,44 Victoria Street,,Engelfield Green,,TW20 0QX,Tel: 01784 432818, - ,,,No ratings yet Rate it yourself - /Services/opticians/LeaveReview/DefaultView.aspx?id=OP_TW200QX_34400,0,0,
Thomas H Collison Ltd,OP_5DM_12922__000002_SL38HJ,OPT,4 Harrow Market,Langley,Slough,LANGLEY,,SL3 8HJ,Tel: 01753 541170, - ,,,No ratings yet Rate it yourself - /Services/opticians/LeaveReview/DefaultView.aspx?id=OP_5DM_12922__000002_SL38HJ,0,0,
Boots-Frimley,OP_5L7_5111__000002_GU165HY,OPT,4 The Parade,,High Street,Frimley,,GU16 7HY,Tel: 01276 62656, - ,,,No ratings yet Rate it yourself - /Services/opticians/LeaveReview/DefaultView.aspx?id=OP_5L7_5111__000002_GU165HY,0,0,
Insight Opticians,OP_5L7_13115__000001_GU165HJ,OPT,,21 Frimley High Street,Frimley,Camberley,Surrey,GU16 7HJ,Tel: 01276 627 44, - ,,,No ratings yet Rate it yourself - /Services/opticians/LeaveReview/DefaultView.aspx?id=OP_5L7_13115__000001_GU165HJ,0,0,Data not available
The Optical Studio,OPT_GU254DW_1,OPT,,13 Station Approach,,Virginia Water,,GU25 4DW,Tel: 01344 849077, - ,,,No ratings yet Rate it yourself - /Services/opticians/LeaveReview/DefaultView.aspx?id=OPT_GU254DW_1,0,0,
Specsavers Egham,TP71E,OPT,,29 The Precinct,,Egham,,TW20 9HN,Tel: 01784 220580, - ,,,No ratings yet Rate it yourself - /Services/opticians/LeaveReview/DefaultView.aspx?id=TP71E,0,0,