Organisation Name,NACS Code,Organisation Type,Address1,Address2,Address3,Address4,Address5,PostCode,Telephone Number,Opening time,Value  (Opening time),Banding Classification  (Opening time),NHS.UK users rating,Value  (NHS.UK users rating),Banding Classification  (NHS.UK users rating),Car parking (Is there car parking at this organisation?)
 Cecil C Amey Ltd,OP_5JV_9960__000001_IP198AR,OPT,49 Thoroughfare,,Halesworth,Suffolk,,IP19 8AR,Tel: 01986 872122, - ,,,1 rating Rate it yourself - /Services/opticians/LeaveReview/DefaultView.aspx?id=OP_5JV_9960__000001_IP198AR,,,
R H Jeffery & Associates,OP_5JV_6587__000001_IP198AF,OPT,4-5 Rectory Street,Halesworth,Suffolk,,,IP19 8AF,Tel: 01986 872116, - ,,,No ratings yet Rate it yourself - /Services/opticians/LeaveReview/DefaultView.aspx?id=OP_5JV_6587__000001_IP198AF,0,0,
R H Jeffery & Associates,OP_5JR_9720__000002_IP171DD,OPT,16 High Street,,Saxmundham,Suffolk,,IP17 1DD,Tel: 01728 602830, - ,,,No ratings yet Rate it yourself - /Services/opticians/LeaveReview/DefaultView.aspx?id=OP_5JR_9720__000002_IP171DD,0,0,
Observatory Opticians,OL_CO-3383_5PR__000001_IP186DJ,OPT,53 High Street,,,Southwold,Suffolk,IP18 6DJ,Tel: 01502 723291, - ,,,No ratings yet Rate it yourself - /Services/opticians/LeaveReview/DefaultView.aspx?id=OL_CO-3383_5PR__000001_IP186DJ,0,0,
Country Vision,OP_5JR_13690__000001_IP139AN,OPT,11a Market Hill,,Framlingham,Suffolk,,IP13 9AN,Tel: 01728 621250, - ,,,3 ratings Rate it yourself - /Services/opticians/LeaveReview/DefaultView.aspx?id=OP_5JR_13690__000001_IP139AN,,,
Marshall & Lilley,OP_5JR_3018__000001_IP164EW,OPT,26 High Street,Marshall and Lilley,26 High Street,LEISTON,Suffolk,IP16 4EW,Tel: 01728833114, - ,,,2 ratings Rate it yourself - /Services/opticians/LeaveReview/DefaultView.aspx?id=OP_5JR_3018__000001_IP164EW,,,
Jeffery & Associates,OP_5G1_9719__000001_IP209BE,OPT,10 Old Market Place,,Harleston,,,IP20 9BE,Tel: 01379 853494, - ,,,No ratings yet Rate it yourself - /Services/opticians/LeaveReview/DefaultView.aspx?id=OP_5G1_9719__000001_IP209BE,0,0,
Cecil C Amey Ltd,OP_5G1_8186__000001_IP209AS,OPT,,33b The Thoroughfare,,Harleston,Norfolk,IP20 9AS,Tel: 01379 853504, - ,,,No ratings yet Rate it yourself - /Services/opticians/LeaveReview/DefaultView.aspx?id=OP_5G1_8186__000001_IP209AS,0,0,
Martin Storey Opticians,TP90M,OPT,,3 Upper Olland Street,,Bungay,,NR35 1BD,, - ,,,No ratings yet Rate it yourself - /Services/opticians/LeaveReview/DefaultView.aspx?id=TP90M,0,0,
Specs Express Ltd,OP_5JV_4236__000001_NR351AW,OPT,8 Market Place,Bungay,Suffolk,,,NR35 1AW,Tel: 01986 896022, - ,,,No ratings yet Rate it yourself - /Services/opticians/LeaveReview/DefaultView.aspx?id=OP_5JV_4236__000001_NR351AW,0,0,
P G Sergeant Opticians,OP_5JV_4229__000001_NR349TA,OPT,8/10 Blyburgate,Beccles,Suffolk,,,NR34 9TA,Tel: 01502 713227, - ,,,No ratings yet Rate it yourself - /Services/opticians/LeaveReview/DefaultView.aspx?id=OP_5JV_4229__000001_NR349TA,0,0,
Observatory Opticians,OP_CO-3383(2)-5PR__000001_NR349HJ,OPT,1 Smallgate,,,Beccles,Suffolk,NR34 9AB,Tel: 01502 713370, - ,,,1 rating Rate it yourself - /Services/opticians/LeaveReview/DefaultView.aspx?id=OP_CO-3383(2)-5PR__000001_NR349HJ,,,
Beccles Specsavers Ltd,K6T9E,OPT,,Unit 2a The Walk,,Beccles,Suffolk,NR34 9AJ,Tel: 01502 440609, - ,,,No ratings yet Rate it yourself - /Services/opticians/LeaveReview/DefaultView.aspx?id=K6T9E,0,0,
Martin Storey Opticians,OPT_NR349AY__000001_NR349AY,OPT,82 Northgate,,Beccles,Suffolk,,NR34 9AY,Tel: 01502 471915, - ,,,No ratings yet Rate it yourself - /Services/opticians/LeaveReview/DefaultView.aspx?id=OPT_NR349AY__000001_NR349AY,0,0,
A S Pennington,OP_5G1_6837__000001_NR146NA,OPT,25 Bridge Street,,Loddon,,,NR14 6NA,Tel: 01508 520783, - ,,,No ratings yet Rate it yourself - /Services/opticians/LeaveReview/DefaultView.aspx?id=OP_5G1_6837__000001_NR146NA,0,0,
M Shepherd Optometrist ,V7C4R,OPT,,"1 Cooper Court, The Street",Longstratton,Norfolk,,NR15 2XG,Tel: 01508 532 669, - ,,,No ratings yet Rate it yourself - /Services/opticians/LeaveReview/DefaultView.aspx?id=V7C4R,0,0,
Specsavers Opticians,060409__000001_IP224AD,OPT,9-11 Mere Street,,Diss,Norfolk,,IP22 4AD,Tel: 01379 658490, - ,,,No ratings yet Rate it yourself - /Services/opticians/LeaveReview/DefaultView.aspx?id=060409__000001_IP224AD,0,0,
Scrivens Optical Hearing,OP_5G1_37__000001_IP224AG,OPT,45 Mere Street,,,Diss,Norfolk,IP22 4AG,Tel: 01379 642739, - ,,,No ratings yet Rate it yourself - /Services/opticians/LeaveReview/DefaultView.aspx?id=OP_5G1_37__000001_IP224AG,0,0,
A Stodel Optometrist,OP_5G1_7182__000002_IP223LB,OPT,15 Market Place,,Diss,Norfolk,,IP22 4AB,Tel: 01379 642598, - ,,,No ratings yet Rate it yourself - /Services/opticians/LeaveReview/DefaultView.aspx?id=OP_5G1_7182__000002_IP223LB,0,0,
Clear Vision Opticians Ltd,OP_5JV_7592__000001_NR322AA,OPT,2 Bevan Street East,Lowestoft,Suffolk,,,NR32 2AA,Tel: 01502 515143, - ,,,No ratings yet Rate it yourself - /Services/opticians/LeaveReview/DefaultView.aspx?id=OP_5JV_7592__000001_NR322AA,0,0,
Adkins Opticians,OP_5G1_7337__000001_IP223JZ,OPT,,2 Market Hill,,Diss,Norfolk,IP22 4JZ,Tel: 01379 650899, - ,,,1 rating Rate it yourself - /Services/opticians/LeaveReview/DefaultView.aspx?id=OP_5G1_7337__000001_IP223JZ,,,
A S Pennington Opticians,OP_5JV_4227__000001_NR321HB,OPT,129 Bevan Street East,Lowestoft,Suffolk,,,NR32 2AQ,Tel: 01502 574079, - ,,,3 ratings Rate it yourself - /Services/opticians/LeaveReview/DefaultView.aspx?id=OP_5JV_4227__000001_NR321HB,,,
Boots-Lowestoft,OP_5JV_8003__000001_NR321EP,OPT,46 London Road North,,,Lowestoft,Suffolk,NR32 1EP,Tel: 01502 573511, - ,,,2 ratings Rate it yourself - /Services/opticians/LeaveReview/DefaultView.aspx?id=OP_5JV_8003__000001_NR321EP,,,
Specsavers Opticians,OP_5JV_13697__000002_NR321LX,OPT,101 London Road North,Lowestoft,,Suffolk,,NR32 1LX,Tel: 01502 580500, - ,,,No ratings yet Rate it yourself - /Services/opticians/LeaveReview/DefaultView.aspx?id=OP_5JV_13697__000002_NR321LX,0,0,
Lowestoft Vision Express Ltd,OP_5JV_13698__000001_NR321HA,OPT,110 London Road North,,,Lowestoft,Suffolk,NR32 1HA,Tel: 01502 584428, - ,,,No ratings yet Rate it yourself - /Services/opticians/LeaveReview/DefaultView.aspx?id=OP_5JV_13698__000001_NR321HA,0,0,
Templemans Opticians (Home Visits),5P1/OPH1__000002_SS67QA,OPT,,25 Easton Road,Sutton Heath,Woodbridge,,IP12 3TD,Tel: 01268 777729, - ,,,1 rating Rate it yourself - /Services/opticians/LeaveReview/DefaultView.aspx?id=5P1/OPH1__000002_SS67QA,,,
Eyepractice Limited,OP_5JR_1253__000002_IP121AH,OPT,77 Thoroughfare,,,Woodbridge,Suffolk,IP12 1AH,Tel: 01394 382718, - ,,,No ratings yet Rate it yourself - /Services/opticians/LeaveReview/DefaultView.aspx?id=OP_5JR_1253__000002_IP121AH,0,0,no
Burrows & Sunaway,OP_5JR_14932__000001_IP121AQ,OPT,16 The Thoroughfare,,Woodbridge,Suffolk,,IP12 1AQ,Tel: 01394 383211, - ,,,1 rating Rate it yourself - /Services/opticians/LeaveReview/DefaultView.aspx?id=OP_5JR_14932__000001_IP121AQ,,,
Steven Dewberry Opticians,OP_5JR_3328__000001_IP121BX,OPT,Quay Street,,Woodbridge,Suffolk,,IP12 1BX,Tel: 01394 385130, - ,,,No ratings yet Rate it yourself - /Services/opticians/LeaveReview/DefaultView.aspx?id=OP_5JR_3328__000001_IP121BX,0,0,
Abbott & Murdoch Opticians,OP_5G1_13933__000002_NR147JR,OPT,4 The Street,,Poringland,NORWICH,Norfolk,NR14 7JR,Tel: 01508 494670, - ,,,1 rating Rate it yourself - /Services/opticians/LeaveReview/DefaultView.aspx?id=OP_5G1_13933__000002_NR147JR,,,
D Kneale Opticians,OP_5GT_7392__000002_NR316AD,OPT,136 Bells Road,Gorleston,Great Yarmouth,Norfolk,,NR31 6AG,Tel: 01493 655111, - ,,,No ratings yet Rate it yourself - /Services/opticians/LeaveReview/DefaultView.aspx?id=OP_5GT_7392__000002_NR316AD,0,0,
T W A Schoenherr of Gorleston,OP_5GT_13932__000001_NR316QT,OPT,35 Baker Street,,Gorleston,,,NR31 6QT,Tel: 01493 601941, - ,,,3 ratings Rate it yourself - /Services/opticians/LeaveReview/DefaultView.aspx?id=OP_5GT_13932__000001_NR316QT,,,
The Spectacle Centre ,45669__000001_NR316RE,OPT,117 High Street,,Gorleston-on-Sea,Norfolk,,NR31 6RE,Tel: 01493 442743, - ,,,No ratings yet Rate it yourself - /Services/opticians/LeaveReview/DefaultView.aspx?id=45669__000001_NR316RE,0,0,
Paxon & Thomas (Brundall) Ltd,OP_5JL_5192__000002_NR135LP,OPT,116 The Street,Brundall,Norwich,,,NR13 5LP,Tel: 01603 713287, - ,,,No ratings yet Rate it yourself - /Services/opticians/LeaveReview/DefaultView.aspx?id=OP_5JL_5192__000002_NR135LP,0,0,
Needham Market Opticians,OP-01-9208-5PT__000001_IP68DG,OPT,102 High Street,,Needham Market,Suffolk,,IP6 8DG,Tel: 01449 723180, - ,,,No ratings yet Rate it yourself - /Services/opticians/LeaveReview/DefaultView.aspx?id=OP-01-9208-5PT__000001_IP68DG,0,0,
Primesight Opticians,OP_5JQ_14007__000002_IP44EL,OPT,432 Woodbridge Road,,Ipswich,Suffolk,,IP4 4EL,Tel: 01473 724158, - ,,,No ratings yet Rate it yourself - /Services/opticians/LeaveReview/DefaultView.aspx?id=OP_5JQ_14007__000002_IP44EL,0,0,
Healthcall Optical Services Ltd,OP_5G1_6799__000001_NR46XB,OPT,Suite 5,Cringleford Business Centre,Intwood,,,NR4 6XB,Tel: 01603 455197, - ,,,No ratings yet Rate it yourself - /Services/opticians/LeaveReview/DefaultView.aspx?id=OP_5G1_6799__000001_NR46XB,0,0,
Coe  Costa & Moore,OP_5A2_5284__000001_NR46NW,OPT,Eaton Centre -  Church Lane,Eaton,Norwich,,,NR4 6NW,Tel: 01603 501260, - ,,,2 ratings Rate it yourself - /Services/opticians/LeaveReview/DefaultView.aspx?id=OP_5A2_5284__000001_NR46NW,,,
Scrivens Optical Hearing,OP_5A2_10746__000001_NR13AE,OPT,231 Queens Road,,Norwich,Norfolk,,NR1 3AE,Tel: 0121 456 8700, - ,,,No ratings yet Rate it yourself - /Services/opticians/LeaveReview/DefaultView.aspx?id=OP_5A2_10746__000001_NR13AE,0,0,
Peel & Gudgin Opticians,OP_5JT_7588__000001_IP141EF,OPT,11 Station Road West,,Stowmarket,Suffolk,,IP14 1EF,Tel: 01449 612984, - ,,,No ratings yet Rate it yourself - /Services/opticians/LeaveReview/DefaultView.aspx?id=OP_5JT_7588__000001_IP141EF,0,0,
Specsavers,OP_5JT_14932__000002_IP141AH,OPT,11 Ipswich Street,,Stowmarket,Suffolk,,IP14 1AH,Tel: 01449 618280, - ,,,No ratings yet Rate it yourself - /Services/opticians/LeaveReview/DefaultView.aspx?id=OP_5JT_14932__000002_IP141AH,0,0,
F G Brown & Associates Ltd,OP_5JT_9924__000001_IP141BB,OPT,Denmark House,41 Bury Street,,Stowmarket,Suffolk,IP14 1HA,Tel: 01449 612812, - ,,,No ratings yet Rate it yourself - /Services/opticians/LeaveReview/DefaultView.aspx?id=OP_5JT_9924__000001_IP141BB,0,0,yes
Asda Opticians,OPT_IP14 1DE,OPT,,MEADOW CENTRE,WILKS WAY,STOWMARKET,,IP14 1DE,Tel: 01449 763083, - ,,,2 ratings Rate it yourself - /Services/opticians/LeaveReview/DefaultView.aspx?id=OPT_IP14 1DE,,,
Tesco Opticians,GY00001__000001_NR316DW,OPT,Pasteur Road,Southtown,Great Yarmouth,Norfolk,,NR31 0DW,Tel: 01493 631466, - ,,,No ratings yet Rate it yourself - /Services/opticians/LeaveReview/DefaultView.aspx?id=GY00001__000001_NR316DW,0,0,
ASDA Opticians,OP_5JQ_14008__000002_IP15PD,OPT,Asda Stores Ltd,Goddard Road,,Ipswich,,IP1 5PD,Tel: 01473 464723, - ,,,No ratings yet Rate it yourself - /Services/opticians/LeaveReview/DefaultView.aspx?id=OP_5JQ_14008__000002_IP15PD,0,0,
A.S Pennington,OP_5JL_4228__000001_NR133QX,OPT,1 Calthorpe Cottages,The Green,Acle,Norfolk,,NR13 3QX,Tel: 01493 750212, - ,,,No ratings yet Rate it yourself - /Services/opticians/LeaveReview/DefaultView.aspx?id=OP_5JL_4228__000001_NR133QX,0,0,
Oculus Contact Lens Centre,OP_5A2_7541__000001_NR13LY,OPT,16 All Saints Green,,,Norwich,,NR1 3NA,Tel: 01603 763764, - ,,,No ratings yet Rate it yourself - /Services/opticians/LeaveReview/DefaultView.aspx?id=OP_5A2_7541__000001_NR13LY,0,0,
Vision Express,OP_5A2_12637__000002_NR13DD,OPT,71 Castle Mall,White Lion Gate,Norwich,,,NR1 3DD,Tel: 01603 667733, - ,,,1 rating Rate it yourself - /Services/opticians/LeaveReview/DefaultView.aspx?id=OP_5A2_12637__000002_NR13DD,,,
Boots-Norwich - Castle Mall (in Boots UK),OP_5A2_10033__000003_NR13DD,OPT,19 Castle Mall,,,Norwich,Norfolk,NR1 3DD,Tel: 01603 763397, - ,,,4 ratings Rate it yourself - /Services/opticians/LeaveReview/DefaultView.aspx?id=OP_5A2_10033__000003_NR13DD,,,
Moss & Leakey Opticians,OP_5A2_14969__000001_NR13JZ,OPT,1 Timberhill,,Norwich,,,NR1 3JZ,Tel: 01603 661001, - ,,,No ratings yet Rate it yourself - /Services/opticians/LeaveReview/DefaultView.aspx?id=OP_5A2_14969__000001_NR13JZ,0,0,
M&S Opticians,X8B6M,OPT,M&S,Rampant Horse Street,,Norwich,Norfolk,NR2 1QR,Tel: 01603576344, - ,,,No ratings yet Rate it yourself - /Services/opticians/LeaveReview/DefaultView.aspx?id=X8B6M,0,0,
R H Jeffery & Associates,OP_5JQ_4554__000001_IP13QU,OPT,28 Anglesea Road,,Ipswich,Suffolk,,IP1 3PP,Tel: 01473 210672, - ,,,No ratings yet Rate it yourself - /Services/opticians/LeaveReview/DefaultView.aspx?id=OP_5JQ_4554__000001_IP13QU,0,0,
Eyecare Opticians,OP_5JQ_2629__000001_IP14HA,OPT,341 Norwich Road,,Ipswich,Suffolk,,IP1 4HA,Tel: 01473 747000, - ,,,No ratings yet Rate it yourself - /Services/opticians/LeaveReview/DefaultView.aspx?id=OP_5JQ_2629__000001_IP14HA,0,0,
Kite Opticians,OP_5JQ_3066__000001_IP13LU,OPT,38 Berners Street,,,Ipswich,Suffolk,IP1 3LU,Tel: 01473 255250, - ,,,No ratings yet Rate it yourself - /Services/opticians/LeaveReview/DefaultView.aspx?id=OP_5JQ_3066__000001_IP13LU,0,0,
A J Rawling,OP_5JQ_13693__000001_IP13DB,OPT,14 Northgate Street,,Ipswich,Suffolk,,IP1 3DB,Tel: 01473 252026, - ,,,1 rating Rate it yourself - /Services/opticians/LeaveReview/DefaultView.aspx?id=OP_5JQ_13693__000001_IP13DB,,,no
Vision Express,OP_5JQ_13694__000001_IP13BB,OPT,3 Tower Ramparts,Tavern Street,Ipswich,,,IP1 3DH,Tel: 01473 281199, - ,,,No ratings yet Rate it yourself - /Services/opticians/LeaveReview/DefaultView.aspx?id=OP_5JQ_13694__000001_IP13BB,0,0,
Specs Express Ltd,OP_5GT_4237__000002_NR302PA,OPT,163 King Street,,Great Yarmouth,Norfolk,,NR30 2PA,Tel: 01493 843014, - ,,,No ratings yet Rate it yourself - /Services/opticians/LeaveReview/DefaultView.aspx?id=OP_5GT_4237__000002_NR302PA,0,0,
Specsavers Opticians,OP_5A2_6933__000001_NR21PX,OPT,9 White Lion Street,,Norwich,,,NR2 1PX,Tel: 01603 610777, - ,,,No ratings yet Rate it yourself - /Services/opticians/LeaveReview/DefaultView.aspx?id=OP_5A2_6933__000001_NR21PX,0,0,
Norfolk Ophthalmics Ltd,OPTICIAN_10092013,OPT,MOBILE OPTICIAN,26 Cambridge Street,,Norwich,Norfolk,NR2 2BB,Tel: 01603 469572, - ,,,1 rating Rate it yourself - /Services/opticians/LeaveReview/DefaultView.aspx?id=OPTICIAN_10092013,,,
Armstrong & North Ltd,01-17721,OPT,,36 Carr Street,,Ipswich,,IP4 1EN,Tel: 01473 226009, - ,,,No ratings yet Rate it yourself - /Services/opticians/LeaveReview/DefaultView.aspx?id=01-17721,0,0,
Optical Express,NR2 1QD_88888,OPT,1 Haymarket,,,Norwich,Norfolk,NR2 1QD,Tel: 0800 023 2020, - ,,,5 ratings Rate it yourself - /Services/opticians/LeaveReview/DefaultView.aspx?id=NR2 1QD_88888,,,
The Eye Clinic,OP_5A2_14968__000001_NR21QD,OPT,1 Haymarket,,Norwich,,,NR2 1QD,Tel: 0800 783 5555, - ,,,No ratings yet Rate it yourself - /Services/opticians/LeaveReview/DefaultView.aspx?id=OP_5A2_14968__000001_NR21QD,0,0,
Specs Express Ltd,OP_5GT_4230__000001_NR302NU,OPT,15-18 Victoria Arcade,,Great Yarmouth,Norfolk,,NR30 2NU,Tel: 01493 842241, - ,,,No ratings yet Rate it yourself - /Services/opticians/LeaveReview/DefaultView.aspx?id=OP_5GT_4230__000001_NR302NU,0,0,
Eyedeal Opticians,OL_22/5/2006_5PR__000001_IP41EJ,OPT,20 Carr Street,,Ipswich,Suffolk,,IP4 1EJ,Tel: 01473 251702, - ,,,No ratings yet Rate it yourself - /Services/opticians/LeaveReview/DefaultView.aspx?id=OL_22/5/2006_5PR__000001_IP41EJ,0,0,
Coleman Opticians ,OP_5GT_9983__000001_NR301RR,OPT,35 Regent Street,,Great Yarmouth,Norfolk,Norfolk,NR30 1RR,Tel: 01493 843937, - ,,,No ratings yet Rate it yourself - /Services/opticians/LeaveReview/DefaultView.aspx?id=OP_5GT_9983__000001_NR301RR,0,0,
Cecil C Amey Ltd,OP_5A2_3107__000001_NR21QH,OPT,22a Haymarket,,Norwich,Norfolk,,NR2 1QH,Tel: 01603 626324, - ,,,1 rating Rate it yourself - /Services/opticians/LeaveReview/DefaultView.aspx?id=OP_5A2_3107__000001_NR21QH,,,
Boots-Ipswich - Upper Brook St,OP_5JQ_10211__000001_IP41EE,OPT,16 Upper Brook Street,,,Ipswich,Suffolk,IP4 1EE,Tel: 01473 252 359, - ,,,No ratings yet Rate it yourself - /Services/opticians/LeaveReview/DefaultView.aspx?id=OP_5JQ_10211__000001_IP41EE,0,0,
Specsavers Opticians,OP_5JQ_6836__000001_IP13AW,OPT,46a Tavern Street,,Ipswich,Suffolk,,IP1 3AW,Tel: 01473 210333, - ,,,4 ratings Rate it yourself - /Services/opticians/LeaveReview/DefaultView.aspx?id=OP_5JQ_6836__000001_IP13AW,,,
Boots-Ipswich - Tavern St,OP_5JQ_8836__000002_IP13AA,OPT,5 Tavern Street,,,Ipswich,Suffolk,IP1 3AA,Tel: 01473 258256, - ,,,1 rating Rate it yourself - /Services/opticians/LeaveReview/DefaultView.aspx?id=OP_5JQ_8836__000002_IP13AA,,,
Dipple & Conway Opticians,OP_5A2_10167__000002_NR21PB,OPT,19 Castle Street,,Norwich,.,,NR2 1PB,Tel: 01603 626750, - ,,,No ratings yet Rate it yourself - /Services/opticians/LeaveReview/DefaultView.aspx?id=OP_5A2_10167__000002_NR21PB,0,0,
Dipple & Conway (Norwich) Ltd,OP_5JT_10113__000001_IP141AD,OPT,,19 Castle Street,Norwich,Norfolk,,NR2 1PB,Tel: 01603 626750, - ,,,1 rating Rate it yourself - /Services/opticians/LeaveReview/DefaultView.aspx?id=OP_5JT_10113__000001_IP141AD,,,
Boots-Norwich - Castle St,OP_5A2_7356__000001_NR21PD,OPT,4c Castle Street,,,Norwich,Norfolk,NR2 1PD,Tel: 01603 620 221, - ,,,No ratings yet Rate it yourself - /Services/opticians/LeaveReview/DefaultView.aspx?id=OP_5A2_7356__000001_NR21PD,0,0,
Castle Street Optometry,OP_5A2_5649__000001_NR13QD,OPT,4d Castle Street,,,Norwich,,NR2 1PD,Tel: 01603 618101, - ,,,No ratings yet Rate it yourself - /Services/opticians/LeaveReview/DefaultView.aspx?id=OP_5A2_5649__000001_NR13QD,0,0,
H E Kersey,OP_5JQ_4378__000001_IP41BA,OPT,22 Tacket Street,,Ipswich,Suffolk,,IP4 1BA,Tel: 01473 406567, - ,,,No ratings yet Rate it yourself - /Services/opticians/LeaveReview/DefaultView.aspx?id=OP_5JQ_4378__000001_IP41BA,0,0,
Paxon & Thomas (Norwich) Ltd,OP_5A2_469__000001_NR13DH,OPT,20 Castle Meadow,,,Norwich,,NR1 3DH,Tel: 01603 624500, - ,,,No ratings yet Rate it yourself - /Services/opticians/LeaveReview/DefaultView.aspx?id=OP_5A2_469__000001_NR13DH,0,0,
Boots-Great Yarmouth,OP_5GT_11574__000003_NR302AX,OPT,3 Market Gates Shopping Centre,,Great Yarmouth,Norfolk,,NR30 2AX,Tel: 01493 857377, - ,,,No ratings yet Rate it yourself - /Services/opticians/LeaveReview/DefaultView.aspx?id=OP_5GT_11574__000003_NR302AX,0,0,
Specsavers Opticians,OP_5GT_5056__000001_NR301LY,OPT,18 Market Place,,Great Yarmouth,Norfolk,,NR30 1LY,Tel: 01493 332255, - ,,,No ratings yet Rate it yourself - /Services/opticians/LeaveReview/DefaultView.aspx?id=OP_5GT_5056__000001_NR301LY,0,0,
Optical Express,IP1 1SW_11111,OPT,Clydesdale House (3rd floor),,,Ipswich,Suffolk,IP1 1SW,Tel: 0800 023 2020, - ,,,No ratings yet Rate it yourself - /Services/opticians/LeaveReview/DefaultView.aspx?id=IP1 1SW_11111,0,0,
Observatory Opticians,OP_5JQ_3639__000001_IP11SS,OPT,Observatory the Opticians,8 Queen Street,,Ipswich,Suffolk,IP1 1SS,Tel: 01473 252595, - ,,,3 ratings Rate it yourself - /Services/opticians/LeaveReview/DefaultView.aspx?id=OP_5JQ_3639__000001_IP11SS,,,
Tesco Opticians Ipswich,CO-1998_24092015,OPT,,"42 London Road, Copdock Interchange",,Ipswich,,IP1 2HB,, - ,,,No ratings yet Rate it yourself - /Services/opticians/LeaveReview/DefaultView.aspx?id=CO-1998_24092015,0,0,
Scrivens Opticians & Hearing Care,OP_5A2_3172__000001_NR14AP,OPT,195 Plumstead Road,195 Plumstead Road,Norwich,Norwich,,NR1 4AB,Tel: 01603 432804, - ,,,No ratings yet Rate it yourself - /Services/opticians/LeaveReview/DefaultView.aspx?id=OP_5A2_3172__000001_NR14AP,0,0,
D R Grey (Norwich) Ltd,OP_5A2_11851__000001_NR21QF,OPT,Wensum House,10A Wensum Street,,Norwich,Norfolk,NR3 1HR,Tel: 01603 623696, - ,,,No ratings yet Rate it yourself - /Services/opticians/LeaveReview/DefaultView.aspx?id=OP_5A2_11851__000001_NR21QF,0,0,no
Scrivens Opticians & Hearing Care,OP_5A2_7706__000001_NR31HU,OPT,87 Upper St Giles Street,87 Upper St Giles Street,Norwich,Norwich,,NR2 1AB,Tel: 01603 629839, - ,,,No ratings yet Rate it yourself - /Services/opticians/LeaveReview/DefaultView.aspx?id=OP_5A2_7706__000001_NR31HU,0,0,
Asda Opticians,12345__000002_NR301SF,OPT,,Acle New Road,,Great Yarmouth,,NR30 1SF,Tel: 01493 336812, - ,,,No ratings yet Rate it yourself - /Services/opticians/LeaveReview/DefaultView.aspx?id=12345__000002_NR301SF,0,0,
The Spectacle Centre,OP_5GT_13980__000001_NR301BG,OPT,226 Northgate Street,,Great Yarmouth,Norfolk,,NR30 1BG,Tel: 01493 844545, - ,,,No ratings yet Rate it yourself - /Services/opticians/LeaveReview/DefaultView.aspx?id=OP_5GT_13980__000001_NR301BG,0,0,
Cecil C Amey Ltd,OP_5G1_3108__000002_NR180BB,OPT,,10 Market Place,,Wymondham,Norfolk,NR18 0AQ,Tel: 01953 605181, - ,,,No ratings yet Rate it yourself - /Services/opticians/LeaveReview/DefaultView.aspx?id=OP_5G1_3108__000002_NR180BB,0,0,
Coleman Opticians,OP_5A2_11259__000002_NR33DH,OPT,7-11 St. Augustine's Street,,Norwich,Norfolk,,NR3 3DH,Tel: 01603 624564, - ,,,9 ratings Rate it yourself - /Services/opticians/LeaveReview/DefaultView.aspx?id=OP_5A2_11259__000002_NR33DH,,,
Cecil C Amey Ltd,OP_5G1_473__000003_NR172AH,OPT,11 Church Street,,Attleborough,,,NR17 2AH,Tel: 01953 453109, - ,,,No ratings yet Rate it yourself - /Services/opticians/LeaveReview/DefaultView.aspx?id=OP_5G1_473__000003_NR172AH,0,0,
Martin Christopher Opticians,OP_5G1_9850__000002_NR172AH,OPT,Church Street,,Attleborough,Norfolk,,NR17 2AH,Tel: 01953 452564, - ,,,No ratings yet Rate it yourself - /Services/opticians/LeaveReview/DefaultView.aspx?id=OP_5G1_9850__000002_NR172AH,0,0,
Mobile Eye Clinic,OP_NR32RB_30101,OPT,,115 Copenhagen Way,,Norwich,Norfolk,NR3 2RB,Tel: 01603 402794, - ,,,No ratings yet Rate it yourself - /Services/opticians/LeaveReview/DefaultView.aspx?id=OP_NR32RB_30101,0,0,
Spectacles at Home,OP_NR136PN_88758,OPT,The Surgery,2 Newman Road,Rackheath,Norwich,Norfolk,NR13 6PN,Tel: 01603 720934, - ,,,No ratings yet Rate it yourself - /Services/opticians/LeaveReview/DefaultView.aspx?id=OP_NR136PN_88758,0,0,
Centenary Opticians,E4C7U,OPT,,3 Bowthorpe Centre,Wendene,Norwich,Norfolk,NR5 9HA,Tel: 01603 945611, - ,,,No ratings yet Rate it yourself - /Services/opticians/LeaveReview/DefaultView.aspx?id=E4C7U,0,0,
Scarborows Opticians,OP_5JR_7852__000001_IP117DB,OPT,,163 Hamilton Road,,Felixstowe,,IP11 7DR,Tel: 01394 284581, - ,,,No ratings yet Rate it yourself - /Services/opticians/LeaveReview/DefaultView.aspx?id=OP_5JR_7852__000001_IP117DB,0,0,
Morse Opticians,78965__000001_NR305DN,OPT,14-16 Tan Lane,,Caister-on-Sea,Great Yarmouth,Norfolk,NR30 5DN,Tel: 01493 720977, - ,,,1 rating Rate it yourself - /Services/opticians/LeaveReview/DefaultView.aspx?id=78965__000001_NR305DN,,,
Rayner Professional Services Ltd,OP_5JR_7503__000001_IP117BL,OPT,137 Hamilton Road,,Felixstowe,Suffolk,,IP11 7BL,Tel: 01394 283026, - ,,,No ratings yet Rate it yourself - /Services/opticians/LeaveReview/DefaultView.aspx?id=OP_5JR_7503__000001_IP117BL,0,0,
Specsavers,OP_5JR_14878__000002_IP117AD,OPT,90 Hamilton Road,,Felixstowe,Suffolk,,IP11 7AD,Tel: 01394 288080, - ,,,No ratings yet Rate it yourself - /Services/opticians/LeaveReview/DefaultView.aspx?id=OP_5JR_14878__000002_IP117AD,0,0,
"Coe, Costa & Moore",OP_5JL_11428__000001_NR66XW,OPT,111 Cromer Road,,Norwich,Norfolk,,NR6 6XW,Tel: 01603 484181, - ,,,No ratings yet Rate it yourself - /Services/opticians/LeaveReview/DefaultView.aspx?id=OP_5JL_11428__000001_NR66XW,0,0,
Steven Dewberry Opticians,OP_5JR_8258__000001_IP117AN,OPT,30 Hamilton Road,,Felixstowe,Suffolk,,IP11 7AN,Tel: 01394 670177, - ,,,No ratings yet Rate it yourself - /Services/opticians/LeaveReview/DefaultView.aspx?id=OP_5JR_8258__000001_IP117AN,0,0,
Briscoe & Briscoe Opticians,OP_5JT_13702__000001_IP91LX,OPT,"Dorian House",The Street,Shotley,Suffolk,,IP9 1LX,Tel: 01473 788772, - ,,,No ratings yet Rate it yourself - /Services/opticians/LeaveReview/DefaultView.aspx?id=OP_5JT_13702__000001_IP91LX,0,0,