Organisation Name,NACS Code,Organisation Type,Address1,Address2,Address3,Address4,Address5,PostCode,Telephone Number,Opening time,Value  (Opening time),Banding Classification  (Opening time),NHS.UK users rating,Value  (NHS.UK users rating),Banding Classification  (NHS.UK users rating),Car parking (Is there car parking at this organisation?)
Boots-Bournemouth - Wallisdown Rd,OP_5CE_13054__000001_BH118PN,OPT,288a Wallisdown Road,Wallisdown,,Bournemouth,Dorset,BH11 8PN,Tel: 01202 515024, - ,,,2 ratings Rate it yourself - /Services/opticians/LeaveReview/DefaultView.aspx?id=OP_5CE_13054__000001_BH118PN,,,
Spesavers - Sainsburys,,OPT,,Alder Park,4 Alder Road,Poole,Dorset,BH12 4BA,Tel: 01202403273, - ,,,N/A - Data not available,,,
Onsite Eyecare Ltd,CT005__000001_BH105AS,OPT,20 Barnes Road,,Bournemouth,Dorset,,BH10 5AS,Tel: 01202 511249, - ,,,No ratings yet Rate it yourself - /Services/opticians/LeaveReview/DefaultView.aspx?id=CT005__000001_BH105AS,0,0,
Tesco Stores Ltd,OL-CO1998-5QN__000002_BH124NX,OPT,Yarrow Road,Mannings Heath,Poole,Dorset,,BH12 4NX,Tel: 01202 457438, - ,,,No ratings yet Rate it yourself - /Services/opticians/LeaveReview/DefaultView.aspx?id=OL-CO1998-5QN__000002_BH124NX,0,0,
K C Opticians ,OP_BH107AZ_85049,OPT,,1553 Wimborne Road,Kinson,BOURNEMOUTH,Dorset,BH10 7AZ,Tel: 01202 571601, - ,,,No ratings yet Rate it yourself - /Services/opticians/LeaveReview/DefaultView.aspx?id=OP_BH107AZ_85049,0,0,
Specsavers Optician,01-25615,OPT,,411 Wimborne Road,,Dorset,,BH9 2AJ,Tel: 01202 635890, - ,,,No ratings yet Rate it yourself - /Services/opticians/LeaveReview/DefaultView.aspx?id=01-25615,0,0,
Kelly Eyecare Ltd,CO-2697__000002_BH92AQ,OPT,369 Wimborne Road,Winton,,BOURNEMOUTH,Dorset,BH9 2AQ,Tel: 01202 510102, - ,,,No ratings yet Rate it yourself - /Services/opticians/LeaveReview/DefaultView.aspx?id=CO-2697__000002_BH92AQ,0,0,
Scrivens Ltd,OP_5CE_1815__000001_BH92EN,OPT,,373 Wimborne Road,,Winton,Dorset,BH9 2AQ,Tel: 01202 529700, - ,,,No ratings yet Rate it yourself - /Services/opticians/LeaveReview/DefaultView.aspx?id=OP_5CE_1815__000001_BH92EN,0,0,
Boots-Bournemouth - Winton Rd,CO-3459__000001_BH92HH,OPT,,355A Wimborne Road,Winton,BOURNEMOUTH,Dorset,BH9 2AD,Tel: 01202 516924, - ,,,2 ratings Rate it yourself - /Services/opticians/LeaveReview/DefaultView.aspx?id=CO-3459__000001_BH92HH,,,
Trew Eyecare Limited,OP_5KV_3373__000001_BH149DS,OPT,255 Ashley Road,Parkstone,Poole,Poole,Dorset,BH14 9DS,Tel: 01202 742003, - ,,,No ratings yet Rate it yourself - /Services/opticians/LeaveReview/DefaultView.aspx?id=OP_5KV_3373__000001_BH149DS,0,0,
Kelly Eyecare (Parkstone) Limited,OP_5KV_8173__000002_BH149DS,OPT,279 Ashley Road,Parkstone,,POOLE,Dorset,BH14 9DS,Tel: 01202 733611, - ,,,1 rating Rate it yourself - /Services/opticians/LeaveReview/DefaultView.aspx?id=OP_5KV_8173__000002_BH149DS,,,
Kelly Eyecare (Parkstone) Limited,OP_5A1_14103__000002_SO403BX,OPT,9 Commercial Road,279 Ashley Road,Totton,Parkstone,,BH14 9DS,Tel: 023 8086 5493, - ,,,1 rating Rate it yourself - /Services/opticians/LeaveReview/DefaultView.aspx?id=OP_5A1_14103__000002_SO403BX,,,
Still & Bedford Ltd,OP_5CE_9449__000001_BH92SG,OPT,,922 Wimborne Road,,Bournemouth,Dorset,BH9 2DH,Tel: 01202 529414, - ,,,No ratings yet Rate it yourself - /Services/opticians/LeaveReview/DefaultView.aspx?id=OP_5CE_9449__000001_BH92SG,0,0,yes
Moordown Eyecare,OP_5CE_13760__000001_BH91BN,OPT,,922 Wimborne Road,Moordown,BOURNEMOUTH,Dorset,BH9 2DH,Tel: 01202 530500, - ,,,1 rating Rate it yourself - /Services/opticians/LeaveReview/DefaultView.aspx?id=OP_5CE_13760__000001_BH91BN,,,
R T Knight EyecareLtd,OP_5KV_5765__000001_BH49EF,OPT,118 Poole Road,118 Poole Road,Bournemouth,Bournemouth,,BH4 9EF,Tel: 01202 764439, - ,,,No ratings yet Rate it yourself - /Services/opticians/LeaveReview/DefaultView.aspx?id=OP_5KV_5765__000001_BH49EF,0,0,
Parkstone Eyecare,OP_5KV_5415__000001_BH140AA,OPT,434 Ashley Road,Parkstone,,POOLE,Dorset,BH14 0AA,Tel: 01202 741963, - ,,,1 rating Rate it yourself - /Services/opticians/LeaveReview/DefaultView.aspx?id=OP_5KV_5415__000001_BH140AA,,,
Scrivens Ltd,OP_5KV_11124__000002_BH49BB,OPT,,89 Poole Road,,Westbourne,Dorset,BH4 9BB,Tel: 01202 764545, - ,,,No ratings yet Rate it yourself - /Services/opticians/LeaveReview/DefaultView.aspx?id=OP_5KV_11124__000002_BH49BB,0,0,
F P Whiffen Ltd,CO-2538__000002_BH140ES,OPT,2 Bournemouth Road,Lower Parkstone,,POOLE,Dorset,BH14 0ES,Tel: 01202 716661, - ,,,No ratings yet Rate it yourself - /Services/opticians/LeaveReview/DefaultView.aspx?id=CO-2538__000002_BH140ES,0,0,
Optical Express,OP_12345_BH2 6EZ,OPT,Richmond House,Richmond Hill,,Bournemouth,Hampshire,BH2 6EZ,Tel: 0800 023 2020, - ,,,No ratings yet Rate it yourself - /Services/opticians/LeaveReview/DefaultView.aspx?id=OP_12345_BH2 6EZ,0,0,
Vision Express (UK )Ltd,OP_5KV_13763__000001_BH25LP,OPT,46 Commercial Road,,Bournemouth,,,BH2 5LP,Tel: 01202 587524, - ,,,No ratings yet Rate it yourself - /Services/opticians/LeaveReview/DefaultView.aspx?id=OP_5KV_13763__000001_BH25LP,0,0,
Boots-Bournemouth - Commercial Rd,OP_5KV_12701__000002_BH25NL,OPT,18-20 Commercial Road,,Bournemouth,Bournemouth,Dorset,BH2 5NL,Tel: 01202 296687, - ,,,1 rating Rate it yourself - /Services/opticians/LeaveReview/DefaultView.aspx?id=OP_5KV_12701__000002_BH25NL,,,
Optical Express,BH11BL_45678,OPT,,Clarendon Business Centre,,Bristol,,BH1 1BL,, - ,,,No ratings yet Rate it yourself - /Services/opticians/LeaveReview/DefaultView.aspx?id=BH11BL_45678,0,0,
Specsavers Opticians (Bournemouth Visionplus Ltd),OP_5CE_11693__000001_BH11LR,OPT,80 Old Christchurch Road,,Bournemouth,Dorset,,BH1 1LR,Tel: 01202 316111, - ,,,11 ratings Rate it yourself - /Services/opticians/LeaveReview/DefaultView.aspx?id=OP_5CE_11693__000001_BH11LR,,,
Asda Stores Ltd,OP_5CE_14403__000002_BH88DL,OPT,Asda Store,St. Paul's Road,,BOURNEMOUTH,Dorset,BH8 8DL,Tel: 01202 200192, - ,,,No ratings yet Rate it yourself - /Services/opticians/LeaveReview/DefaultView.aspx?id=OP_5CE_14403__000002_BH88DL,0,0,
Parley Optometrists,OP_5FN_391__000002_BH228EB,OPT,127 New Road,West Parley,,FERNDOWN,Dorset,BH22 8EB,Tel: 01202 575759, - ,,,1 rating Rate it yourself - /Services/opticians/LeaveReview/DefaultView.aspx?id=OP_5FN_391__000002_BH228EB,,,yes
Asda Stores Ltd.,OP_5CE_14967__000002_BH89UP,OPT,Castlepoint Centre,Castle Lane West,,Bournemouth,,BH8 9UP,Tel: 01202 844412, - ,,,No ratings yet Rate it yourself - /Services/opticians/LeaveReview/DefaultView.aspx?id=OP_5CE_14967__000002_BH89UP,0,0,
M&S Opticians - Castlepoint,O7K0D,OPT,,"Castlepoint Shopping Centre, Yeomans Way",,Bournemouth,Dorset,BH8 9UL,Tel: 01202 059316, - ,,,3 ratings Rate it yourself - /Services/opticians/LeaveReview/DefaultView.aspx?id=O7K0D,,,
Mobile-Eyes-UK Ltd,CO-3448__000001_BH89NL,OPT,28 Feversham Heights,Feversham Avenue,Bournemouth,Dorset,,BH8 9NL,Tel: 01202 770400, - ,,,No ratings yet Rate it yourself - /Services/opticians/LeaveReview/DefaultView.aspx?id=CO-3448__000001_BH89NL,0,0,
Vision Express (UK) Ltd,OP_5KV_6730__000001_BH151ST,OPT,37-38 Dolphin Shopping Centre,,Poole,,,BH15 1ST,Tel: 01202 661060, - ,,,No ratings yet Rate it yourself - /Services/opticians/LeaveReview/DefaultView.aspx?id=OP_5KV_6730__000001_BH151ST,0,0,
Boots-Poole - Dolphin Centre,OP_5KV_538__000002_BH151SX,OPT,"190-196 High Street, Dolphin Centre",,,Poole,Dorset,BH15 1SX,Tel: 01202 679395, - ,,,3 ratings Rate it yourself - /Services/opticians/LeaveReview/DefaultView.aspx?id=OP_5KV_538__000002_BH151SX,,,
Specsavers Opticians (Boscombe Visionplus Ltd),OP_5CE_3178__000004_BH14BP,OPT,,594-598 Christchurch Road,,BOURNEMOUTH,Dorset,BH1 4BH,Tel: 01202 303307, - ,,,3 ratings Rate it yourself - /Services/opticians/LeaveReview/DefaultView.aspx?id=OP_5CE_3178__000004_BH14BP,,,
S H Harrold (1937) Ltd,OP_5KV_6757__000001_BH151SY,OPT,184c Lower Blandford Road,,Broadstone,Dorset,,BH18 8DP,Tel: 01202 672878, - ,,,No ratings yet Rate it yourself - /Services/opticians/LeaveReview/DefaultView.aspx?id=OP_5KV_6757__000001_BH151SY,0,0,
Specsavers Opticians (Poole Visionplus Ltd),OP_5KV_4516__000001_BH151DF,OPT,,32/34 Kingsland Crescent,,Poole,Dorset,BH15 1TB,Tel: 01202 675789, - ,,,1 rating Rate it yourself - /Services/opticians/LeaveReview/DefaultView.aspx?id=OP_5KV_4516__000001_BH151DF,,,
Scrivens Ltd,OP_5KV_6309__000003_BH188DP,OPT,,169-171 The Broadway,,Broadstone,Dorset,BH18 8DS,Tel: 01202 692859, - ,,,2 ratings Rate it yourself - /Services/opticians/LeaveReview/DefaultView.aspx?id=OP_5KV_6309__000003_BH188DP,,,
Scrivens Ltd,OP_5CE_4954__000003_BH14BP,OPT,,652 Christchurch Road,,Boscombe,Dorset,BH1 4BP,Tel: 01202 396154, - ,,,No ratings yet Rate it yourself - /Services/opticians/LeaveReview/DefaultView.aspx?id=OP_5CE_4954__000003_BH14BP,0,0,
Leightons & Tempany,OP_5KV_646__000001_BH151AU,OPT,,157 High Street,,Poole,Dorset,BH15 1AU,Tel: 01202 678244, - ,,,No ratings yet Rate it yourself - /Services/opticians/LeaveReview/DefaultView.aspx?id=OP_5KV_646__000001_BH151AU,0,0,
Scrivens Ltd,OP_5KV_7844__000001_BH151TB,OPT,,145 High Street,,Poole,Dorset,BH15 1AS,Tel: 0121 456 8700, - ,,,No ratings yet Rate it yourself - /Services/opticians/LeaveReview/DefaultView.aspx?id=OP_5KV_7844__000001_BH151TB,0,0,
Asda Stores Ltd.,CO-2058__000001_BH151JQ,OPT,West Quay Road,,Poole,Dorset,,BH15 1JQ,Tel: 01202 207020, - ,,,No ratings yet Rate it yourself - /Services/opticians/LeaveReview/DefaultView.aspx?id=CO-2058__000001_BH151JQ,0,0,
Underwood Eyecare,OP_5FN_4238__000002_BH229TH,OPT,Underwood Eyecare,7 Pennys Walk,,Ferndown,Dorset,BH22 9TH,Tel: 01202 891955, - ,,,1 rating Rate it yourself - /Services/opticians/LeaveReview/DefaultView.aspx?id=OP_5FN_4238__000002_BH229TH,,,
Henderson's,OP_5FN_13758__000001_BH229HZ,OPT,54 Victoria Road,,Ferndown,Dorset,,BH22 9HZ,Tel: 01202 871711, - ,,,No ratings yet Rate it yourself - /Services/opticians/LeaveReview/DefaultView.aspx?id=OP_5FN_13758__000001_BH229HZ,0,0,
Knight Eyecare,,OPT,,61 Victoria Road,,Ferndown,Dorset,BH22 9HU,Tel: 01202 891 727, - ,,,N/A - Data not available,,,
Still & Bedford,E0E1C,OPT,,61 Victoria Road,Ferndown,Bournemouth,Dorset,BH22 9HU,Tel: 01202 891727, - ,,,No ratings yet Rate it yourself - /Services/opticians/LeaveReview/DefaultView.aspx?id=E0E1C,0,0,
Specsavers Home Visits,00025__000001_BH217SH,OPT,Unit 4a Arena Business Centre,9 Nimrod Way,Ferndown,Dorset,,BH21 7SH,Tel: 01202 862385, - ,,,9 ratings Rate it yourself - /Services/opticians/LeaveReview/DefaultView.aspx?id=00025__000001_BH217SH,,,
Tesco Stores Ltd,OP_5CE_2771__000001_BH77DY,OPT,Riverside Avenue,,Bournemouth,Bournemouth,,BH7 7DY,Tel: 0345 677 9094, - ,,,No ratings yet Rate it yourself - /Services/opticians/LeaveReview/DefaultView.aspx?id=OP_5CE_2771__000001_BH77DY,0,0,
Bournemouth Vision Centre (Maven Optics Ltd) ,OP_5CE_13750__000001_BH63QU,OPT,63 Southbourne Grove,Southbourne,Bournemouth,,,BH6 3QU,Tel: 01202 424491, - ,,,1 rating Rate it yourself - /Services/opticians/LeaveReview/DefaultView.aspx?id=OP_5CE_13750__000001_BH63QU,,,
Julian May Opticians ,5QN-11__000001_BH63QX,OPT,101 Southbourne Grove,Southbourne,,Bournemouth,Dorset,BH6 3QY,Tel: 01202 432435, - ,,,4 ratings Rate it yourself - /Services/opticians/LeaveReview/DefaultView.aspx?id=5QN-11__000001_BH63QX,,,yes
Peter Bowen Thomas Ltd,OP_5FN_8398__000001_BH211DX,OPT,43 East Street,,Wimborne,,,BH21 1DX,Tel: 01202 889131, - ,,,No ratings yet Rate it yourself - /Services/opticians/LeaveReview/DefaultView.aspx?id=OP_5FN_8398__000001_BH211DX,0,0,
Care Opticians,SP10 3DG,OPT,,6 Heath Close,,Wimborne,Dorset,BH21 2LP,Tel: 01202 889472, - ,,,1 rating Rate it yourself - /Services/opticians/LeaveReview/DefaultView.aspx?id=SP10 3DG,,,
Scrivens Ltd,OP_5FN_5544__000001_BH211HT,OPT,1 High Street,,,Wimborne,Dorset,BH21 1HR,Tel: 01202 883827, - ,,,No ratings yet Rate it yourself - /Services/opticians/LeaveReview/DefaultView.aspx?id=OP_5FN_5544__000001_BH211HT,0,0,
Optique 2000 Ltd,OP_5FN_6873__000001_BH211JN,OPT,7a West Street,,,WIMBORNE,Dorset,BH21 1JN,Tel: 01202 848808, - ,,,20 ratings Rate it yourself - /Services/opticians/LeaveReview/DefaultView.aspx?id=OP_5FN_6873__000001_BH211JN,,,
EyeStyle Centre Opticians Ltd,TP7HJ,OPT,,141-143 Station Road,,Dorset,,BH22 0HT,, - ,,,No ratings yet Rate it yourself - /Services/opticians/LeaveReview/DefaultView.aspx?id=TP7HJ,0,0,
"Taylormade Eyecare Limited, Trading As Raxworthy Opticians",OP_5FN_3435__000001_BH231QE,OPT,51 Bargates,,Christchurch,Christchurch,,BH23 1QE,Tel: 01202 484888, - ,,,No ratings yet Rate it yourself - /Services/opticians/LeaveReview/DefaultView.aspx?id=OP_5FN_3435__000001_BH231QE,0,0,
Specsavers Opticians (Christchurch Specsavers Ltd),OP_5FN_14711__000001_BH231AY,OPT,34 High Street,,Christchurch,Dorset,,BH23 1AY,Tel: 01202 480 707, - ,,,3 ratings Rate it yourself - /Services/opticians/LeaveReview/DefaultView.aspx?id=OP_5FN_14711__000001_BH231AY,,,
Boots-Christchurch,CO-3328__000003_BH231QA,OPT,Unit 8,Saxon Square Shopping Centre,,Christchurch,,BH23 1QA,Tel: 01202 480975, - ,,,No ratings yet Rate it yourself - /Services/opticians/LeaveReview/DefaultView.aspx?id=CO-3328__000003_BH231QA,0,0,
Johnsen Optical Ltd,OP_5FN_8753__000001_BH231BW,OPT,21 Church Street,,Christchurch,,,BH23 1BW,Tel: 01202 485476, - ,,,No ratings yet Rate it yourself - /Services/opticians/LeaveReview/DefaultView.aspx?id=OP_5FN_8753__000001_BH231BW,0,0,
Nicholson Eyecare,OP_5A1_14084__000001_BH238NJ,OPT,1 Runnymeade,Ringwood Road,Bransgore,,,BH23 8NJ,Tel: 01425 673343, - ,,,No ratings yet Rate it yourself - /Services/opticians/LeaveReview/DefaultView.aspx?id=OP_5A1_14084__000001_BH238NJ,0,0,
Scrivens Opticians,OP_5A1_14100__000001_BH241AD,OPT,49 High Street,,Ringwood,Hampshire,,BH24 1AD,Tel: 01425 472534, - ,,,No ratings yet Rate it yourself - /Services/opticians/LeaveReview/DefaultView.aspx?id=OP_5A1_14100__000001_BH241AD,0,0,
Kelly Eyecare,OP_5A1_14099__000001_BH241AB,OPT,17 High Street,,Ringwood,Hampshire,,BH24 1AB,Tel: 01425 478545, - ,,,No ratings yet Rate it yourself - /Services/opticians/LeaveReview/DefaultView.aspx?id=OP_5A1_14099__000001_BH241AB,0,0,
Specsavers,BH24 1AT__000001_BH241AT,OPT,2 The Furlong Centre,,Ringwood,Hants,,BH24 1AT,Tel: 01425 484480, - ,,,No ratings yet Rate it yourself - /Services/opticians/LeaveReview/DefaultView.aspx?id=BH24 1AT__000001_BH241AT,0,0,
Eye See Eye,OP_5A1_14098__000001_BH241DG,OPT,17-19 Christchurch Road,Friday's Cross,Ringwood,,,BH24 1DG,Tel: 01425 477922, - ,,,No ratings yet Rate it yourself - /Services/opticians/LeaveReview/DefaultView.aspx?id=OP_5A1_14098__000001_BH241DG,0,0,
Peacock & Murphy,OP_5FN_5847__000001_BH216DR,OPT,27b Vicarage Road,,Verwood,Dorset,,BH31 6DR,Tel: 01202 825448, - ,,,No ratings yet Rate it yourself - /Services/opticians/LeaveReview/DefaultView.aspx?id=OP_5FN_5847__000001_BH216DR,0,0,
Bournemouth Vision Centre,OP_5FN_13766__000003_BH235ET,OPT,T/A Your Eyesite,304 Lymington Road,Highcliffe,,,BH23 5ET,Tel: 01425 272991, - ,,,No ratings yet Rate it yourself - /Services/opticians/LeaveReview/DefaultView.aspx?id=OP_5FN_13766__000003_BH235ET,0,0,
Your Eye Site,OPT_BH235ET_1,OPT,,304 Lymington Road,,Highcliffe,,BH23 5ET,, - ,,,No ratings yet Rate it yourself - /Services/opticians/LeaveReview/DefaultView.aspx?id=OPT_BH235ET_1,0,0,
Howie & Tickner Ltd,OP_5FN_2085__000001_BH235EL,OPT,,6 Highcliffe Corner,Lymington Road,HIGHCLIFFE,Dorset,BH23 5EL,Tel: 01425 272382, - ,,,No ratings yet Rate it yourself - /Services/opticians/LeaveReview/DefaultView.aspx?id=OP_5FN_2085__000001_BH235EL,0,0,
Christine Webster Opticians Ltd,OP_5FN_1098__000001_BH204AF,OPT,Victoria House,10a North Street,Wareham,Dorset,,BH20 4AF,Tel: 01929 556062, - ,,,1 rating Rate it yourself - /Services/opticians/LeaveReview/DefaultView.aspx?id=OP_5FN_1098__000001_BH204AF,,,
PBS Optical,OPT_BH241TW_1,OPT,,Cornerways Cottage,,Ringwood,,BH24 1TW,, - ,,,No ratings yet Rate it yourself - /Services/opticians/LeaveReview/DefaultView.aspx?id=OPT_BH241TW_1,0,0,
I J Brown Partnership,OP_5FN_1175__000001_BH191AD,OPT,,25 Station Road,,SWANAGE,Dorset,BH19 1AD,Tel: 01929 422220, - ,,,No ratings yet Rate it yourself - /Services/opticians/LeaveReview/DefaultView.aspx?id=OP_5FN_1175__000001_BH191AD,0,0,
Kelly Eyecare (Parkstone) Limited,OPT_BH256QJ_1,OPT,,"The George Business Centre, Christchurch Road",,New Milton,,BH25 6QJ,, - ,,,No ratings yet Rate it yourself - /Services/opticians/LeaveReview/DefaultView.aspx?id=OPT_BH256QJ_1,0,0,
Boots-New Milton,OP_BH256JX_46116,OPT,,20 Station Road,,New Milton,Hampshire,BH25 6JX,Tel: 01425 618412, - ,,,17 ratings Rate it yourself - /Services/opticians/LeaveReview/DefaultView.aspx?id=OP_BH256JX_46116,,,
Vision Express ,OP_5A1_14094__000001_BH256LE,OPT,78 Station Road,,New Milton,Hampshire,,BH25 6LE,Tel: 01425 610977, - ,,,No ratings yet Rate it yourself - /Services/opticians/LeaveReview/DefaultView.aspx?id=OP_5A1_14094__000001_BH256LE,0,0,
Scrivens Opticians,OPT_BH256HY_1,OPT,,3 Mallard Buildings,,New Milton,,BH25 6HY,, - ,,,No ratings yet Rate it yourself - /Services/opticians/LeaveReview/DefaultView.aspx?id=OPT_BH256HY_1,0,0,
J P Loftus,BH25 6HY__000002_BH256HY,OPT,"3 Mallard Buildings,",Station Road,,New Milton,Hampshire,BH25 6HY,Tel: 01425 619 060, - ,,,No ratings yet Rate it yourself - /Services/opticians/LeaveReview/DefaultView.aspx?id=BH25 6HY__000002_BH256HY,0,0,
Tesco Opticians,09876__000001_BH255PX,OPT,,Caird Avenue,,New Milton,,BH25 6BP,Tel: 0345 677 9489, - ,,,1 rating Rate it yourself - /Services/opticians/LeaveReview/DefaultView.aspx?id=09876__000001_BH255PX,,,
Specsavers,CO-5497,OPT,,44-48 East Street,,Blandford Forum,,DT11 7DR,, - ,,,No ratings yet Rate it yourself - /Services/opticians/LeaveReview/DefaultView.aspx?id=CO-5497,0,0,
S H Harrold (1937) Ltd,OP_5CD_4949__000002_DT117DX,OPT,,61 East Street,,BLANDFORD FORUM,Dorset,DT11 7DX,Tel: 01258 458476, - ,,,1 rating Rate it yourself - /Services/opticians/LeaveReview/DefaultView.aspx?id=OP_5CD_4949__000002_DT117DX,,,
Scrivens Ltd,OP_5CD_2939__000001_DT117PY,OPT,,9 Market Place,,Blandford Forum,Dorset,DT11 7AF,Tel: 01258 452443, - ,,,No ratings yet Rate it yourself - /Services/opticians/LeaveReview/DefaultView.aspx?id=OP_5CD_2939__000001_DT117PY,0,0,
Robert Frith Opticians (Blandford) Ltd.,OP_5CD_2016__000001_DT117AH,OPT,,3 Market Place,,BLANDFORD FORUM,Dorset,DT11 7AH,Tel: 01258 452207, - ,,,No ratings yet Rate it yourself - /Services/opticians/LeaveReview/DefaultView.aspx?id=OP_5CD_2016__000001_DT117AH,0,0,
A.J Bass BSc FCOptom,OP_5A1_14086__000001_SP61AX,OPT,36 High Street,,Fordingbridge,Hampshire,,SP6 1AX,Tel: 01425 652663, - ,,,2 ratings Rate it yourself - /Services/opticians/LeaveReview/DefaultView.aspx?id=OP_5A1_14086__000001_SP61AX,,,
Kelly Eyecare,OP_5A1_14085__000002_SO427RB,OPT,43 Brookley Road,,Brockenhurst,Hampshire,,SO42 7RB,Tel: 01590 623297, - ,,,1 rating Rate it yourself - /Services/opticians/LeaveReview/DefaultView.aspx?id=OP_5A1_14085__000002_SO427RB,,,
Hassan-Hicks Opticians,OP_5A1_14092__000001_SO419NB,OPT,18 St. Thomas Street,,Lymington,Hampshire,,SO41 9NB,Tel: 01590 675576, - ,,,No ratings yet Rate it yourself - /Services/opticians/LeaveReview/DefaultView.aspx?id=OP_5A1_14092__000001_SO419NB,0,0,
Specsavers,OP_SO419AL_34942,OPT,,71 High Street,,Lymington,,SO41 9AL,, - ,,,No ratings yet Rate it yourself - /Services/opticians/LeaveReview/DefaultView.aspx?id=OP_SO419AL_34942,0,0,
Vision Express ,OP_5A1_14090__000001_SO419AJ,OPT,95 High Street,,Lymington,Hampshire,,SO41 9AP,Tel: 01590 677722, - ,,,No ratings yet Rate it yourself - /Services/opticians/LeaveReview/DefaultView.aspx?id=OP_5A1_14090__000001_SO419AJ,0,0,
Scrivens Opticians,OP_5A1_14093__000001_SO419AG,OPT,,100 High Street,,Lymington,Hampshire,SO41 9AP,Tel: 01590 672645, - ,,,No ratings yet Rate it yourself - /Services/opticians/LeaveReview/DefaultView.aspx?id=OP_5A1_14093__000001_SO419AG,0,0,
Boots-Lymington,OP_5A1_14091__000001_SO419AF,OPT,35 High Street,,Lymington,Hampshire,,SO41 9AF,Tel: 01590 671655, - ,,,No ratings yet Rate it yourself - /Services/opticians/LeaveReview/DefaultView.aspx?id=OP_5A1_14091__000001_SO419AF,0,0,
R M Skidmore,OP_5DG_13635__000001_PO390DH,OPT,2a The Avenue,,Freshwater,,,PO39 0DH,Tel: 01983 753532, - ,,,No ratings yet Rate it yourself - /Services/opticians/LeaveReview/DefaultView.aspx?id=OP_5DG_13635__000001_PO390DH,0,0,
Rutherford Eyecare,PO40 9AJ__000001_PO409AJ,OPT,3 Moa Place,,Freshwater,Isle Of Wight,,PO40 9DS,Tel: 01983 753532, - ,,,No ratings yet Rate it yourself - /Services/opticians/LeaveReview/DefaultView.aspx?id=PO40 9AJ__000001_PO409AJ,0,0,
A J Bass,OP_5DH_11495__000001_SP53LX,OPT,53 The Borough,Downton,Salisbury,Wiltshire,,SP5 3LX,Tel: 01725 512058, - ,,,No ratings yet Rate it yourself - /Services/opticians/LeaveReview/DefaultView.aspx?id=OP_5DH_11495__000001_SP53LX,0,0,
Vision Express ,OP_5CD_7572__000001_DT101AW,OPT,2 Retsel House,Bridge Street,Sturminster Newton,,,DT10 1AW,Tel: 01258 472291, - ,,,No ratings yet Rate it yourself - /Services/opticians/LeaveReview/DefaultView.aspx?id=OP_5CD_7572__000001_DT101AW,0,0,
EyeStyle Centre Opticians Ltd,OP_5CD_50__000001_SP78AA,OPT,56 High Street,,Shaftesbury,Shaftesbury,,SP7 8AA,Tel: 01747 851006, - ,,,No ratings yet Rate it yourself - /Services/opticians/LeaveReview/DefaultView.aspx?id=OP_5CD_50__000001_SP78AA,0,0,
S H Harrold (1937) Ltd,CO-2389__000001_SP78JE,OPT,,49 High Street,,SHAFTESBURY,Dorset,SP7 8JE,Tel: 01747 853553, - ,,,1 rating Rate it yourself - /Services/opticians/LeaveReview/DefaultView.aspx?id=CO-2389__000001_SP78JE,,,
Robert Frith Opticians (Wessex) Ltd,OP_5CD_12558__000001_SP78AR,OPT,Wesley House,12 Bell Street,,SHAFTESBURY,Dorset,SP7 8AR,Tel: 01747 854761, - ,,,No ratings yet Rate it yourself - /Services/opticians/LeaveReview/DefaultView.aspx?id=OP_5CD_12558__000001_SP78AR,0,0,
Leightons Opticians & Hearing Care,OP_5A1_14101__000001_SO403DG,OPT,,17 Water Lane,Totton,Southampton,Hampshire,SO40 3DG,Tel: 02380 862 456, - ,,,1 rating Rate it yourself - /Services/opticians/LeaveReview/DefaultView.aspx?id=OP_5A1_14101__000001_SO403DG,,,
Optique Opticians,OP_5A1_14102__000001_SO403BU,OPT,89 Junction Road,,Totton,Southampton (Totton),Hampshire,SO40 3BU,Tel: 023 8087 0002, - ,,,No ratings yet Rate it yourself - /Services/opticians/LeaveReview/DefaultView.aspx?id=OP_5A1_14102__000001_SO403BU,0,0,
Clapham Eyecare,OPT_SO403BX_1,OPT,,9 Commercial Road,,Totton,,SO40 3BX,, - ,,,No ratings yet Rate it yourself - /Services/opticians/LeaveReview/DefaultView.aspx?id=OPT_SO403BX_1,0,0,
Specsavers,SO40 3BX__000003_SO403BX,OPT,11 Commercial Road,,,Totton,,SO40 3BX,Tel: 02380 580 070, - ,,,No ratings yet Rate it yourself - /Services/opticians/LeaveReview/DefaultView.aspx?id=SO40 3BX__000003_SO403BX,0,0,
Silverthornes Opticians,OP_5DJ_14126__000001_SP12DD,OPT,50 Catherine Street,,Salisbury,Wiltshire,,SP1 2DD,Tel: 01722 322880, - ,,,No ratings yet Rate it yourself - /Services/opticians/LeaveReview/DefaultView.aspx?id=OP_5DJ_14126__000001_SP12DD,0,0,
Boots Opticians Limited,OP_5DJ_11593__000001_SP12AA,OPT,49-51 New Canel,,Salisbury,,,SP1 2AA,Tel: 01722 412625, - ,,,No ratings yet Rate it yourself - /Services/opticians/LeaveReview/DefaultView.aspx?id=OP_5DJ_11593__000001_SP12AA,0,0,
Boots-Salisbury - Silver St,SP1 2NG_29481,OPT,,41-49 Silver Street,,Salisbury,Wiltshire,SP1 2NG,Tel: 01722 412625, - ,,,4 ratings Rate it yourself - /Services/opticians/LeaveReview/DefaultView.aspx?id=SP1 2NG_29481,,,
Batemans (Opticians) Ltd,OP_5DJ_3495__000001_SP12LX,OPT,6 Bridge Street,,Salisbury,,,SP1 2LX,Tel: 01722 322585, - ,,,No ratings yet Rate it yourself - /Services/opticians/LeaveReview/DefaultView.aspx?id=OP_5DJ_3495__000001_SP12LX,0,0,
Specsavers Opticians,OP_5DJ_9766__000001_SP12DG,OPT,1 Catherine Street,,Salisbury,,,SP1 2DF,Tel: 01722 412255, - ,,,No ratings yet Rate it yourself - /Services/opticians/LeaveReview/DefaultView.aspx?id=OP_5DJ_9766__000001_SP12DG,0,0,