Organisation Name,NACS Code,Organisation Type,Address1,Address2,Address3,Address4,Address5,PostCode,Telephone Number,Opening time,Value  (Opening time),Banding Classification  (Opening time),NHS.UK users rating,Value  (NHS.UK users rating),Banding Classification  (NHS.UK users rating),Car parking (Is there car parking at this organisation?)
Frederick Howard Opticians,OP_5H2_14978__000001_CH454NW,OPT,40 Wallasey Road,Liscard,,Wirral,,CH45 4NW,Tel: 0151 630 0066, - ,,,No ratings yet Rate it yourself - /Services/opticians/LeaveReview/DefaultView.aspx?id=OP_5H2_14978__000001_CH454NW,0,0,
Scrivens Opticians & Hearing Care,OP_5H2_9957__000001_CH454NE,OPT,Unit 7A,Liscard Way,,Wallasey,,CH44 5TL,Tel: 0151 639 2280, - ,,,No ratings yet Rate it yourself - /Services/opticians/LeaveReview/DefaultView.aspx?id=OP_5H2_9957__000001_CH454NE,0,0,
Specsavers Wallasey,OP_5H2_94__000001_CH445XX,OPT,"Unit 33, Cherry Tree Centre",Liscard Way,Wallasey,Merseyside,,CH44 5XX,Tel: 0151 638 3341, - ,,,6 ratings Rate it yourself - /Services/opticians/LeaveReview/DefaultView.aspx?id=OP_5H2_94__000001_CH445XX,,,
R J Orrell Opticians Ltd,OP_5H2_13833__000001_CH452JD,OPT,123 Victoria Road,New Brighton,Wirral,,,CH45 2JD,Tel: 0151 639 3263, - ,,,No ratings yet Rate it yourself - /Services/opticians/LeaveReview/DefaultView.aspx?id=OP_5H2_13833__000001_CH452JD,0,0,
Tesco Opticians,CH437AA060716,OPT,,Bidston Link Road,,Birkenhead,,CH43 7AA,Tel: 0345 601 3479, - ,,,No ratings yet Rate it yourself - /Services/opticians/LeaveReview/DefaultView.aspx?id=CH437AA060716,0,0,
Brumpton Opticians,OP_5H2_9828__000001_CH418EN,OPT,102 Laird Street,Birkenhead,Merseyside,,,CH41 8EN,Tel: 0151 652 2562, - ,,,No ratings yet Rate it yourself - /Services/opticians/LeaveReview/DefaultView.aspx?id=OP_5H2_9828__000001_CH418EN,0,0,
Price Wynne Opticians,C2855NK__000002_CH410DD,OPT,161 Park Road North,,Birkenhead,Merseyside,,CH41 0DD,, - ,,,1 rating Rate it yourself - /Services/opticians/LeaveReview/DefaultView.aspx?id=C2855NK__000002_CH410DD,,,
R Millican Opticians,OP_5H2_7652__000002_CH467TE,OPT,2 Chadwick Street,Moreton,Wirral,,,CH46 7TE,Tel: 0151 677 3402, - ,,,No ratings yet Rate it yourself - /Services/opticians/LeaveReview/DefaultView.aspx?id=OP_5H2_7652__000002_CH467TE,0,0,
Paul Moore Opticians,OP_5H2_9600__000001_CH460SL,OPT,255 Hoylake Road,Moreton,Wirral,,,CH46 0SL,Tel: 0151 678 3400, - ,,,1 rating Rate it yourself - /Services/opticians/LeaveReview/DefaultView.aspx?id=OP_5H2_9600__000001_CH460SL,,,
R A Carr,OP_5M5_14750__000001_L31,OPT,Bridgefoot Farm,Hall Lane,Lydiate,,,L41 4LR,Tel: 01704 841315, - ,,,No ratings yet Rate it yourself - /Services/opticians/LeaveReview/DefaultView.aspx?id=OP_5M5_14750__000001_L31,0,0,
Costco Wholesale UK Limited,OPT_L37HY_1,OPT,,30 Waterloo Road,,Liverpool,,L3 7HY,Tel: 0151 224 7685, - ,,,No ratings yet Rate it yourself - /Services/opticians/LeaveReview/DefaultView.aspx?id=OPT_L37HY_1,0,0,
I Care Opticians,OPT_CH416EB_3,OPT,,254 Grange Road,,Birkenhead,,CH41 6EB,, - ,,,No ratings yet Rate it yourself - /Services/opticians/LeaveReview/DefaultView.aspx?id=OPT_CH416EB_3,0,0,
I Care Opticians,OPT_CH416EB_1,OPT,i care opticians,254 Grange Road,,Birkenhead,Cheshire,CH41 6EB,Tel: 0151 647 5310, - ,,,No ratings yet Rate it yourself - /Services/opticians/LeaveReview/DefaultView.aspx?id=OPT_CH416EB_1,0,0,
"Eye 2 Eye, (Gartshore Optical Centre)",OP_5H2_3393__000002_CH412PH,OPT,231 Grange Road,Birkenhead,,Wirral,Merseyside,CH41 2PH,Tel: 0151 647 3048, - ,,,1 rating Rate it yourself - /Services/opticians/LeaveReview/DefaultView.aspx?id=OP_5H2_3393__000002_CH412PH,,,
Vision Express (UK) Ltd,OP_5H2_323__000002_CH412ZL,OPT,Unit 1,"The Pyramids, Grange Road",Birkenhead,,,CH41 2ZL,Tel: 0151 647 4068, - ,,,No ratings yet Rate it yourself - /Services/opticians/LeaveReview/DefaultView.aspx?id=OP_5H2_323__000002_CH412ZL,0,0,
Boots-Birkenhead,OP_5H2_10569__000001_CH412ZL,OPT,"Unit 21, The Pyramids",,,Birkenhead,Merseyside,CH41 2ZL,Tel: 0151 666 1499, - ,,,No ratings yet Rate it yourself - /Services/opticians/LeaveReview/DefaultView.aspx?id=OP_5H2_10569__000001_CH412ZL,0,0,
Rayner Opticians ,OP_5H2_8427__000001_CH412XZ,OPT,,9 St. Werburghs Square,Grange Precinct,Birkenhead,,CH41 2XZ,Tel: 0151 647 8277, - ,,,No ratings yet Rate it yourself - /Services/opticians/LeaveReview/DefaultView.aspx?id=OP_5H2_8427__000001_CH412XZ,0,0,
Specsavers Opticians,OP_5H2_7164__000001_CH412XX,OPT,29 Borough Pavement,Grange Precinct,Birkenhead,,,CH41 2XX,Tel: 0151 650 1666, - ,,,No ratings yet Rate it yourself - /Services/opticians/LeaveReview/DefaultView.aspx?id=OP_5H2_7164__000001_CH412XX,0,0,
"Eye 2 Eye, (Gartshore Optical Centre)",OP_5H2_4205__000002_CH490UB,OPT,31 Arrowe Park Road,Upton,,Wirral,Merseyside,CH49 0UB,Tel: 0151 677 3913, - ,,,No ratings yet Rate it yourself - /Services/opticians/LeaveReview/DefaultView.aspx?id=OP_5H2_4205__000002_CH490UB,0,0,
The Eyeworks ,OP_5H2_14388__000003_CH490UB,OPT,1 Arrowe Park Road,Upton,Wirral,Merseysdie,,CH49 0UB,Tel: 0151 677 2133, - ,,,1 rating Rate it yourself - /Services/opticians/LeaveReview/DefaultView.aspx?id=OP_5H2_14388__000003_CH490UB,,,yes
Specsavers Opticians,OP_5M5_12424__000001_L204XX,OPT,65 Parkside,Strand Shopping Centre,Bootle,Merseyside,,L20 4XX,Tel: 0151 933 7090, - ,,,No ratings yet Rate it yourself - /Services/opticians/LeaveReview/DefaultView.aspx?id=OP_5M5_12424__000001_L204XX,0,0,
Mark Blankstone Opticians,OP_5HA_7954__000001_L29XW,OPT,2a Derby Square,,Liverpool,,,L2 9XW,Tel: 0151 236 5392, - ,,,No ratings yet Rate it yourself - /Services/opticians/LeaveReview/DefaultView.aspx?id=OP_5HA_7954__000001_L29XW,0,0,
Jonny Goggles,OP_5HA_8263__000001_L29QJ,OPT,32 North John Street,,Liverpool,,,L2 9QJ,Tel: 0151 227 3232, - ,,,1 rating Rate it yourself - /Services/opticians/LeaveReview/DefaultView.aspx?id=OP_5HA_8263__000001_L29QJ,,,
Boots-Liverpool - Lord St,OP_5HA_5295__000002_L21TD,OPT,62 Lord Street,,Liverpool,Merseyside,,L2 1TD,Tel: 0151 708 7032, - ,,,No ratings yet Rate it yourself - /Services/opticians/LeaveReview/DefaultView.aspx?id=OP_5HA_5295__000002_L21TD,0,0,
Waterloo Eye Centre,OP_5M5_4281__000001_L220ND,OPT,,108 South Road,Waterloo,Liverpool,Merseyside,L22 0ND,Tel: 0151 928 6645, - ,,,1 rating Rate it yourself - /Services/opticians/LeaveReview/DefaultView.aspx?id=OP_5M5_4281__000001_L220ND,,,
Specsavers Opticians,OP_5HA_12271__000001_L21TD,OPT,76-78 Lord Street,,Liverpool,,,L2 1TL,Tel: 0151 709 9180, - ,,,No ratings yet Rate it yourself - /Services/opticians/LeaveReview/DefaultView.aspx?id=OP_5HA_12271__000001_L21TD,0,0,
Optical Express,OP_L18BU_46580,OPT,"Unit 69, 15 South John Street",,,Liverpool,Merseyside,L1 8BU,Tel: 0800 023 2020, - ,,,1 rating Rate it yourself - /Services/opticians/LeaveReview/DefaultView.aspx?id=OP_L18BU_46580,,,
Sight Savers Eye Centre,5M5_4098__000001_L235RZ,OPT,94 Linacre Road,,Litherland,Merseyside,,L21 6NU,Tel: 0151 933 3666, - ,,,1 rating Rate it yourself - /Services/opticians/LeaveReview/DefaultView.aspx?id=5M5_4098__000001_L235RZ,,,
Silverberg Opticians,OP_5HA_6726__000002_L16DZ,OPT,40 Whitechapel,,Liverpool,,,L1 6DZ,Tel: 0151 709 2012, - ,,,3 ratings Rate it yourself - /Services/opticians/LeaveReview/DefaultView.aspx?id=OP_5HA_6726__000002_L16DZ,,,
Blundellsands Optical Ltd,GOC - 1-18588,OPT,,13-15 Merseyview,Brighton le sands,Liverpool,,L22 6QA,Tel: 0151 931 4619, - ,,,1 rating Rate it yourself - /Services/opticians/LeaveReview/DefaultView.aspx?id=GOC - 1-18588,,,
Boots-Liverpool - Clayton SC ,OP_5HA_4722__000003_L11QR,OPT,18 Great Charlotte Street,,,Liverpool,Merseyside,L1 1QR,Tel: 0151 708 5000, - ,,,3 ratings Rate it yourself - /Services/opticians/LeaveReview/DefaultView.aspx?id=OP_5HA_4722__000003_L11QR,,,
Vision Express (UK) Ltd,OP_5HA_12731__000002_L11QR,OPT,"Unit 3, Tops Plaza",Clayton Square Shopping Centre,Liverpool,,,L1 1QR,Tel: 0151 707 0987, - ,,,No ratings yet Rate it yourself - /Services/opticians/LeaveReview/DefaultView.aspx?id=OP_5HA_12731__000002_L11QR,0,0,
I R McGarvey Opticians,OP_5H2_9244__000001_CH428PG,OPT,354 Woodchurch Road,Prenton,Birkenhead,,,CH42 8PG,Tel: 0151 608 2823, - ,,,No ratings yet Rate it yourself - /Services/opticians/LeaveReview/DefaultView.aspx?id=OP_5H2_9244__000001_CH428PG,0,0,
R T Booth & Co Ltd,OP_5H2_6272__000001_CH428PF,OPT,393 Woodchurch Road,Prenton,Birkenhead,,,CH42 8PF,Tel: 0151 608 7870, - ,,,No ratings yet Rate it yourself - /Services/opticians/LeaveReview/DefaultView.aspx?id=OP_5H2_6272__000001_CH428PF,0,0,
Store Optical,OP_5G9_3291__000001_L43QA,OPT,33 County Road,Walton,Liverpool,,,L4 3QA,Tel: 0151 524 1945, - ,,,2 ratings Rate it yourself - /Services/opticians/LeaveReview/DefaultView.aspx?id=OP_5G9_3291__000001_L43QA,,,
J H Gains Opticians,OP_5G9_3380__000002_L43QH,OPT,10 County Road,Walton,Liverpool,,,L4 3QH,Tel: 0151 525 8833, - ,,,No ratings yet Rate it yourself - /Services/opticians/LeaveReview/DefaultView.aspx?id=OP_5G9_3380__000002_L43QH,0,0,
Jonathan Kay Ltd,OP_5M5_8498__000001_L220QB,OPT,55 Crosby Road North,Waterloo,,Liverpool,Merseyside,L22 4QD,Tel: 0151 928 5982, - ,,,1 rating Rate it yourself - /Services/opticians/LeaveReview/DefaultView.aspx?id=OP_5M5_8498__000001_L220QB,,,
Healthy Eyes Opticians,OP_5G9_14012__000001_L45PQ,OPT,257 County Road,Walton,Liverpool,,,L4 5PQ,Tel: 0151 523 5004, - ,,,No ratings yet Rate it yourself - /Services/opticians/LeaveReview/DefaultView.aspx?id=OP_5G9_14012__000001_L45PQ,0,0,
Greasby Opticians,OP_5F8_8200__000002_CH493NQ,OPT,150 Greasby Road,Greasby,Wirral,Wirral,,CH49 3NQ,Tel: 0151 605 0822, - ,,,32 ratings Rate it yourself - /Services/opticians/LeaveReview/DefaultView.aspx?id=OP_5F8_8200__000002_CH493NQ,,,
J H Gains Opticians,OP_5HA_3381__000002_L56SW,OPT,12 The Mall,Breck Road,Liverpool,,,L5 6SW,Tel: 0151 263 8143, - ,,,No ratings yet Rate it yourself - /Services/opticians/LeaveReview/DefaultView.aspx?id=OP_5HA_3381__000002_L56SW,0,0,
The Rock Ferry Optical Centre,OP_5H2_1053__000001_CH423XT,OPT,87 Grove Road,Rock Ferry,Birkenhead,,,CH42 3XT,Tel: 0151 645 4273, - ,,,No ratings yet Rate it yourself - /Services/opticians/LeaveReview/DefaultView.aspx?id=OP_5H2_1053__000001_CH423XT,0,0,
Glenns Opticians,OP_5M5_13844__000001_L235SS,OPT,89 Liverpool Road,Crosby,,Liverpool,,L23 5TD,Tel: 0151 924 4615, - ,,,No ratings yet Rate it yourself - /Services/opticians/LeaveReview/DefaultView.aspx?id=OP_5M5_13844__000001_L235SS,0,0,
Breck road Spectacle Centre,2662509__000001_L56QB,OPT,294 Breck Road,,Liverpool,,,L5 6QB,Tel: 0151 263 4005, - ,,,No ratings yet Rate it yourself - /Services/opticians/LeaveReview/DefaultView.aspx?id=2662509__000001_L56QB,0,0,
Batty & Dexter Opticians,OP_5HA_1901__000001_L42RD,OPT,98 Breck Road,Anfield,Liverpool,,,L4 2RD,Tel: 0151 260 4677, - ,,,3 ratings Rate it yourself - /Services/opticians/LeaveReview/DefaultView.aspx?id=OP_5HA_1901__000001_L42RD,,,
See World Optical,OP_5G9_4203__000001_L90EF,OPT,6 Longmoor Lane,Aintree,Liverpool,,,L9 0EF,Tel: 0151 330 2039, - ,,,2 ratings Rate it yourself - /Services/opticians/LeaveReview/DefaultView.aspx?id=OP_5G9_4203__000001_L90EF,,,
Batty & Dexter Opticians,OP_5G9_12524__000001_L94RW,OPT,47-49 Warbreck Moor,Aintree,,Liverpool,Merseyside,L9 4RW,Tel: 0151 525 3010, - ,,,2 ratings Rate it yourself - /Services/opticians/LeaveReview/DefaultView.aspx?id=OP_5G9_12524__000001_L94RW,,,
Tesco Opticians Park Road,1339092017,OPT,,215 Park Road,,Liverpool,,L8 4XF,, - ,,,No ratings yet Rate it yourself - /Services/opticians/LeaveReview/DefaultView.aspx?id=1339092017,0,0,
Jonathan Kay,OP_5HA_9602__000002_L70LA,OPT,15 Prescot Road,Fairfield,Liverpool,,,L7 0LA,Tel: 0151 263 1100, - ,,,No ratings yet Rate it yourself - /Services/opticians/LeaveReview/DefaultView.aspx?id=OP_5HA_9602__000002_L70LA,0,0,
Martin & Kaye,OP_5HA_11513__000002_L84UE,OPT,256 Park Road,Toxteth,Liverpool,,,L8 4UE,Tel: 0151 727 5577, - ,,,No ratings yet Rate it yourself - /Services/opticians/LeaveReview/DefaultView.aspx?id=OP_5HA_11513__000002_L84UE,0,0,
Billy@Glasses123,OPT_L84UE_1,OPT,,284 Park Road,,Liverpool,,L8 4UE,Tel: 0151 726 0622, - ,,,1 rating Rate it yourself - /Services/opticians/LeaveReview/DefaultView.aspx?id=OPT_L84UE_1,,,
Hardmans Opticians,OP_5HA_2532__000001_L81PF,OPT,304 Park Road,Toxteth,Liverpool,,,L8 4QY,Tel: 0151 727 6054, - ,,,No ratings yet Rate it yourself - /Services/opticians/LeaveReview/DefaultView.aspx?id=OP_5HA_2532__000001_L81PF,0,0,
Frederick Howard Opticians,OP_5F8_13831__000002_CH638QT,OPT,108 Teehey Lane,Bebington,,Wirral,,CH63 8QT,Tel: 0151 609 0990, - ,,,2 ratings Rate it yourself - /Services/opticians/LeaveReview/DefaultView.aspx?id=OP_5F8_13831__000002_CH638QT,,,
Price  Opticians,OP_5H2_2112__000001_CH621AB,OPT,87 New Chester Road,New Ferry,Wirral,,,CH62 1AB,Tel: 0151 645 2367, - ,,,1 rating Rate it yourself - /Services/opticians/LeaveReview/DefaultView.aspx?id=OP_5H2_2112__000001_CH621AB,,,
Martin & Kaye,OP_5HA_11516__000001_L138AE,OPT,571 West Derby Road,Old Swan,Liverpool,,,L13 8AE,Tel: 0151 228 1997, - ,,,No ratings yet Rate it yourself - /Services/opticians/LeaveReview/DefaultView.aspx?id=OP_5HA_11516__000001_L138AE,0,0,
Netherton Eye Centre,OP_5M5_4279__000002_L305QA,OPT,,21 Marian Square,Netherton,Bootle,,L30 5QA,Tel: 0151 524 0904, - ,,,No ratings yet Rate it yourself - /Services/opticians/LeaveReview/DefaultView.aspx?id=OP_5M5_4279__000002_L305QA,0,0,
P K McMullen,OP_5H2_14728__000001_CH625BH,OPT,,162 Bebington Road,Bebington,Wirral,,CH63 7NX,Tel: 0151 644 9550, - ,,,1 rating Rate it yourself - /Services/opticians/LeaveReview/DefaultView.aspx?id=OP_5H2_14728__000001_CH625BH,,,
Robert Glass Opticians t/a Glasses 4 Less,OP_5G9_2452__000001_L111BZ,OPT,25 Broadway,Norris Green,Liverpool,Liverpool,,L11 1BX,Tel: 0151 256 1166, - ,,,No ratings yet Rate it yourself - /Services/opticians/LeaveReview/DefaultView.aspx?id=OP_5G9_2452__000001_L111BZ,0,0,
Specsavers Opticians,OP_5G9_7432__000001_L111BX,OPT,11-13 Broadway,Norris Green,Liverpool,,,L11 1BX,Tel: 0151 226 6617, - ,,,1 rating Rate it yourself - /Services/opticians/LeaveReview/DefaultView.aspx?id=OP_5G9_7432__000001_L111BX,,,
Norris Green Specsavers Ltd,TP6PA,OPT,,"11-13 Broadway, Norris Green",,Liverpool,,L11 1BX,, - ,,,No ratings yet Rate it yourself - /Services/opticians/LeaveReview/DefaultView.aspx?id=TP6PA,0,0,
Prebble Opticians,OP_5G9_4286__000001_L111DQ,OPT,4-8 Utting Avenue East,Norris Green,Liverpool,Liverpool,,L11 1DQ,Tel: 0151 256 1944, - ,,,2 ratings Rate it yourself - /Services/opticians/LeaveReview/DefaultView.aspx?id=OP_5G9_4286__000001_L111DQ,,,
Frederick Howard Opticians,OP_5F8_8878__000002_CH619PF,OPT,403 Pensby Road,Pensby,Wirral,Merseyside,,CH61 9PF,Tel: 0151 648 1182, - ,,,No ratings yet Rate it yourself - /Services/opticians/LeaveReview/DefaultView.aspx?id=OP_5F8_8878__000002_CH619PF,0,0,
A & S Eye Centre,OPT_L150EG_1,OPT,,52 Lawrence Road,,Liverpool,,L15 0EG,Tel: 0151 733 9954, - ,,,1 rating Rate it yourself - /Services/opticians/LeaveReview/DefaultView.aspx?id=OPT_L150EG_1,,,
Mersey Eyecare,OP_5HC_14747__000001_L177BR,OPT,164 Aigburth Road,,Liverpool,,,L17 7BR,Tel: 0151 727 3636, - ,,,3 ratings Rate it yourself - /Services/opticians/LeaveReview/DefaultView.aspx?id=OP_5HC_14747__000001_L177BR,,,
Asda Stores Vision Centre,OP_5HA_14741__000001_L152LS,OPT,Sefton Park,Smithdown Road,,Liverpool,,L15 2LF,Tel: 0151 734 6712, - ,,,No ratings yet Rate it yourself - /Services/opticians/LeaveReview/DefaultView.aspx?id=OP_5HA_14741__000001_L152LS,0,0,
Ball & Gatehouse Opticians,OP_5F8_8133__000002_CH637PG,OPT,27a Church Road,Bebington,Wirral,Wirral,,CH63 7PG,Tel: 0151 645 3438, - ,,,No ratings yet Rate it yourself - /Services/opticians/LeaveReview/DefaultView.aspx?id=OP_5F8_8133__000002_CH637PG,0,0,
Smithdown Eyecare Limited,OP_5HA_14742__000001_L152JT,OPT,Smithdown Eyecare,"188, Smithdown Road",Wavertree,Liverpool,Merseyside,L15 3JT,Tel: 0151 280 7777, - ,,,No ratings yet Rate it yourself - /Services/opticians/LeaveReview/DefaultView.aspx?id=OP_5HA_14742__000001_L152JT,0,0,
The Spectacle Centre,4291956__000001_L154LP,OPT,254 Picton Road,,Liverpool,,,L15 4LP,Tel: 0151 734 4486, - ,,,No ratings yet Rate it yourself - /Services/opticians/LeaveReview/DefaultView.aspx?id=4291956__000001_L154LP,0,0,
A D Melling Ltd,OP_5F8_115__000003_CH484HL,OPT,9 The Crescent,West Kirby,Wirral,,,CH48 4HL,Tel: 0151 625 3743, - ,,,No ratings yet Rate it yourself - /Services/opticians/LeaveReview/DefaultView.aspx?id=OP_5F8_115__000003_CH484HL,0,0,
Harris Opticians,OP_5F8_10646__000001_CH484HB,OPT,,8 Banks Road,,West Kirby,Merseyside,CH48 4HB,Tel: 0151 625 7742, - ,,,No ratings yet Rate it yourself - /Services/opticians/LeaveReview/DefaultView.aspx?id=OP_5F8_10646__000001_CH484HB,0,0,
Eyecall Opticians,OP_5HA_14743__000001_L125HP,OPT,"Unit 3,7/7a Almonds Green Parade",West Derby Village,Liverpool,,,L12 5HP,Tel: 0151 256 6060, - ,,,No ratings yet Rate it yourself - /Services/opticians/LeaveReview/DefaultView.aspx?id=OP_5HA_14743__000001_L125HP,0,0,
ASDA Opticians,OP_5M5_14753__000002_L103LN,OPT,Asda Stores Ltd,Ormskirk Road,"Aintree,",Liverpool,,L10 3LN,Tel: 0151 531 7778, - ,,,2 ratings Rate it yourself - /Services/opticians/LeaveReview/DefaultView.aspx?id=OP_5M5_14753__000002_L103LN,,,
Millican Opticians,OP_5HA_8976__000002_L135XE,OPT,,589 Prescot Road,Old Swan,Liverpool,,L13 5UX,Tel: 0151 228 8561, - ,,,No ratings yet Rate it yourself - /Services/opticians/LeaveReview/DefaultView.aspx?id=OP_5HA_8976__000002_L135XE,0,0,
Martin & Kaye Opticians,OP_5HA_262__000001_L135UX,OPT,585 Prescot Road,Old Swan,Liverpool,,,L13 5UX,Tel: 0151 220 6161, - ,,,No ratings yet Rate it yourself - /Services/opticians/LeaveReview/DefaultView.aspx?id=OP_5HA_262__000001_L135UX,0,0,
SPECSAVERS OLD SWAN,11912OLSWA__000003_L135XE,OPT,628 Prescot Road,Old Swan,Liverpool,Merseyside,,L13 5XE,Tel: 0151 250 6360, - ,,,1 rating Rate it yourself - /Services/opticians/LeaveReview/DefaultView.aspx?id=11912OLSWA__000003_L135XE,,,
Specsavers Opticians,11912__000001_L154HN,OPT,21/22 Smithdown Place,,Liverpool,,,L15 9EN,Tel: 0151 734 7555, - ,,,No ratings yet Rate it yourself - /Services/opticians/LeaveReview/DefaultView.aspx?id=11912__000001_L154HN,0,0,
Millican Opticians,OP_5HA_14746__000001_L181LW,OPT,82-84 Allerton Road,,Liverpool,,,L18 1LW,Tel: 0151 734 5005, - ,,,No ratings yet Rate it yourself - /Services/opticians/LeaveReview/DefaultView.aspx?id=OP_5HA_14746__000001_L181LW,0,0,
C J OPTICS,C2005NJ__000001_L315JB,OPT,9 Dover Road,,Maghull,Merseyside,,L31 5JB,Tel: 0151 531 0698, - ,,,1 rating Rate it yourself - /Services/opticians/LeaveReview/DefaultView.aspx?id=C2005NJ__000001_L315JB,,,
"Eye 2 Eye, (Gartshore Optical Centre)",OP_5F8_5092__000001_CH607SG,OPT,240 Telegraph Road,Heswall,,Wirral,Cheshire,CH60 7SG,Tel: 0151 342 8328, - ,,,5 ratings Rate it yourself - /Services/opticians/LeaveReview/DefaultView.aspx?id=OP_5F8_5092__000001_CH607SG,,,
Harris Opticians,OP_5F8_3453__000001_CH607SE,OPT,,175 -177 Telegraph Road,,Heswall,Merseyside,CH60 7SE,Tel: 0151 342 4130, - ,,,2 ratings Rate it yourself - /Services/opticians/LeaveReview/DefaultView.aspx?id=OP_5F8_3453__000001_CH607SE,,,
Specsavers,TP8L1,OPT,,183 Telegraph Road,,"Heswall, Wirral",,CH60 7SE,, - ,,,No ratings yet Rate it yourself - /Services/opticians/LeaveReview/DefaultView.aspx?id=TP8L1,0,0,
Bennett & Batty,OP_5HA_3785__000002_L182DD,OPT,93 Allerton Road,Mossley Hill,,Liverpool,,L18 2DD,Tel: 0151 724 4144, - ,,,9 ratings Rate it yourself - /Services/opticians/LeaveReview/DefaultView.aspx?id=OP_5HA_3785__000002_L182DD,,,
Nightingale Opticians,5J5 839,OPT,,16 Lawnhurst Grove,Aigburth,Liverpool,,L17 6ES,Tel: 0151 494 9375, - ,,,No ratings yet Rate it yourself - /Services/opticians/LeaveReview/DefaultView.aspx?id=5J5 839,0,0,
Asda Opticians,OPT_CH62 3PL,OPT,,WELTON ROAD,CROFT BUSINESS PARK,BROMBOROUGH,,CH62 3PL,Tel: 0151 346 2512, - ,,,No ratings yet Rate it yourself - /Services/opticians/LeaveReview/DefaultView.aspx?id=OPT_CH62 3PL,0,0,
S Wilcox,OP_5HA_13841__000001_L167QQ,OPT,169 Dunbabin Road,Childwall,Childwall,,,L16 7QQ,Tel: 0151 722 1182, - ,,,No ratings yet Rate it yourself - /Services/opticians/LeaveReview/DefaultView.aspx?id=OP_5HA_13841__000001_L167QQ,0,0,
Eye Design,OP_L126QX_30293,OPT,,78 Baycliff Road,,Liverpool,,L12 6QX,, - ,,,No ratings yet Rate it yourself - /Services/opticians/LeaveReview/DefaultView.aspx?id=OP_L126QX_30293,0,0,
West Derby Eye Centre,OP_5HA_13837__000002_L126QX,OPT,74 Baycliff Road,West Derby,Liverpool,,,L12 6QX,Tel: 0151 228 6854, - ,,,No ratings yet Rate it yourself - /Services/opticians/LeaveReview/DefaultView.aspx?id=OP_5HA_13837__000002_L126QX,0,0,
Houghtons Opticians,OP_5F8_3955__000001_CH627HH,OPT,47 Allport Lane Precinct,Bromborough,Wirral,,,CH62 7HH,Tel: 0151 334 2805, - ,,,No ratings yet Rate it yourself - /Services/opticians/LeaveReview/DefaultView.aspx?id=OP_5F8_3955__000001_CH627HH,0,0,
Nikki Fenner Optometrists,OP_5M5_14751__000001_L312HB,OPT,Nikki Fenner Optometrist,3b Stafford Moreton Way,Maghull,Liverpool,Merseyside,L31 2PH,Tel: 0151 526 1906, - ,,,No ratings yet Rate it yourself - /Services/opticians/LeaveReview/DefaultView.aspx?id=OP_5M5_14751__000001_L312HB,0,0,
Maghull Eye Centre,OP_5M5_1479__000001_L310DQ,OPT,Maghull Eye Centre,22 Westway,Maghull,Merseyside,,L31 0DQ,Tel: 0151 526 8565, - ,,,1 rating Rate it yourself - /Services/opticians/LeaveReview/DefaultView.aspx?id=OP_5M5_1479__000001_L310DQ,,,
The Eyeworks,OP_5F8_11733__000002_CH626BB,OPT,,"128, Allport Road",Bromborough,Wirral,,CH62 6BB,Tel: 0151 343 0044, - ,,,No ratings yet Rate it yourself - /Services/opticians/LeaveReview/DefaultView.aspx?id=OP_5F8_11733__000002_CH626BB,0,0,yes
Specsavers Opticians,01-20561,OPT,,21 St Chad's Parade,,Kirby,,L32 8RD,Tel: 0151 545 5310, - ,,,No ratings yet Rate it yourself - /Services/opticians/LeaveReview/DefaultView.aspx?id=01-20561,0,0,
Glasses123,OP_L192PA_29486,OPT,,30 Speke Road,,Liverpool,,L19 2PA,Tel: 0151 494 1121, - ,,,3 ratings Rate it yourself - /Services/opticians/LeaveReview/DefaultView.aspx?id=OP_L192PA_29486,,,
Specsavers Belle Vale,C/293/5NL__000001_L252XT,OPT,Unit 3 Belle Vale Shopping Centre,Belle Vale,Liverpool,,,L25 2XT,, - ,,,No ratings yet Rate it yourself - /Services/opticians/LeaveReview/DefaultView.aspx?id=C/293/5NL__000001_L252XT,0,0,
alice @ conlon,OP_5F9_6607__000001_L373PX,OPT,,4 The Beacons,Halsall Lane,Formby,Merseyside,L37 3NW,Tel: 01704 878 680, - ,,,No ratings yet Rate it yourself - /Services/opticians/LeaveReview/DefaultView.aspx?id=OP_5F9_6607__000001_L373PX,0,0,
Specsavers Formby,99999__000002_L373PX,OPT,"Unit 3, The Cloisters, Halsall La",,Formby,Merseyside,,L37 3PX,Tel: 01704 832311, - ,,,No ratings yet Rate it yourself - /Services/opticians/LeaveReview/DefaultView.aspx?id=99999__000002_L373PX,0,0,
In-Style Opticians,OP_5HC_3689__000001_L252RQ,OPT,Unit 22,Belle Vale Shopping Centre,Belle Vale,,,L25 2RF,Tel: 0151 487 3713, - ,,,No ratings yet Rate it yourself - /Services/opticians/LeaveReview/DefaultView.aspx?id=OP_5HC_3689__000001_L252RQ,0,0,
John Prebble Opticians,OP_5HC_9800__000001_L252RG,OPT,Unit 21,Belle Vale Shopping Centre,Belle Vale,Liverpool,Merseyside,L25 2RG,Tel: 0151 487 5228, - ,,,12 ratings Rate it yourself - /Services/opticians/LeaveReview/DefaultView.aspx?id=OP_5HC_9800__000001_L252RG,,,
Julie Hatchell Opticians,OP_5HC_6617__000001_L255JD,OPT,34 Woolton Street,Woolton,Liverpool,,,L25 5JD,Tel: 0151 428 4040, - ,,,4 ratings Rate it yourself - /Services/opticians/LeaveReview/DefaultView.aspx?id=OP_5HC_6617__000001_L255JD,,,
Millican Opticians,OP_5J4_8614__000002_L369UJ,OPT,,44 Derby Road,Huyton,Liverpool,Merseyside,L36 9UJ,Tel: 0151 489 1845, - ,,,No ratings yet Rate it yourself - /Services/opticians/LeaveReview/DefaultView.aspx?id=OP_5J4_8614__000002_L369UJ,0,0,