Organisation Name,NACS Code,Organisation Type,Address1,Address2,Address3,Address4,Address5,PostCode,Telephone Number,Opening time,Value  (Opening time),Banding Classification  (Opening time),NHS.UK users rating,Value  (NHS.UK users rating),Banding Classification  (NHS.UK users rating),Car parking (Is there car parking at this organisation?)
Marshoptical,OP_5MV_691__000002_WV13HH,OPT,Cleveland Street,,Wolverhampton,,,WV1 3HH,Tel: 01902 420919, - ,,,No ratings yet Rate it yourself - /Services/opticians/LeaveReview/DefaultView.aspx?id=OP_5MV_691__000002_WV13HH,0,0,
Specsavers Opticians,OP_5MV_13061__000001_WV13HG,OPT,58-59 Wulfrun Centre,,,Wolverhampton,,WV1 3HG,Tel: 01902 715 844, - ,,,No ratings yet Rate it yourself - /Services/opticians/LeaveReview/DefaultView.aspx?id=OP_5MV_13061__000001_WV13HG,0,0,
4 Sight Eye Care Centres Ltd,OP_5MV_249__000001_WV13ET,OPT,14-16 Central Arcade,,,Wolverhampton,,WV1 3ET,Tel: 01902 714559, - ,,,No ratings yet Rate it yourself - /Services/opticians/LeaveReview/DefaultView.aspx?id=OP_5MV_249__000001_WV13ET,0,0,yes
Scrivens Ltd,OP_5MV_3780__000001_WV13NP,OPT,16 Dudley St,,,Wolverhampton,,WV1 3EY,Tel: 01902 424775, - ,,,No ratings yet Rate it yourself - /Services/opticians/LeaveReview/DefaultView.aspx?id=OP_5MV_3780__000001_WV13NP,0,0,
Vision Express (UK) Ltd,OP_5MV_11313__000001_WV13NJ,OPT,11-12 The Gallery,Mander Centre,,Wolverhampton,,WV1 3NJ,Tel: 01902 716999, - ,,,No ratings yet Rate it yourself - /Services/opticians/LeaveReview/DefaultView.aspx?id=OP_5MV_11313__000001_WV13NJ,0,0,
R K Flatters,OP_5MV_1492__000001_WV13JW,OPT,35 Queen Street,,,Wolverhampton,,WV1 3JW,Tel: 01902 423359, - ,,,No ratings yet Rate it yourself - /Services/opticians/LeaveReview/DefaultView.aspx?id=OP_5MV_1492__000001_WV13JW,0,0,
Boots-Wolverhampton - Mander Centre (in Boots UK),OP_5MV_9292__000001_WV13NN,OPT,"Unit 221, 30-34 The Gallery",Mander Centre,,Wolverhampton,West Midlands,WV1 3NN,Tel: 01902 711755, - ,,,No ratings yet Rate it yourself - /Services/opticians/LeaveReview/DefaultView.aspx?id=OP_5MV_9292__000001_WV13NN,0,0,
Ideal Eyes Optical Ltd,OP_5MV_813__000003_WV13NP,OPT,2 Victoria Street,,,Wolverhampton,,WV1 3NP,Tel: 01902 423030, - ,,,No ratings yet Rate it yourself - /Services/opticians/LeaveReview/DefaultView.aspx?id=OP_5MV_813__000003_WV13NP,0,0,
Khalil Opticians Ltd,OP_5MV_493__000002_WV13NP,OPT,22 Victoria Street,Wolverhampton,,West Midlands,,WV1 3NP,Tel: 01902 771267, - ,,,No ratings yet Rate it yourself - /Services/opticians/LeaveReview/DefaultView.aspx?id=OP_5MV_493__000002_WV13NP,0,0,
Lichfield Street Opticians,OP_5MV_793__000003_WV11DG,OPT,44 Lichfield Street,,Wolverhampton,West Midlands,,WV1 1DG,Tel: 01902 420348, - ,,,No ratings yet Rate it yourself - /Services/opticians/LeaveReview/DefaultView.aspx?id=OP_5MV_793__000003_WV11DG,0,0,
Harris Opticians,OP_5MV_ 751__000001_WV14LF,OPT,44 School Street,Off Darlington Street,,Wolverhampton,,WV1 4LF,Tel: 01902 421820, - ,,,No ratings yet Rate it yourself - /Services/opticians/LeaveReview/DefaultView.aspx?id=OP_5MV_ 751__000001_WV14LF,0,0,
Flint & Partners,OP_5MV_7631__000001_WV39NB,OPT,59 Tettenhall Road,,,Wolverhampton,,WV3 9NB,Tel: 01902 422096, - ,,,No ratings yet Rate it yourself - /Services/opticians/LeaveReview/DefaultView.aspx?id=OP_5MV_7631__000001_WV39NB,0,0,
Focus Eye Clinic,OP_WV100QB_34100,OPT,Unit 6 Crossways Shopping Centre,Wolverhampton Road,Heath Town,Wolverhampton,West Midlands,WV10 0QB,Tel: 01902 546820, - ,,,No ratings yet Rate it yourself - /Services/opticians/LeaveReview/DefaultView.aspx?id=OP_WV100QB_34100,0,0,
Penn Eyecare,OP_5MV_512__000001_WV44AD,OPT,Penn Eyecare,252 Penn Road,Penn,Wolverhampton,West Midlands,WV4 4AD,Tel: 01902 342999, - ,,,No ratings yet Rate it yourself - /Services/opticians/LeaveReview/DefaultView.aspx?id=OP_5MV_512__000001_WV44AD,0,0,yes
Beacon Opticians Plus +,CO-5239,OPT,Beacon Centre,Wolverhampton Road East,,Wolverhampton,West Midlands,WV4 6AZ,Tel: 01902 886794, - ,,,No ratings yet Rate it yourself - /Services/opticians/LeaveReview/DefaultView.aspx?id=CO-5239,0,0,
H. Wyn  Williams Optometrist,OP_5MV_4776__000002_WV37HT,OPT,6 Trysull Road,Bradmore,,Wolverhampton,West Midlands,WV3 7HT,Tel: 01902 620352, - ,,,1 rating Rate it yourself - /Services/opticians/LeaveReview/DefaultView.aspx?id=OP_5MV_4776__000002_WV37HT,,,yes
NVision Eyecare,OP_WV60QW_29780,OPT,,The Avion Centre,4 Bargate Drive,Wolverhampton,,WV6 0QW,Tel: 01902 779077, - ,,,2 ratings Rate it yourself - /Services/opticians/LeaveReview/DefaultView.aspx?id=OP_WV60QW_29780,,,
Miracle Eyes Ltd,OP_5MV_635__000002_WV45QF,OPT,317a Penn Road,Penn,,Wolverhampton,,WV4 5QF,Tel: 01902 621111, - ,,,No ratings yet Rate it yourself - /Services/opticians/LeaveReview/DefaultView.aspx?id=OP_5MV_635__000002_WV45QF,0,0,
Specsavers Opticians,OP_WV140AX_29785,OPT,,84 Church Street,,Bilston,,WV14 0AX,Tel: 01902 407940, - ,,,No ratings yet Rate it yourself - /Services/opticians/LeaveReview/DefaultView.aspx?id=OP_WV140AX_29785,0,0,
Jacksons Opticians,OP_WV140AX_29782,OPT,,"53a Church Street,",,Bilston,,WV14 0AX,Tel: 01902 491358, - ,,,No ratings yet Rate it yourself - /Services/opticians/LeaveReview/DefaultView.aspx?id=OP_WV140AX_29782,0,0,
Eye Openers,OP_WV140AX_29781,OPT,,63 Church Street,,Bilston,,WV14 0AX,Tel: 01902 492020, - ,,,No ratings yet Rate it yourself - /Services/opticians/LeaveReview/DefaultView.aspx?id=OP_WV140AX_29781,0,0,
Scrivens Ltd,OP_WV140DR_29783,OPT,,9 Market Way,,Bilston,,WV14 0DR,Tel: 01902 496471, - ,,,No ratings yet Rate it yourself - /Services/opticians/LeaveReview/DefaultView.aspx?id=OP_WV140DR_29783,0,0,
4 Sight Eye Care Centres Ltd,OP_5MV_886__000002_WV109QY,OPT,1 Raynor Road,Fallings Park,,Wolverhampton,,WV10 9QY,Tel: 01902 723449, - ,,,No ratings yet Rate it yourself - /Services/opticians/LeaveReview/DefaultView.aspx?id=OP_5MV_886__000002_WV109QY,0,0,
VisionCare Direct Opticians,OP_WV140DZ_29770,OPT,,W M Morrison Supermarkets PLC,Black Country Route,"Bilston, Wolverhampton",West Midlands,WV14 0DZ,Tel: 01902 493322, - ,,,1 rating Rate it yourself - /Services/opticians/LeaveReview/DefaultView.aspx?id=OP_WV140DZ_29770,,,yes
Flint & Partners,OP_5MV_2445__000001_WV111SR,OPT,11 Church Street,Wednesfield,,Wolverhampton,,WV11 1SR,Tel: 01902 719 850, - ,,,2 ratings Rate it yourself - /Services/opticians/LeaveReview/DefaultView.aspx?id=OP_5MV_2445__000001_WV111SR,,,
C M Biddle & Co Ltd,OP_5MV_3311__000004_WV111SZ,OPT,20 High Street,Wednesfield,,Wolverhampton,,WV11 1SZ,Tel: 01902 729028, - ,,,No ratings yet Rate it yourself - /Services/opticians/LeaveReview/DefaultView.aspx?id=OP_5MV_3311__000004_WV111SZ,0,0,
Miracle Eyes,OP_WV109BA_29921,OPT,,5 Showell Circus,,Wolverhampton,,WV10 9BA,, - ,,,No ratings yet Rate it yourself - /Services/opticians/LeaveReview/DefaultView.aspx?id=OP_WV109BA_29921,0,0,
Portland Eye Care Services Ltd,OP_5MV_ 795__000001_WV111TW,OPT,45 Lichfield Road,Wednesfield,,Wolverhampton,,WV11 1TW,Tel: 01902 723898, - ,,,No ratings yet Rate it yourself - /Services/opticians/LeaveReview/DefaultView.aspx?id=OP_5MV_ 795__000001_WV111TW,0,0,
Specs Direct,OP_5HV_1048__000001_DY31RU,OPT,"3, The Bull Ring",Sedgley,Dudley,,,DY3 1RU,Tel: 01902 676410, - ,,,No ratings yet Rate it yourself - /Services/opticians/LeaveReview/DefaultView.aspx?id=OP_5HV_1048__000001_DY31RU,0,0,
Taylor Biddle Opticians,OP_5MV_1765__000002_WV68AF,OPT,39 Bridgnorth Road,Compton,,Wolverhampton,,WV6 8AF,Tel: 01902 750325, - ,,,18 ratings Rate it yourself - /Services/opticians/LeaveReview/DefaultView.aspx?id=OP_5MV_1765__000002_WV68AF,,,
Samantha Hague Optometry,OP_5MV_596__000001_WV28QT,OPT,10 High Street,Tettenhall,,Wolverhampton,West Midlands,WV6 8QT,Tel: 01902757454, - ,,,10 ratings Rate it yourself - /Services/opticians/LeaveReview/DefaultView.aspx?id=OP_5MV_596__000001_WV28QT,,,no
R T Knight Opticians,OP_5HV_8488__000002_DY31SB,OPT,8 Dudley Street,Sedgley,Dudley,,,DY3 1SB,Tel: 01902 883 260, - ,,,2 ratings Rate it yourself - /Services/opticians/LeaveReview/DefaultView.aspx?id=OP_5HV_8488__000002_DY31SB,,,
Overton Eyecare,OP_5MV_9203__000001_WV108PN,OPT,743-745 Cannock Road,The Scotlands,,Wolverhampton,,WV10 8PN,Tel: 01902 731158, - ,,,1 rating Rate it yourself - /Services/opticians/LeaveReview/DefaultView.aspx?id=OP_5MV_9203__000001_WV108PN,,,
Vision Care Direct Opticians,5M3-201__000002_WV131TG,OPT,,13 Stafford Street,,Willenhall,,WV13 1TG,Tel: 01902 609244, - ,,,No ratings yet Rate it yourself - /Services/opticians/LeaveReview/DefaultView.aspx?id=5M3-201__000002_WV131TG,0,0,
Bushbury Eyecare,,OPT,,339a Bushbury Lane,,Wolverhampton,,WV10 9UL,, - ,,,N/A - Data not available,,,
Supa Specs Ltd,OP_5M3_12438__000001_WV132AA,OPT,12 Market Place,Willenhall,,Wolverhampton,,WV13 2AA,Tel: 01902 630393, - ,,,No ratings yet Rate it yourself - /Services/opticians/LeaveReview/DefaultView.aspx?id=OP_5M3_12438__000001_WV132AA,0,0,
Scrivens Ltd,OP_5M3_1341__000001_WV131PU,OPT,33 Cross Street,,,Willenhall,West Midlands,WV13 1PG,Tel: 01902 605386, - ,,,No ratings yet Rate it yourself - /Services/opticians/LeaveReview/DefaultView.aspx?id=OP_5M3_1341__000001_WV131PU,0,0,
NVision Eyecare,01-21451 - 1,OPT,,84 Windmill Lane,Castle Croft,Wolverhampton,,WV3 8HG,Tel: 01902 380 000, - ,,,1 rating Rate it yourself - /Services/opticians/LeaveReview/DefaultView.aspx?id=01-21451 - 1,,,
Scrivens Ltd,OP_5MV_585__000001_WV106BA,OPT,5 Three Tuns Parade,Stafford Road,,Fordhouses,West Midlands,WV10 6BA,Tel: 01902 782280, - ,,,No ratings yet Rate it yourself - /Services/opticians/LeaveReview/DefaultView.aspx?id=OP_5MV_585__000001_WV106BA,0,0,
Miracle Eyes Ltd,OP_5MV_853__000001_WV106RT,OPT,Unit 4 Marsh Lane Parade,"Three Tuns, Fordhouses",,Wolverhampton,,WV10 6RT,Tel: 01902 789900, - ,,,No ratings yet Rate it yourself - /Services/opticians/LeaveReview/DefaultView.aspx?id=OP_5MV_853__000001_WV106RT,0,0,
Taylor Made Specs,OP_DY32DA_34272,OPT,,"6 The Arcade, Kent Street",,Upper Gornal,,DY3 2DA,Tel: 01902 664783, - ,,,1 rating Rate it yourself - /Services/opticians/LeaveReview/DefaultView.aspx?id=OP_DY32DA_34272,,,
Ashmore Park Opticians,OP_5MV_371__000001_WV112JN,OPT,54 Griffiths Drive,Ashmore Park,,Wolverhampton,,WV11 2JW,Tel: 01902 739777, - ,,,4 ratings Rate it yourself - /Services/opticians/LeaveReview/DefaultView.aspx?id=OP_5MV_371__000001_WV112JN,,,
T/A Watts & Attewell,OP_5M3_5594__000002_WS108DE,OPT,59 King Street,Darlaston,Wednesbury,,,WS10 8DE,Tel: 0121 526 6396, - ,,,No ratings yet Rate it yourself - /Services/opticians/LeaveReview/DefaultView.aspx?id=OP_5M3_5594__000002_WS108DE,0,0,
Perton Eye Centre,OP_5MN_13221__000002_WV67QH,OPT,"Unit 4, anders Square",Unit 4,Wolverhampton,Perton,,WV6 7QH,Tel: 01902 759666, - ,,,No ratings yet Rate it yourself - /Services/opticians/LeaveReview/DefaultView.aspx?id=OP_5MN_13221__000002_WV67QH,0,0,
Eye Deal Opticians,OP_5MH_8755__000001_DY49JA,OPT,Glebefields Health Centre,St Marks Road,,Tipton,West Midlands,DY4 0UB,Tel: 0121 557 1465, - ,,,No ratings yet Rate it yourself - /Services/opticians/LeaveReview/DefaultView.aspx?id=OP_5MH_8755__000001_DY49JA,0,0,
Eye Deal Opticians,OP_5MH_13686__000001_DY48LY,OPT,Neptune Health Park,Sedgley Road West,,Tipton,West Midlands,DY4 8LY,Tel: 0121 612 1919, - ,,,1 rating Rate it yourself - /Services/opticians/LeaveReview/DefaultView.aspx?id=OP_5MH_13686__000001_DY48LY,,,
Taylor Biddle Opticians Wombourne,CO-3769,OPT,,34 Windmill Bank,,WOMBOURNE,,WV5 9JD,, - ,,,No ratings yet Rate it yourself - /Services/opticians/LeaveReview/DefaultView.aspx?id=CO-3769,0,0,
Perrigo Opticians,OP_5MN_4235__000001_WV59JB,OPT,"The Willows, Maypole Street",Wombourne,Wolverhampton,,,WV5 9JB,Tel: 01902 893732, - ,,,1 rating Rate it yourself - /Services/opticians/LeaveReview/DefaultView.aspx?id=OP_5MN_4235__000001_WV59JB,,,
The Eyecare Centre Ltd,OP_5HV_13510__000001_DY32UB,OPT,42 Louise Street,Gornal Wood,Dudley,West Midlands,,DY3 2UB,Tel: 01384 256 248, - ,,,No ratings yet Rate it yourself - /Services/opticians/LeaveReview/DefaultView.aspx?id=OP_5HV_13510__000001_DY32UB,0,0,
4 Sight Eyecare Centre,OP_5MN_13987__000002_WV81PE,OPT,88 Wolverhampton Road,Birches Bridge,Codsall,,,WV8 1PE,Tel: 01902 844201, - ,,,No ratings yet Rate it yourself - /Services/opticians/LeaveReview/DefaultView.aspx?id=OP_5MN_13987__000002_WV81PE,0,0,
Chapmans Opticians,OP_5MJ_6469__000001_WS107HB,OPT,61 Union Street,,Wednesbury,,,WS10 7HB,Tel: 0121 556 5564, - ,,,No ratings yet Rate it yourself - /Services/opticians/LeaveReview/DefaultView.aspx?id=OP_5MJ_6469__000001_WS107HB,0,0,
Robbins Opticians,OP_5MJ_7699__000002_WS107HD,OPT,49 Union Street,,Wednesbury,,,WS10 7HB,Tel: 0121 556 0379, - ,,,No ratings yet Rate it yourself - /Services/opticians/LeaveReview/DefaultView.aspx?id=OP_5MJ_7699__000002_WS107HD,0,0,
R G Amarnani,OP_5MJ_691__000001_WS107HJ,OPT,45 Upper High Street,,Wednesbury,,,WS10 7HJ,Tel: 0121 556 4430, - ,,,No ratings yet Rate it yourself - /Services/opticians/LeaveReview/DefaultView.aspx?id=OP_5MJ_691__000001_WS107HJ,0,0,
Optical and Hearing Centre,5PK/6400__000001_WV107AU,OPT,Surgery House,2 South Crescent,Featherstone,,,WV10 7AU,Tel: 01902 306925, - ,,,No ratings yet Rate it yourself - /Services/opticians/LeaveReview/DefaultView.aspx?id=5PK/6400__000001_WV107AU,0,0,
T J Stephenson,OP_5MH_2850__000001_DY47AR,OPT,14 Market Place,Great Bridge,Tipton,,,DY4 7AR,Tel: 0121 557 2544, - ,,,No ratings yet Rate it yourself - /Services/opticians/LeaveReview/DefaultView.aspx?id=OP_5MH_2850__000001_DY47AR,0,0,
A.J. Moore,OP_5HV_13509__000001_DY11LQ,OPT,"264, Castle Street",,Dudley,West Midlands,,DY1 1LQ,Tel: 01384 252903, - ,,,1 rating Rate it yourself - /Services/opticians/LeaveReview/DefaultView.aspx?id=OP_5HV_13509__000001_DY11LQ,,,
Specsavers Opticians,OP_5HV_8264__000001_DY11LF,OPT,13 Castle Street,,Dudley,,,DY1 1LF,Tel: 01384 214 851, - ,,,No ratings yet Rate it yourself - /Services/opticians/LeaveReview/DefaultView.aspx?id=OP_5HV_8264__000001_DY11LF,0,0,
Bonham & Butler Opticians ,OP_5HV_13508__000001_DY11ED,OPT,216 Wolverhampton Street,,Dudley,West Midlands,,DY1 1ED,Tel: 01384 253696, - ,,,No ratings yet Rate it yourself - /Services/opticians/LeaveReview/DefaultView.aspx?id=OP_5HV_13508__000001_DY11ED,0,0,
Dollond & Aitchison,OP_5HV_3000__000002_DY11PD,OPT,219 High Street,Dudley,West Midlands,,,DY1 1PD,Tel: 01384 253859, - ,,,No ratings yet Rate it yourself - /Services/opticians/LeaveReview/DefaultView.aspx?id=OP_5HV_3000__000002_DY11PD,0,0,
Asda Opticians,OPT_DY4 7HW,OPT,,BRICKHOUSE LANE SOUTH,,GREAT BRIDGE,,DY4 7HW,Tel: 0121 521 5442, - ,,,1 rating Rate it yourself - /Services/opticians/LeaveReview/DefaultView.aspx?id=OPT_DY4 7HW,,,
4 Sight,OP_5HV_5402__000001_DY27BL,OPT,15 Churchill Shopping Centre,,Dudley,,,DY2 7BL,Tel: 01384 242444, - ,,,No ratings yet Rate it yourself - /Services/opticians/LeaveReview/DefaultView.aspx?id=OP_5HV_5402__000001_DY27BL,0,0,
Eyestyle,OP_5MH_13684__000001_DY47HF,OPT,71a Great Bridge,,Tipton,,,DY4 7HF,Tel: 0121 557 1523, - ,,,No ratings yet Rate it yourself - /Services/opticians/LeaveReview/DefaultView.aspx?id=OP_5MH_13684__000001_DY47HF,0,0,
Eye Health Clinic,01-23489,OPT,,168 High Street (corner of stafford street),,Dudley,,DY1 1QD,Tel: 01384 936438, - ,,,4 ratings Rate it yourself - /Services/opticians/LeaveReview/DefaultView.aspx?id=01-23489,,,yes
SPH Opticians,OP_5MH_13685__000001_DY47HA,OPT,18 Great Bridge,,Tipton,,,DY4 7HA,Tel: 0121 557 1875, - ,,,1 rating Rate it yourself - /Services/opticians/LeaveReview/DefaultView.aspx?id=OP_5MH_13685__000001_DY47HA,,,
Flint & Partners,OP_5MN_7633__000001_WV81PT,OPT,15 The Square,Wolverhampton Road,,Codsall,,WV8 1PT,Tel: 01902 846745, - ,,,No ratings yet Rate it yourself - /Services/opticians/LeaveReview/DefaultView.aspx?id=OP_5MN_7633__000001_WV81PT,0,0,
Pleck Eyecare Centre,OP_5M3_6140__000001_WS29QN,OPT,252 Wednesbury Road,,,Walsall,West Midlands,WS2 9QN,Tel: 01922 616141, - ,,,1 rating Rate it yourself - /Services/opticians/LeaveReview/DefaultView.aspx?id=OP_5M3_6140__000001_WS29QN,,,yes
Hill Top Opticians,5MX056,OPT,,Hill Top Opticians,106 Hill Top,West Bromwich,West Midlands,B70 0SH,Tel: 0121 556 3700, - ,,,No ratings yet Rate it yourself - /Services/opticians/LeaveReview/DefaultView.aspx?id=5MX056,0,0,
Budgetspex Ltd,5M2149__000003_DY90NW,OPT,8 Baird House Second Avenue,Pensett Trading Estate,Kingswinford,West Midlands,,DY6 7YA,Tel: 0871 2503601, - ,,,No ratings yet Rate it yourself - /Services/opticians/LeaveReview/DefaultView.aspx?id=5M2149__000003_DY90NW,0,0,
Tesco T/A Tesco Opticians ,OP_WS28HX_29573,OPT,,Littleton Street West,,Walsall,,WS2 8HX,Tel: 01922 777338, - ,,,No ratings yet Rate it yourself - /Services/opticians/LeaveReview/DefaultView.aspx?id=OP_WS28HX_29573,0,0,
Specsavers Bloxwich,TP2JT,OPT,,135 High St,Bloxwich,Walsall,,WS3 3LE,Tel: 01922 400366, - ,,,No ratings yet Rate it yourself - /Services/opticians/LeaveReview/DefaultView.aspx?id=TP2JT,0,0,
Eyedeal,5M3-203__000002_WS33LA,OPT,212 High Street,Bloxwich,,Walsall,,WS3 3LA,Tel: 01922 473999, - ,,,No ratings yet Rate it yourself - /Services/opticians/LeaveReview/DefaultView.aspx?id=5M3-203__000002_WS33LA,0,0,
Eyeopeners ,OP_WS11PB_29575,OPT,,198c High Street,,Bloxwich,,WS3 3LA,Tel: 01922 726040, - ,,,No ratings yet Rate it yourself - /Services/opticians/LeaveReview/DefaultView.aspx?id=OP_WS11PB_29575,0,0,
Hill the Opticians,OP_5M3_2576__000001_WS33LA,OPT,198a High Street,Bloxwich,,Walsall,,WS3 3LA,Tel: 01922 475388, - ,,,No ratings yet Rate it yourself - /Services/opticians/LeaveReview/DefaultView.aspx?id=OP_5M3_2576__000001_WS33LA,0,0,
K B Opticians,OP_5M3_7191__000002_WS33LQ,OPT,236 High Street,Bloxwich,Walsall,,,WS3 3LQ,Tel: 01922 476553, - ,,,No ratings yet Rate it yourself - /Services/opticians/LeaveReview/DefaultView.aspx?id=OP_5M3_7191__000002_WS33LQ,0,0,
Special Look's Opticians,00292__000002_DY60JJ,OPT,52 Enville Road,,Wall Heath,West Midlands,,DY6 0JT,Tel: 01384 294617, - ,,,No ratings yet Rate it yourself - /Services/opticians/LeaveReview/DefaultView.aspx?id=00292__000002_DY60JJ,0,0,
Kelcher & Pearson Opticians Ltd,OP_5M3_3698__000001_WS32EX,OPT,4 Queens Parade,,Walsall,,,WS3 2EX,Tel: 01922 409000, - ,,,No ratings yet Rate it yourself - /Services/opticians/LeaveReview/DefaultView.aspx?id=OP_5M3_3698__000001_WS32EX,0,0,
Ferguson Family Eye Care,TP9DC,OPT,,Ferguson family Eye Care,17 leamore Lane,Walsall,,WS3 2BJ,Tel: 01922278989, - ,,,3 ratings Rate it yourself - /Services/opticians/LeaveReview/DefaultView.aspx?id=TP9DC,,,
Boots-Walsall - Townsend Sq,WS2 8LP_19123,OPT,,1 Townend Street,,Walsall,West Midlands,WS2 8LP,Tel: 01922 649288, - ,,,No ratings yet Rate it yourself - /Services/opticians/LeaveReview/DefaultView.aspx?id=WS2 8LP_19123,0,0,
On Call Opticians - Home Visits for an Eye Test,TAMOPTICIAN0001,OPT,WEST MIDLANDS ONLY SERVICE Registered at,61 Trafalgar Road,,Oldbury,West Midlands,B69 1RE,Tel: 01384 234 779, - ,,,77 ratings Rate it yourself - /Services/opticians/LeaveReview/DefaultView.aspx?id=TAMOPTICIAN0001,,,yes
Moores Opticians,OP_5M3_7665__000001_WS13QD,OPT,73 Bradford Street,,Walsall,Walsall,,WS1 3QD,Tel: 01922 623469, - ,,,No ratings yet Rate it yourself - /Services/opticians/LeaveReview/DefaultView.aspx?id=OP_5M3_7665__000001_WS13QD,0,0,
Focus Eyeclinic,OP_WS14HR_29576,OPT,,1 Corporation Street,,Walsall,,WS1 4HR,Tel: 01922 278099, - ,,,No ratings yet Rate it yourself - /Services/opticians/LeaveReview/DefaultView.aspx?id=OP_WS14HR_29576,0,0,
4 Sight Eyecare Centre Ltd,OP_5M3_322__000001_WS11YS,OPT,50 Park Mall,Walsall,,,,WS1 1YS,Tel: 01922 613433, - ,,,No ratings yet Rate it yourself - /Services/opticians/LeaveReview/DefaultView.aspx?id=OP_5M3_322__000001_WS11YS,0,0,
Vision Express (UK) Ltd,OP_5M3_5865__000002_WS11YT,OPT,12a/b Bradford Mall,The Sadlers Centre,,Walsall,,WS1 1YT,Tel: 01922 633533, - ,,,No ratings yet Rate it yourself - /Services/opticians/LeaveReview/DefaultView.aspx?id=OP_5M3_5865__000002_WS11YT,0,0,
Specsavers Opticians,OP_5M3_12431__000001_WS11LY,OPT,17 Park Street,,,Walsall,,WS1 1LY,Tel: 01922 633390, - ,,,No ratings yet Rate it yourself - /Services/opticians/LeaveReview/DefaultView.aspx?id=OP_5M3_12431__000001_WS11LY,0,0,
Boots Opticians Ltd,OP_5M3_6939__000002_WS11NP,OPT,58 Park Street,Park Place,,Walsall,,WS1 1NG,Tel: 01922 649288, - ,,,No ratings yet Rate it yourself - /Services/opticians/LeaveReview/DefaultView.aspx?id=OP_5M3_6939__000002_WS11NP,0,0,
Preeti Eyes,OP_5M3_12433__000001_WS13RL,OPT,19 Caldmore Green,Caldmore,,Walsall,,WS1 3RL,Tel: 01922 722815, - ,,,No ratings yet Rate it yourself - /Services/opticians/LeaveReview/DefaultView.aspx?id=OP_5M3_12433__000001_WS13RL,0,0,
Dolland & Aitchinson,5M3 - 200__000001_WS11PB,OPT,11 Bradford Street,,,Walsall,,WS1 1PB,Tel: 01922 632070, - ,,,No ratings yet Rate it yourself - /Services/opticians/LeaveReview/DefaultView.aspx?id=5M3 - 200__000001_WS11PB,0,0,
Davis & Samuels Ltd,OP_5M3_9291__000001_WS11DA,OPT,Darwall Street,,Walsall,,,WS1 1DA,Tel: 01922 626500, - ,,,No ratings yet Rate it yourself - /Services/opticians/LeaveReview/DefaultView.aspx?id=OP_5M3_9291__000001_WS11DA,0,0,
The Eyecare Centre Ltd,OP_5HT_14936__000001_DY68AA,OPT,796 High Street,Kingswinford,West Midlands,,,DY6 8AA,Tel: 01384 292505, - ,,,No ratings yet Rate it yourself - /Services/opticians/LeaveReview/DefaultView.aspx?id=OP_5HT_14936__000001_DY68AA,0,0,
Asda Opticians,OPT_WS1 1RS,OPT,,GEORGE STREET,ST MATTHEWS,WALSALL,,WS1 1RS,Tel: 01922 704 125, - ,,,No ratings yet Rate it yourself - /Services/opticians/LeaveReview/DefaultView.aspx?id=OPT_WS1 1RS,0,0,
R A Lawley Ltd,OP_5HT_3004__000001_DY69JA,OPT,3-3a The Cross,Summer Hill,Kingswinford,,,DY6 9JA,Tel: 01384 271 888, - ,,,No ratings yet Rate it yourself - /Services/opticians/LeaveReview/DefaultView.aspx?id=OP_5HT_3004__000001_DY69JA,0,0,
Krystal Vision,OP_5HT_14937__000001_DY69JU,OPT,34 Market Street,Kingswinford,West Midlands,,,DY6 9JU,Tel: 01384 271971, - ,,,No ratings yet Rate it yourself - /Services/opticians/LeaveReview/DefaultView.aspx?id=OP_5HT_14937__000001_DY69JU,0,0,
Portway Opticians,CO-4566,OPT,,51A New Birmingham Road,,Oldbury,,B69 2JQ,Tel: 0121 544 1854, - ,,,2 ratings Rate it yourself - /Services/opticians/LeaveReview/DefaultView.aspx?id=CO-4566,,,
Pinder & Moore Optometrists,OP_5HT_448__000001_DY69LE,OPT,58 Market Street,Mill House,Kingswinford,West Midlands,,DY6 9LE,Tel: 01384 274426, - ,,,No ratings yet Rate it yourself - /Services/opticians/LeaveReview/DefaultView.aspx?id=OP_5HT_448__000001_DY69LE,0,0,
R B Stokes,OP_5MJ_13676__000002_B709LW,OPT,2-6 Carters Green,,West Bromwich,,,B70 9LW,Tel: 0121 553 0330, - ,,,No ratings yet Rate it yourself - /Services/opticians/LeaveReview/DefaultView.aspx?id=OP_5MJ_13676__000002_B709LW,0,0,
Eyes & Vision,OP_5MJ_13674__000002_B713HP,OPT,136 Walsall Road,,West Bromwich,,,B71 3HP,Tel: 0121 588 8484, - ,,,No ratings yet Rate it yourself - /Services/opticians/LeaveReview/DefaultView.aspx?id=OP_5MJ_13674__000002_B713HP,0,0,
Jonathan Walker & Associates,OP_5M3_12439__000001_WS13AA,OPT,74 Lysways Street,,,Walsall,,WS1 3AB,Tel: 01922 643988, - ,,,No ratings yet Rate it yourself - /Services/opticians/LeaveReview/DefaultView.aspx?id=OP_5M3_12439__000001_WS13AA,0,0,
Attewell and Hardwick Eyecare,OP_5MJ_3174__000001_B713HN,OPT,,96 Walsall Road,,West Bromwich,,B71 3HN,Tel: 0121 588 6163, - ,,,3 ratings Rate it yourself - /Services/opticians/LeaveReview/DefaultView.aspx?id=OP_5MJ_3174__000001_B713HN,,,
David Wright Opticians,OP_5HV_3943__000001_DY29PS,OPT,88 Halesowen Road,Netherton,Dudley,West Midlands,,DY2 9PS,Tel: 01384 238084, - ,,,2 ratings Rate it yourself - /Services/opticians/LeaveReview/DefaultView.aspx?id=OP_5HV_3943__000001_DY29PS,,,
Boots-Brierley Hill - Merry Hill Centre (next to Boots UK),OP_5HT_2764__000001_DY51QX,OPT,Unit 66,Merry Hill Centre,,Brierley Hill,West Midlands,DY5 1QX,Tel: 01384 74817, - ,,,1 rating Rate it yourself - /Services/opticians/LeaveReview/DefaultView.aspx?id=OP_5HT_2764__000001_DY51QX,,,