Organisation Name,NACS Code,Organisation Type,Address1,Address2,Address3,Address4,Address5,PostCode,Telephone Number,Opening time,Value  (Opening time),Banding Classification  (Opening time),NHS.UK users rating,Value  (NHS.UK users rating),Banding Classification  (NHS.UK users rating),Car parking (Is there car parking at this organisation?)
Boots-Knutsford,0119272__000001_WA166GR,OPT,"Unit 1, Royal George Shopping Centre",Kings Street,Kings Street,Knutsford,,WA16 6GR,Tel: 01565 631870, - ,,,No ratings yet Rate it yourself - /Services/opticians/LeaveReview/DefaultView.aspx?id=0119272__000001_WA166GR,0,0,
G Nordon-Riley,OPT_WA166DL_1,OPT,,42 King Street,,Knutsford,Cheshire,WA16 6DL,Tel: 01565 633737, - ,,,No ratings yet Rate it yourself - /Services/opticians/LeaveReview/DefaultView.aspx?id=OPT_WA166DL_1,0,0,
Wendy Diddams Optometrist,OP_5H5_12385__000001_WA166HG,OPT,,3 Minshull Street,,Knutsford,Cheshire,WA16 6HG,Tel: 01565 651121, - ,,,1 rating Rate it yourself - /Services/opticians/LeaveReview/DefaultView.aspx?id=OP_5H5_12385__000001_WA166HG,,,
Clare & Illingworth Ltd,OP_5H5_13532__000001_WA166EQ,OPT,,101 King Street,Knutsford,Cheshire,Cheshire,WA16 6EQ,Tel: 01565 632066, - ,,,No ratings yet Rate it yourself - /Services/opticians/LeaveReview/DefaultView.aspx?id=OP_5H5_13532__000001_WA166EQ,0,0,no
Dollond & Aitchison Professional Services Ltd,OP_5H4_5366__000001_CW95AG,OPT,38 Witton Street,,Northwich,Cheshire,,CW9 5AG,Tel: 01606 43087, - ,,,No ratings yet Rate it yourself - /Services/opticians/LeaveReview/DefaultView.aspx?id=OP_5H4_5366__000001_CW95AG,0,0,
Boots-Northwich - Witton St,OP_5H4_13528__000001_CW95DE,OPT,55-55a Witton Street,,Northwich,Cheshire,,CW9 5DE,Tel: 01606 40799, - ,,,No ratings yet Rate it yourself - /Services/opticians/LeaveReview/DefaultView.aspx?id=OP_5H4_13528__000001_CW95DE,0,0,
Vision Express Ltd,OP_5H4_13485__000001_CW95AU,OPT,70 High Street,,Northwich,Cheshire,,CW9 5AU,Tel: 01606 41155, - ,,,No ratings yet Rate it yourself - /Services/opticians/LeaveReview/DefaultView.aspx?id=OP_5H4_13485__000001_CW95AU,0,0,
Northwich Visionplus Limited,OP_5H4_13471__000001_CW95DD,OPT,Unit 2,39/47 High Street,Northwich,,,CW9 5DD,Tel: 01606 49779, - ,,,No ratings yet Rate it yourself - /Services/opticians/LeaveReview/DefaultView.aspx?id=OP_5H4_13471__000001_CW95DD,0,0,
Wood & Watson,OP_5CX_5775__000001_WA159SF,OPT,176 Ashley Road,Hale,Altrincham,,,WA15 9SF,Tel: 0161 941 3420, - ,,,No ratings yet Rate it yourself - /Services/opticians/LeaveReview/DefaultView.aspx?id=OP_5CX_5775__000001_WA159SF,0,0,
Hale Eyecare,OP_5CX_TSOMP1261__000002_WA142UN,OPT,140 Ashley Road,Hale,Altrincham,Cheshire,,WA14 2UN,Tel: 0161 941 5400, - ,,,No ratings yet Rate it yourself - /Services/opticians/LeaveReview/DefaultView.aspx?id=OP_5CX_TSOMP1261__000002_WA142UN,0,0,
Cheshire Eyecare,10-19391-5NG,OPT,,311 Hale Road,,Hale Barns,,WA15 8SS,, - ,,,No ratings yet Rate it yourself - /Services/opticians/LeaveReview/DefaultView.aspx?id=10-19391-5NG,0,0,
BOS Optical,OPT_CW81HH_1,OPT,,79 Chester Road,,Northwich,Cheshire,CW8 1HH,Tel: 01606 782 330, - ,,,1 rating Rate it yourself - /Services/opticians/LeaveReview/DefaultView.aspx?id=OPT_CW81HH_1,,,
Toll Optometrists,OP_5CX_8862__000001_WA142DT,OPT,9 Ashley Road,,Altrincham,,,WA14 2DT,Tel: 0161 928 0566, - ,,,3 ratings Rate it yourself - /Services/opticians/LeaveReview/DefaultView.aspx?id=OP_5CX_8862__000001_WA142DT,,,
Alderley Eyecare,OPT_SK97DY_1,OPT,,61 London Road,,Alderley Edge,,SK9 7DY,Tel: 01625 582030, - ,,,No ratings yet Rate it yourself - /Services/opticians/LeaveReview/DefaultView.aspx?id=OPT_SK97DY_1,0,0,
Susan Wright Opticians,OP_5CX_14687__000001_WA141RY,OPT,1 Regent Road,Altrincham,Cheshire,,,WA14 1RY,Tel: 0161 928 1891, - ,,,No ratings yet Rate it yourself - /Services/opticians/LeaveReview/DefaultView.aspx?id=OP_5CX_14687__000001_WA141RY,0,0,
Tesco Opticians,OP_WA159QT_34192,OPT,Tesco Superstore,Manor Road,,Altrincham,Cheshire,WA15 9QT,Tel: 0161 956 9538, - ,,,No ratings yet Rate it yourself - /Services/opticians/LeaveReview/DefaultView.aspx?id=OP_WA159QT_34192,0,0,
Ross Maskell & Associates,OP_5CX_12265__000001_WA141RP,OPT,16 Regent Road,,Altrincham,,,WA14 1RP,Tel: 0161 941 6517, - ,,,No ratings yet Rate it yourself - /Services/opticians/LeaveReview/DefaultView.aspx?id=OP_5CX_12265__000001_WA141RP,0,0,
Boots-Altrincham - George St  ,OP_5CX_5943__000001_WA141RE,OPT,60 George Street,,Cheshire,Altrincham,,WA14 1RF,Tel: 0161 928 3012, - ,,,No ratings yet Rate it yourself - /Services/opticians/LeaveReview/DefaultView.aspx?id=OP_5CX_5943__000001_WA141RE,0,0,
Specsavers Opticians,OP_5CX_3570__000001_WA141RN,OPT,95 George Street,,Altrincham,,,WA14 1RN,Tel: 0161 929 5555, - ,,,No ratings yet Rate it yourself - /Services/opticians/LeaveReview/DefaultView.aspx?id=OP_5CX_3570__000001_WA141RN,0,0,
Scrivens Ltd,OP_5CX_13027__000001_WA141EQ,OPT,52 George Street,,,Altrincham,Cheshire,WA14 1RH,Tel: 0161 941 1559, - ,,,No ratings yet Rate it yourself - /Services/opticians/LeaveReview/DefaultView.aspx?id=OP_5CX_13027__000001_WA141EQ,0,0,
Bramwells Opticians,OP_5H5_2400__000001_CW47NF,OPT,8 Macclesfield Road,,Holmes Chapel,Cheshire,,CW4 7NF,Tel: 01477 533169, - ,,,No ratings yet Rate it yourself - /Services/opticians/LeaveReview/DefaultView.aspx?id=OP_5H5_2400__000001_CW47NF,0,0,
Boots-Altrincham - George St (in Boots UK),OP_5CX_806__000002_WA141RJ,OPT,George Street,"MSU 1 Stamford Quarter, George Street",Altrincham,Altrincham,,WA14 1RJ,Tel: 0161 928 5750, - ,,,1 rating Rate it yourself - /Services/opticians/LeaveReview/DefaultView.aspx?id=OP_5CX_806__000002_WA141RJ,,,
Hearing & Vision World Ltd,OP_5H5_13497__000001_SK95HT,OPT,18 Albert Road,,Wilmslow,Cheshire,,SK9 5HT,Tel: 01625 533087, - ,,,No ratings yet Rate it yourself - /Services/opticians/LeaveReview/DefaultView.aspx?id=OP_5H5_13497__000001_SK95HT,0,0,
Toleman Ophthalmic Practice,OP_5H5_8860__000001_CW47BB,OPT,The Health Centre,London Road,,Holmes Chapel,Cheshire,CW4 7BB,Tel: 01477 537587, - ,,,6 ratings Rate it yourself - /Services/opticians/LeaveReview/DefaultView.aspx?id=OP_5H5_8860__000001_CW47BB,,,
James Doyle Opticians,OP_5H5_13465__000001_SK91NZ,OPT,53 Alderley Road,,Wilmslow,Cheshire,,SK9 1NZ,Tel: 01625 548848, - ,,,No ratings yet Rate it yourself - /Services/opticians/LeaveReview/DefaultView.aspx?id=OP_5H5_13465__000001_SK91NZ,0,0,
Dollond & Aitchison Professional Services Ltd,SK9 1NX__000001_SK91NX,OPT,16 Albert Road,,Wilmslow,Cheshire,,SK9 1NX,Tel: Unknown, - ,,,No ratings yet Rate it yourself - /Services/opticians/LeaveReview/DefaultView.aspx?id=SK9 1NX__000001_SK91NX,0,0,
Boots-Wilmslow,SK9 1JX_19282,OPT,,16 Alderley Road,,Wilmslow,Cheshire,SK9 1JX,Tel: 01625 527210, - ,,,No ratings yet Rate it yourself - /Services/opticians/LeaveReview/DefaultView.aspx?id=SK9 1JX_19282,0,0,
Visioncare Mobile Opticians Ltd,SP_5J5_3093__000001_SK164DW,OPT,28 Canterbury Road,,Hale,Altrincham,Cheshire,WA15 8PL,Tel: 0161 285 5633, - ,,,No ratings yet Rate it yourself - /Services/opticians/LeaveReview/DefaultView.aspx?id=SP_5J5_3093__000001_SK164DW,0,0,
Clare & Illingworth Ltd,OP_5H5_2749__000001_SK95AA,OPT,28 Water Lane,28 Water Lane,Wilmslow,Cheshire,,SK9 5AA,Tel: 01625 530498, - ,,,No ratings yet Rate it yourself - /Services/opticians/LeaveReview/DefaultView.aspx?id=OP_5H5_2749__000001_SK95AA,0,0,
H J Wheeldon Ltd,OP_5H5_3907__000001_SK95DD,OPT,11 Hawthorn Lane,,Wilmslow,Cheshire,,SK9 5DD,Tel: 01625 524311, - ,,,1 rating Rate it yourself - /Services/opticians/LeaveReview/DefaultView.aspx?id=OP_5H5_3907__000001_SK95DD,,,
Adcott Opticians,OPT_WA130HP_1,OPT,,14a The Cross,,Lymm,,WA13 0HP,Tel: 01925 757075, - ,,,No ratings yet Rate it yourself - /Services/opticians/LeaveReview/DefaultView.aspx?id=OPT_WA130HP_1,0,0,
Asda Opticians,OPT_WA14 5ZR,OPT,,"90, GEORGE RICHARDS WAY",BROADHEATH,ALTRINCHAM,,WA14 5ZR,Tel: 0161 6416279, - ,,,1 rating Rate it yourself - /Services/opticians/LeaveReview/DefaultView.aspx?id=OPT_WA14 5ZR,,,
CATS (Optometrist & Contact Lens Centre),OP_5H4_1374__000002_CW109AG,OPT,30-32 Wheelock Street,,,Middlewich,Cheshire,CW10 9AG,Tel: 01606 836582, - ,,,1 rating Rate it yourself - /Services/opticians/LeaveReview/DefaultView.aspx?id=OP_5H4_1374__000002_CW109AG,,,
S T & D S Jenrick,OP_5CX_14686__000002_WA157UN,OPT,230 Stockport Road,Timperley,Cheshire,,,WA15 7UN,Tel: 0161 980 6323, - ,,,No ratings yet Rate it yourself - /Services/opticians/LeaveReview/DefaultView.aspx?id=OP_5CX_14686__000002_WA157UN,0,0,
Richard Dent Opticians,OP_5CX_11064__000001_WA157UR,OPT,371-373 Stockport Road,Timperley,,Altrincham,Cheshire,WA15 7UR,Tel: 0161 904 8126, - ,,,No ratings yet Rate it yourself - /Services/opticians/LeaveReview/DefaultView.aspx?id=OP_5CX_11064__000001_WA157UR,0,0,
H & H Eyecare,OPT_WA145ZL_1,OPT,,4 Draybank Road,Broadheath,Altrincham,Cheshire,WA14 5ZL,Tel: 0161 941 5335, - ,,,No ratings yet Rate it yourself - /Services/opticians/LeaveReview/DefaultView.aspx?id=OPT_WA145ZL_1,0,0,
Jennings Opticians,OP_5AA_4559__000001_M225RQ,OPT,Unit 7 Hale Top,Civic Centre,Wythenshawe,Manchester,,M22 5RN,Tel: 0161 437 3042, - ,,,2 ratings Rate it yourself - /Services/opticians/LeaveReview/DefaultView.aspx?id=OP_5AA_4559__000001_M225RQ,,,
Specsavers Wythenshawe ,OP_5AA_8735__000002_M225RF,OPT,17 The Birtles,Wythenshawe,Manchester,,,M22 5SA,Tel: 0161 437 9252, - ,,,No ratings yet Rate it yourself - /Services/opticians/LeaveReview/DefaultView.aspx?id=OP_5AA_8735__000002_M225RF,0,0,
Looking Ahead,OP_5H4_4160__000002_CW83EU,OPT,37 Northwich Road,Weaverham,Nr Northwich,Cheshire,,CW8 3EU,Tel: 01606 853300, - ,,,No ratings yet Rate it yourself - /Services/opticians/LeaveReview/DefaultView.aspx?id=OP_5H4_4160__000002_CW83EU,0,0,
Fox - Stevens Optometrists,OP_5H5_13413__000001_SK93LQ,OPT,108 Wilmslow Road,,Handforth,Cheshire,,SK9 3ES,Tel: 01625 527991, - ,,,9 ratings Rate it yourself - /Services/opticians/LeaveReview/DefaultView.aspx?id=OP_5H5_13413__000001_SK93LQ,,,
Tesco Opticians,ESP051__000002_M239TJ,OPT,Altrincham Road,Baguley,,Manchester,,M23 9TJ,Tel: 0345 601 3479, - ,,,No ratings yet Rate it yourself - /Services/opticians/LeaveReview/DefaultView.aspx?id=ESP051__000002_M239TJ,0,0,
W H Ashworth & Son,OP_5F7_8072__000002_SK83QA,OPT,214 Finney Lane,Heald Green,Cheadle,,,SK8 3QA,Tel: 0161 437 3400, - ,,,1 rating Rate it yourself - /Services/opticians/LeaveReview/DefaultView.aspx?id=OP_5F7_8072__000002_SK83QA,,,
F S L Opticians,OP_5AA_6834__000003_M229UE,OPT,166 Hollyhedge Road,Benchill,Manchester,,,M22 9UE,Tel: 0161 998 0269, - ,,,No ratings yet Rate it yourself - /Services/opticians/LeaveReview/DefaultView.aspx?id=OP_5AA_6834__000003_M229UE,0,0,
Tesco Stores Ltd,SK9 3PA__000002_SK93PA,OPT,Kiln Croft Lane,,Handforth,Cheshire,,SK9 3PA,Tel: 0345 601 3479, - ,,,No ratings yet Rate it yourself - /Services/opticians/LeaveReview/DefaultView.aspx?id=SK9 3PA__000002_SK93PA,0,0,
Bramwells Opticians,OP_5H4_2399__000001_CW72AD,OPT,62 High Street,,Winsford,Cheshire,,CW7 2AD,Tel: 01606 593270, - ,,,No ratings yet Rate it yourself - /Services/opticians/LeaveReview/DefaultView.aspx?id=OP_5H4_2399__000001_CW72AD,0,0,
Winsford Visionplus Limited,CW7 1AE__000003_CW71AE,OPT,4 Queens Parade,,Winsford,Cheshire,,CW7 1AE,Tel: 01606 541510, - ,,,No ratings yet Rate it yourself - /Services/opticians/LeaveReview/DefaultView.aspx?id=CW7 1AE__000003_CW71AE,0,0,
Optical Opticians,OP_5J2_11015__000002_WA41JY,OPT,715 Knutsford Road,Warrington,Cheshire,,,WA4 1JY,Tel: 01925 636696, - ,,,No ratings yet Rate it yourself - /Services/opticians/LeaveReview/DefaultView.aspx?id=OP_5J2_11015__000002_WA41JY,0,0,
ASDA opticians,CW71BD041116,OPT,,The drumber,,Winsford,,CW7 1BD,Tel: 01606 596 412, - ,,,No ratings yet Rate it yourself - /Services/opticians/LeaveReview/DefaultView.aspx?id=CW71BD041116,0,0,
L R & E A Taylor,OP_5H4_10968__000002_CW71AE,OPT,,4 Dene Drive,Winsford,Cheshire,,CW7 1BP,Tel: 01606 551093, - ,,,No ratings yet Rate it yourself - /Services/opticians/LeaveReview/DefaultView.aspx?id=OP_5H4_10968__000002_CW71AE,0,0,yes
Hantman Eye Care,OP_5F7_6933__000003_SK86AW,OPT,122 Turves Road,Cheadle Hulme,Cheadle,Stockport,Cheshire,SK8 6AW,Tel: 0161 488 4846, - ,,,1 rating Rate it yourself - /Services/opticians/LeaveReview/DefaultView.aspx?id=OP_5F7_6933__000003_SK86AW,,,
Optique ,OP_5F7_6932__000001_SK84BB,OPT,179 Gatley Road,Gatley,Cheadle,Cheadle,,SK8 4BB,Tel: 0161 428 4858, - ,,,2 ratings Rate it yourself - /Services/opticians/LeaveReview/DefaultView.aspx?id=OP_5F7_6932__000001_SK84BB,,,
Specsavers Opticians,OP_5CX_14695__000001_M331XW,OPT,16 Market Walk,Town Square,Sale,,,M33 7ZZ,Tel: 0161 969 2001, - ,,,No ratings yet Rate it yourself - /Services/opticians/LeaveReview/DefaultView.aspx?id=OP_5CX_14695__000001_M331XW,0,0,
"Haggerty, Clare",OP_5CX_3446__000003_M333HF,OPT,111 Northenden Road,Sale,Cheshire,,,M33 3HF,Tel: 0161 973 5065, - ,,,3 ratings Rate it yourself - /Services/opticians/LeaveReview/DefaultView.aspx?id=OP_5CX_3446__000003_M333HF,,,
Taylors Optometrists,OPT_CW71BP_1,OPT,,4 Dene Drive,,Winsford,,CW7 1BP,Tel: 01606 551 093, - ,,,No ratings yet Rate it yourself - /Services/opticians/LeaveReview/DefaultView.aspx?id=OPT_CW71BP_1,0,0,
Boots-Sale,OP_5CX_12033__000001_M331YE,OPT,33 School Road,,,Sale,Cheshire,M33 7YE,Tel: 0161 973 3454, - ,,,No ratings yet Rate it yourself - /Services/opticians/LeaveReview/DefaultView.aspx?id=OP_5CX_12033__000001_M331YE,0,0,
Maloney Opticians,OP_5CX_11228__000001_M337XF,OPT,28 School Road,,Sale,,,M33 7XF,Tel: 0161 905 1104, - ,,,2 ratings Rate it yourself - /Services/opticians/LeaveReview/DefaultView.aspx?id=OP_5CX_11228__000001_M337XF,,,
David Arnold Opticians,OP_5CX_14693__000002_M335PN,OPT,17 Green Lane,Sale,Cheshire,Manchester,,M33 5PN,Tel: 0161 973 3674, - ,,,No ratings yet Rate it yourself - /Services/opticians/LeaveReview/DefaultView.aspx?id=OP_5CX_14693__000002_M335PN,0,0,
Vision Service Opticians,OP_5AA_11065__000001_M224FY,OPT,379 Palatine Road,Northenden,Manchester,,,M22 4FY,Tel: 0161 998 7874, - ,,,No ratings yet Rate it yourself - /Services/opticians/LeaveReview/DefaultView.aspx?id=OP_5AA_11065__000001_M224FY,0,0,
Martin J. Berry Opticians,OP_5J2_11173__000003_WA46SG,OPT,33 London Road,Stockton Heath,Warrington,Cheshire,,WA4 6SG,Tel: 01925 861851, - ,,,No ratings yet Rate it yourself - /Services/opticians/LeaveReview/DefaultView.aspx?id=OP_5J2_11173__000003_WA46SG,0,0,
Integrated Optical Limited,OP_5J2_9746__000001_WA11SL,OPT,10 The Forge Shopping Centre,London Road,Stockton Heath,Warrington,,WA4 6HW,Tel: 01925 630018, - ,,,No ratings yet Rate it yourself - /Services/opticians/LeaveReview/DefaultView.aspx?id=OP_5J2_9746__000001_WA11SL,0,0,
Mullens Opticians,OP_5J2_9150__000003_WA46HW,OPT,10 The Forge Shopping Centre,London Road,Stockton Heath,Warrington,,WA4 6HW,Tel: 01925 268608, - ,,,2 ratings Rate it yourself - /Services/opticians/LeaveReview/DefaultView.aspx?id=OP_5J2_9150__000003_WA46HW,,,
Winsford Eye & Foot Care,OPT_CW72LX_1,OPT,,27 Delamere Street,,Winsford,,CW7 2LX,Tel: 01606 599 030, - ,,,No ratings yet Rate it yourself - /Services/opticians/LeaveReview/DefaultView.aspx?id=OPT_CW72LX_1,0,0,
Mrs S French-Teeling,OP_5F7_13259__000001_SK81DW,OPT,2 Rectory Court,13 Wilmslow Road,,Cheadle,,SK8 1DW,Tel: 0161 491 4271, - ,,,No ratings yet Rate it yourself - /Services/opticians/LeaveReview/DefaultView.aspx?id=OP_5F7_13259__000001_SK81DW,0,0,
W H Ashworth & Son,OP_5F7_3157__000002_SK81DW,OPT,19 Wilmslow Road,,Cheadle,,,SK8 1DW,Tel: 0161 428 3717, - ,,,No ratings yet Rate it yourself - /Services/opticians/LeaveReview/DefaultView.aspx?id=OP_5F7_3157__000002_SK81DW,0,0,
PSM VIsion Services Ltd,OL/CO-3338/5J2__000002_WA46SR,OPT,Walton Lodge,Hill Cliffe Road,Walton,Warrington,,WA4 6NU,Tel: 01925 210006, - ,,,No ratings yet Rate it yourself - /Services/opticians/LeaveReview/DefaultView.aspx?id=OL/CO-3338/5J2__000002_WA46SR,0,0,
Alan Miller Ltd,OP_5F5_4645__000001_M445AA,OPT,,596 Liverpool Road,Irlam,Manchester,Lancashire,M44 5AA,Tel: 0161 775 2238, - ,,,No ratings yet Rate it yourself - /Services/opticians/LeaveReview/DefaultView.aspx?id=OP_5F5_4645__000001_M445AA,0,0,
Asda Vision Centre Ltd,OP_5J2_0001__000002_WA37PG,OPT,Birchwood Centre,Dewhurst Road,Warrington,Cheshire,,WA3 7PG,Tel: 01925 820797, - ,,,No ratings yet Rate it yourself - /Services/opticians/LeaveReview/DefaultView.aspx?id=OP_5J2_0001__000002_WA37PG,0,0,
A.H. Mertons,OP_5J2_5608__000001_WA37PG,OPT,19 Dewhurst Road,Birchwood Shopping Centre,Birchwood,Warrington,Cheshire,WA3 7PG,Tel: 01925 810884, - ,,,No ratings yet Rate it yourself - /Services/opticians/LeaveReview/DefaultView.aspx?id=OP_5J2_5608__000001_WA37PG,0,0,
Mrs L Sheikholeslami (Domiciliary Only),OP_5F7_13781__000001_SK71HX,OPT,39 Patch Lane,Bramhall,Stockport,Stockport,,SK7 1HX,Tel: 0161 439 8029, - ,,,No ratings yet Rate it yourself - /Services/opticians/LeaveReview/DefaultView.aspx?id=OP_5F7_13781__000001_SK71HX,0,0,
Boots-Cheadle,88888__000001_SK81AY,OPT,15 High Street,Cheadle,Cheshire,Cheshire,,SK8 1AX,Tel: 0161 495 7217, - ,,,1 rating Rate it yourself - /Services/opticians/LeaveReview/DefaultView.aspx?id=88888__000001_SK81AY,,,
Station Road Opticians,,OPT,,"8a Station Road, Cheadle Hulme",,Cheadle,,SK8 5AE,Tel: 0161 4100051, - ,,,N/A - Data not available,,,
Valli Opticians Cheadle Hulme,J9U9Z,OPT,,21B The Shopping Centre,,Cheadle Hulme,Hampshire,SK8 5BB,Tel: 01614851164, - ,,,2 ratings Rate it yourself - /Services/opticians/LeaveReview/DefaultView.aspx?id=J9U9Z,,,
Your Home Eyecare,SK11 8TQ__000002_SK118TQ,OPT,1 Tenby Road,,Macclesfield,Cheshire,,SK11 8TQ,Tel: 0800 952 0064, - ,,,No ratings yet Rate it yourself - /Services/opticians/LeaveReview/DefaultView.aspx?id=SK11 8TQ__000002_SK118TQ,0,0,
H J Wheeldon Ltd,OP_5F7_3664__000001_SK82AA,OPT,4 Stockport Road,,Cheadle,,,SK8 2AA,Tel: 0161 428 2396, - ,,,No ratings yet Rate it yourself - /Services/opticians/LeaveReview/DefaultView.aspx?id=OP_5F7_3664__000001_SK82AA,0,0,
Jinkinson Opticians,OP_5F7_8504__000001_SK71AW,OPT,21 The Bramhall Centre,Bramhall,,Stockport,Lancashire,SK7 1AW,Tel: 0161 440 9845, - ,,,1 rating Rate it yourself - /Services/opticians/LeaveReview/DefaultView.aspx?id=OP_5F7_8504__000001_SK71AW,,,
Boots-Bramhall,OP_5F7_12739__000001_SK71JN,OPT,13 Woodford Road,,,Bramhill,Cheshire,SK7 1JN,Tel: 0161 439 1770, - ,,,No ratings yet Rate it yourself - /Services/opticians/LeaveReview/DefaultView.aspx?id=OP_5F7_12739__000001_SK71JN,0,0,
IN-HOUSE MOBILE OPTICIANS,5NG8069__000001_WA46SR,OPT,Exec Suite 16,St James Business Centre,Wilderspool Causeway,Warrington,Cheshire,WA4 6PS,Tel: 01925 210006, - ,,,40 ratings Rate it yourself - /Services/opticians/LeaveReview/DefaultView.aspx?id=5NG8069__000001_WA46SR,,,
Optique,OP_5F7_8778__000002_SK71AH,OPT,30a Bramhall Lane South,Bramhall,,Stockport,,SK7 1AH,Tel: 0161 440 9700, - ,,,No ratings yet Rate it yourself - /Services/opticians/LeaveReview/DefaultView.aspx?id=OP_5F7_8778__000002_SK71AH,0,0,
Boots-Sandbach,OP_5H4_4093__000001_CW110DA,OPT,Unit 4,10 Congleton Road,,Sandbach,,CW11 1HJ,Tel: 01270 766870, - ,,,1 rating Rate it yourself - /Services/opticians/LeaveReview/DefaultView.aspx?id=OP_5H4_4093__000001_CW110DA,,,
Boots Opticians,OPT_CW111JH_1,OPT,,Unit 4 10 Congleton Road,,Sandbach,,CW11 1HJ,Tel: 01270 766 870, - ,,,1 rating Rate it yourself - /Services/opticians/LeaveReview/DefaultView.aspx?id=OPT_CW111JH_1,,,
Steven D Morris Opticians,OP_5H4_13468__000001_CW111GT,OPT,2 Welles Street,,Sandbach,Cheshire,,CW11 1GT,Tel: 01270 765848, - ,,,No ratings yet Rate it yourself - /Services/opticians/LeaveReview/DefaultView.aspx?id=OP_5H4_13468__000001_CW111GT,0,0,
Bramwells Opticians,OP_5H4_2395__000001_CW111AB,OPT,4 Hightown,,Sandbach,Cheshire,,CW11 1AB,Tel: 01270 763641, - ,,,No ratings yet Rate it yourself - /Services/opticians/LeaveReview/DefaultView.aspx?id=OP_5H4_2395__000001_CW111AB,0,0,
Jo Padmore Eyewear ,000012__000001_M202DR,OPT,790 Wilmslow Road,Didsbury,Manchester,,,M20 2DR,Tel: 0161 445 8855, - ,,,1 rating Rate it yourself - /Services/opticians/LeaveReview/DefaultView.aspx?id=000012__000001_M202DR,,,
KS Opticians,232323__000001_WA12AP,OPT,Cockhedge Shopping Park,Unit 11,Cockhedge Way,Warrington,Cheshire,WA1 2QQ,Tel: 01925 232918, - ,,,No ratings yet Rate it yourself - /Services/opticians/LeaveReview/DefaultView.aspx?id=232323__000001_WA12AP,0,0,
Conway Phillips Ltd,OP_5J2_4589__000001_WA12LZ,OPT,31 Buttermarket Street,Warrington,Cheshire,,,WA1 2LZ,Tel: 01925 633746, - ,,,No ratings yet Rate it yourself - /Services/opticians/LeaveReview/DefaultView.aspx?id=OP_5J2_4589__000001_WA12LZ,0,0,
Paul Rowlands Opticians,OP_5H4_4304__000001_CW111AR,OPT,2 Georges Walk,Off High Street,Sandbach,,,CW11 1AR,Tel: 01270 759916, - ,,,1 rating Rate it yourself - /Services/opticians/LeaveReview/DefaultView.aspx?id=OP_5H4_4304__000001_CW111AR,,,
Thomas Carter Opticians,OP_5F6_10478__000001_M419JN,OPT,4 Station Road,Urmston,Manchester,,,M41 9JN,Tel: 0161 747 5555, - ,,,2 ratings Rate it yourself - /Services/opticians/LeaveReview/DefaultView.aspx?id=OP_5F6_10478__000001_M419JN,,,
Asda Opticians,OPT_WA1 2QA,OPT,,COCKHEDGE CENTRE,TILLY LANE,WARRINGTON,,WA1 2QA,Tel: 00000 000000, - ,,,1 rating Rate it yourself - /Services/opticians/LeaveReview/DefaultView.aspx?id=OPT_WA1 2QA,,,
Rabin Opticians,OP_5F6_3740__000001_M415BG,OPT,138 Flixton Road,Urmston,Manchester,,,M41 5BG,Tel: 0161 748 2501, - ,,,4 ratings Rate it yourself - /Services/opticians/LeaveReview/DefaultView.aspx?id=OP_5F6_3740__000001_M415BG,,,
Didsbury Eyecare ,OP_5AA_5181__000001_M200RH,OPT,717 Wilmslow Road,Didsbury,Manchester,,,M20 6WF,Tel: 0161 445 7668, - ,,,1 rating Rate it yourself - /Services/opticians/LeaveReview/DefaultView.aspx?id=OP_5AA_5181__000001_M200RH,,,
R A Shaw Opticians,OP_5J2_1007__000001_WA11DN,OPT,7 Bold Street,Warrington,Cheshire,,,WA1 1DN,Tel: 01925 632516, - ,,,No ratings yet Rate it yourself - /Services/opticians/LeaveReview/DefaultView.aspx?id=OP_5J2_1007__000001_WA11DN,0,0,
Specsavers Opticians,OP_5J2_507__000001_WA11TD,OPT,34 Sankey Street,Golden Square Shopping Centre,Warrington,Cheshire,,WA1 1TD,Tel: 01925 240351, - ,,,2 ratings Rate it yourself - /Services/opticians/LeaveReview/DefaultView.aspx?id=OP_5J2_507__000001_WA11TD,,,
Leeming MJ Opticians,OP_5AA_9833__000001_M206RD,OPT,1a School Lane,Didsbury,Manchester,,,M20 6RD,Tel: 0161 445 5307, - ,,,1 rating Rate it yourself - /Services/opticians/LeaveReview/DefaultView.aspx?id=OP_5AA_9833__000001_M206RD,,,
David Lundstram Opticians,OP_WA11SL_30098,OPT,,45 Sankey Street,,Warrington,,WA1 1SL,Tel: 01925 630018, - ,,,7 ratings Rate it yourself - /Services/opticians/LeaveReview/DefaultView.aspx?id=OP_WA11SL_30098,,,
SPECSCART URMSTON,A7H3D,OPT,,"UNIT-9A, EDEN SQUARE SHOPPING CENTRE",,Manchester,,M41 0NA,Tel: 01613125758, - ,,,No ratings yet Rate it yourself - /Services/opticians/LeaveReview/DefaultView.aspx?id=A7H3D,0,0,
Stotts Opticans,OP_5F6_2039__000001_M410TS,OPT,8 Crofts Bank Road,Urmston,Manchester,,,M41 0TS,Tel: 0161 747 3753, - ,,,No ratings yet Rate it yourself - /Services/opticians/LeaveReview/DefaultView.aspx?id=OP_5F6_2039__000001_M410TS,0,0,
Boots-Warrington - Golden Sq,OP_5J2_12288__000001_WA12LJ,OPT,"Unit SU35, Golden Square",,,Warrington,Cheshire,WA1 1QP,Tel: 01925 413999, - ,,,No ratings yet Rate it yourself - /Services/opticians/LeaveReview/DefaultView.aspx?id=OP_5J2_12288__000001_WA12LJ,0,0,
Vision Express,OPT_WA11QP_1,OPT,,Unit 43 The Mall,,Warrington,,WA1 1QP,Tel: 01925 633444, - ,,,No ratings yet Rate it yourself - /Services/opticians/LeaveReview/DefaultView.aspx?id=OPT_WA11QP_1,0,0,
Travers Opticians,OP_5F6_8736__000002_M418TW,OPT,473 Moorside Road,Urmston,Manchester,,,M41 8TW,Tel: 0161 746 8098, - ,,,No ratings yet Rate it yourself - /Services/opticians/LeaveReview/DefaultView.aspx?id=OP_5F6_8736__000002_M418TW,0,0,