Organisation Name,NACS Code,Organisation Type,Address1,Address2,Address3,Address4,Address5,PostCode,Telephone Number,Opening time,Value  (Opening time),Banding Classification  (Opening time),NHS.UK users rating,Value  (NHS.UK users rating),Banding Classification  (NHS.UK users rating),Car parking (Is there car parking at this organisation?)
Vision Express,OLC018815LA__000002_W86SU,OPT,,159 High Street,Kensington,London,,W8 6SU,Tel: 0207 937 9911, - ,,,No ratings yet Rate it yourself - /Services/opticians/LeaveReview/DefaultView.aspx?id=OLC018815LA__000002_W86SU,0,0,
Boots-Kensington - High St (in Boots UK),OP_5LA_1716__000002_W85SF,OPT,127a Kensington High Street,,Kensington,London,,W8 5SF,Tel: 020 7937 0298, - ,,,2 ratings Rate it yourself - /Services/opticians/LeaveReview/DefaultView.aspx?id=OP_5LA_1716__000002_W85SF,,,
David Faulder Opticians,OP_5LA_12254__000001_W87RG,OPT,218 Kensington High Street,,London,,,W8 7RG,Tel: 020 7937 8790, - ,,,1 rating Rate it yourself - /Services/opticians/LeaveReview/DefaultView.aspx?id=OP_5LA_12254__000001_W87RG,,,
David Clulow Opticians,OP_5LA_584__000001_W84SG,OPT,82 Kensington High Street,Kensington,London,,,W8 4SG,Tel: 020 7937 1984, - ,,,7 ratings Rate it yourself - /Services/opticians/LeaveReview/DefaultView.aspx?id=OP_5LA_584__000001_W84SG,,,
Bromptons Opticians,OP_5LA_4837__000002_W87RG,OPT,,84 Kensington High Street,,London,,W8 4SG,Tel: 020 7937 5500, - ,,,No ratings yet Rate it yourself - /Services/opticians/LeaveReview/DefaultView.aspx?id=OP_5LA_4837__000002_W87RG,0,0,
Specs Of Kensington,-645LA__000001_W86EJ,OPT,36 Earls Court Road,,,London,,W8 6EJ,Tel: 020 7938 1251, - ,,,No ratings yet Rate it yourself - /Services/opticians/LeaveReview/DefaultView.aspx?id=-645LA__000001_W86EJ,0,0,
Kensington Eye Centre Ltd,OP_5LA_9809__000001_W84LL,OPT,37 Kensington Church Street,London,W8 4LL,www.kensingtoneyecentre.com,,W8 4LL,Tel: 020 7937 8282, - ,,,No ratings yet Rate it yourself - /Services/opticians/LeaveReview/DefaultView.aspx?id=OP_5LA_9809__000001_W84LL,0,0,
Chatoo & Co Ltd,OP_5LA_1228__000002_W86ND,OPT,258 Kensington High Street,,London,,,W8 6ND,Tel: 020 7602 3065, - ,,,1 rating Rate it yourself - /Services/opticians/LeaveReview/DefaultView.aspx?id=OP_5LA_1228__000002_W86ND,,,
Boots-Kensington - High St,OP_5LA_13145__000001_W85NP,OPT,13 High Street,,Kensington,London,,W8 5NP,Tel: 0207 937 0666, - ,,,No ratings yet Rate it yourself - /Services/opticians/LeaveReview/DefaultView.aspx?id=OP_5LA_13145__000001_W85NP,0,0,
Kensington Cromwell Road Specsavers Ltd,TP9AQ,OPT,,158A Cromwell Road,,London,,SW7 4EJ,Tel: 02073417683, - ,,,1 rating Rate it yourself - /Services/opticians/LeaveReview/DefaultView.aspx?id=TP9AQ,,,
H A Curran,5LA0116718__000002_SW74QT,OPT,44 Gloucester Road,,London,,,SW7 4QT,Tel: 020 7584 2697, - ,,,No ratings yet Rate it yourself - /Services/opticians/LeaveReview/DefaultView.aspx?id=5LA0116718__000002_SW74QT,0,0,
Dollond & Aitchison,OP_5LA_13371__000001_W113HT,OPT,70 Notting Hill Gate,,London,,,W11 3HT,Tel: 020 7229 2681, - ,,,No ratings yet Rate it yourself - /Services/opticians/LeaveReview/DefaultView.aspx?id=OP_5LA_13371__000001_W113HT,0,0,
Notting Hill Gate Opticians,W113JE_11111,OPT,Notting Hill Gate Opticians,18 Notting Hill Gate,,London,,W11 3JE,Tel: 020 7243 6219, - ,,,6 ratings Rate it yourself - /Services/opticians/LeaveReview/DefaultView.aspx?id=W113JE_11111,,,
University Vision ,OL01235225LC__000002_SW72AZ,OPT,Imperial College,The Walkway Level 2,Shefield Building,Exhibition Road,,SW7 2AZ,Tel: 020 7594 9746, - ,,,No ratings yet Rate it yourself - /Services/opticians/LeaveReview/DefaultView.aspx?id=OL01235225LC__000002_SW72AZ,0,0,
The Eye Establishment,TP8GN,OPT,,227-229 Old Brompton Road,,London,,SW5 0EA,, - ,,,1 rating Rate it yourself - /Services/opticians/LeaveReview/DefaultView.aspx?id=TP8GN,,,
Zafash Opticians,606231__000002_SW50EA,OPT,231b Old Brompton Road,,London,,,SW5 0EA,Tel: 020 7373 7755, - ,,,No ratings yet Rate it yourself - /Services/opticians/LeaveReview/DefaultView.aspx?id=606231__000002_SW50EA,0,0,
New Vision ,34300__000003_W23RL,OPT,80 Queensway,Bayswater,London,,,W2 3RL,Tel: 020 7229 7799, - ,,,No ratings yet Rate it yourself - /Services/opticians/LeaveReview/DefaultView.aspx?id=34300__000003_W23RL,0,0,
David Clulow Opticians,2035LA__000002_W112AB,OPT,38 Ledbury Road,Notting Hill,London,,,W11 2AB,Tel: 020 7243 6877, - ,,,No ratings yet Rate it yourself - /Services/opticians/LeaveReview/DefaultView.aspx?id=2035LA__000002_W112AB,0,0,
Joy Optical,OP_5LA_264__000001_SW73DL,OPT,8 Old Brompton Road,8 Old Brompton Road,London,London,,SW7 3DL,Tel: 020 7584 4172, - ,,,No ratings yet Rate it yourself - /Services/opticians/LeaveReview/DefaultView.aspx?id=OP_5LA_264__000001_SW73DL,0,0,
Abbot Opticians,OP_5LA_13378__000001_SW72NA,OPT,13 The Arcade,South Kensington Station,London,,,SW7 2NA,Tel: 020 7581 2330, - ,,,No ratings yet Rate it yourself - /Services/opticians/LeaveReview/DefaultView.aspx?id=OP_5LA_13378__000001_SW72NA,0,0,
Vision Express Opticians,OP_5LC_606__000001_W24YQ,OPT,Unit 4 - Whiteleys Centre,Queensway,London,,,W2 4YQ,Tel: 0207 727 1888, - ,,,No ratings yet Rate it yourself - /Services/opticians/LeaveReview/DefaultView.aspx?id=OP_5LC_606__000001_W24YQ,0,0,
Specsavers Opticians,000-500__000001_W26LY,OPT,148 Queensway,Bayswater,London,,,W2 6LY,Tel: 020 7985 7410, - ,,,No ratings yet Rate it yourself - /Services/opticians/LeaveReview/DefaultView.aspx?id=000-500__000001_W26LY,0,0,
Optichic Optician,OP_5LC_13401__000001_W26BG,OPT,83 Bishops Bridge Road,,London,,,W2 6BG,Tel: 020 7229 8399, - ,,,1 rating Rate it yourself - /Services/opticians/LeaveReview/DefaultView.aspx?id=OP_5LC_13401__000001_W26BG,,,
Specsavers Opticians,OP_5H1_8637__000002_W128LR,OPT,106 Uxbridge Road,Shepherds Bush,London,,,W12 8LR,Tel: 020 8735 5890, - ,,,No ratings yet Rate it yourself - /Services/opticians/LeaveReview/DefaultView.aspx?id=OP_5H1_8637__000002_W128LR,0,0,
Isis Opticians,OP_5LA_13985__000001_SW36SN,OPT,153c Fulham Road,,London,,,SW3 6SN,Tel: 020 7823 8080, - ,,,No ratings yet Rate it yourself - /Services/opticians/LeaveReview/DefaultView.aspx?id=OP_5LA_13985__000001_SW36SN,0,0,
Specsavers Opticians,OP_5H1_13865__000002_SW61NP,OPT,387 North End Road,Fulham,,London,,SW6 1NP,Tel: 020 7471 0390, - ,,,4 ratings Rate it yourself - /Services/opticians/LeaveReview/DefaultView.aspx?id=OP_5H1_13865__000002_SW61NP,,,
Thomas H Collison Ltd,OP_5LA_9283__000001_SW109NH,OPT,Chelsea and Westminster Hospital,369 Fulham Road,London,London,,SW10 9NH,Tel: 020 3315 8886, - ,,,2 ratings Rate it yourself - /Services/opticians/LeaveReview/DefaultView.aspx?id=OP_5LA_9283__000001_SW109NH,,,
Shepherds Bush Eye Centre,OP_5H1_12685__000001_W128AA,OPT,166 Uxbridge Road,Shepherds Bush,,London,,W12 8AA,Tel: 020 8740 7100, - ,,,No ratings yet Rate it yourself - /Services/opticians/LeaveReview/DefaultView.aspx?id=OP_5H1_12685__000001_W128AA,0,0,
Optical Express,W12 7GF_22222,OPT,"Unit 2121, Westfield London Shopping Centre",Ariel Way,,London,,W12 7GF,Tel: 0800 023 2020, - ,,,5 ratings Rate it yourself - /Services/opticians/LeaveReview/DefaultView.aspx?id=W12 7GF_22222,,,
Boots-London - White City,W12 7GB_19187,OPT,,White City Shopping Centre,Ariel Way,London,,W12 7GB,Tel: 0208 7438432, - ,,,No ratings yet Rate it yourself - /Services/opticians/LeaveReview/DefaultView.aspx?id=W12 7GB_19187,0,0,
36 Opticians,OLO98315LA__000001_SW31NU,OPT,36 Beauchamp Place,,London,,,SW3 1NU,Tel: 020 7581 6336, - ,,,No ratings yet Rate it yourself - /Services/opticians/LeaveReview/DefaultView.aspx?id=OLO98315LA__000001_SW31NU,0,0,
Aristone Opticians,OP_5H1_2309__000001_SW61LY,OPT,356 North End Road,Fulham,London,,,SW6 1LY,Tel: 020 7385 9772, - ,,,6 ratings Rate it yourself - /Services/opticians/LeaveReview/DefaultView.aspx?id=OP_5H1_2309__000001_SW61LY,,,
David Clulow Opticians,OP_5LC_7__000006_SW1X7XL,OPT,87-135 Brompton Road,Knightsbridge,London,,,SW1X 7XL,Tel: 020 7893 8840, - ,,,No ratings yet Rate it yourself - /Services/opticians/LeaveReview/DefaultView.aspx?id=OP_5LC_7__000006_SW1X7XL,0,0,
Vision Care for Homeless People,TP6ER,OPT,,The Broadway Centre,,London,,W12 8EZ,Tel: 020 8735 5810, - ,,,No ratings yet Rate it yourself - /Services/opticians/LeaveReview/DefaultView.aspx?id=TP6ER,0,0,
David Clulow,OP_5H1_310__000002_W69YD,OPT,Unit 2 Broadway Shopping Centre,Hammersmith Broadway,London,,,W6 9YD,Tel: 020 8741 2468, - ,,,No ratings yet Rate it yourself - /Services/opticians/LeaveReview/DefaultView.aspx?id=OP_5H1_310__000002_W69YD,0,0,
Kensington Eye Centre,OP_5LA_11475__000001_W105NB,OPT,154 Ladbroke Grove,,London,,,W10 5NB,Tel: 020 8969 4326, - ,,,No ratings yet Rate it yourself - /Services/opticians/LeaveReview/DefaultView.aspx?id=OP_5LA_11475__000001_W105NB,0,0,
Lauder and Rees Ophthalmic Opticians ,OLCO-18405H1__000004_W68RF,OPT,Charing Cross Hospital,Fulham Palace Road,,Hammersmith,,W6 8RF,Tel: 020 8741 1570, - ,,,No ratings yet Rate it yourself - /Services/opticians/LeaveReview/DefaultView.aspx?id=OLCO-18405H1__000004_W68RF,0,0,
Boots-Hammersmith - King St,OP_5H1_34__000001_W69HR,OPT,1-15 King Street,,Hammersmith,London,,W6 9HR,Tel: 0208 741 7061, - ,,,1 rating Rate it yourself - /Services/opticians/LeaveReview/DefaultView.aspx?id=OP_5H1_34__000001_W69HR,,,
Lauder & Rees Optician,OP_5LC_2522__000001_W21RL,OPT,119 Praed Street,,London,,,W2 1RW,Tel: 020 7262 2514, - ,,,2 ratings Rate it yourself - /Services/opticians/LeaveReview/DefaultView.aspx?id=OP_5LC_2522__000001_W21RL,,,
David Clulow Opticians,OP_5LA_9869__000001_SW35EB,OPT,185 Kings Road,,London,,,SW3 5EB,Tel: 020 7376 5733, - ,,,No ratings yet Rate it yourself - /Services/opticians/LeaveReview/DefaultView.aspx?id=OP_5LA_9869__000001_SW35EB,0,0,
Chelsea Eye Centre,OP_5LA_2527__000001_SW34UP,OPT,176 Kings Road,,London,,,SW3 4UP,Tel: 020 7351 3847, - ,,,2 ratings Rate it yourself - /Services/opticians/LeaveReview/DefaultView.aspx?id=OP_5LA_2527__000001_SW34UP,,,
Auerbach & Steele,OP_5LA_3188__000001_SW34PW,OPT,129 Kings Road,,,London,,SW3 4PW,Tel: 020 7349 0001, - ,,,No ratings yet Rate it yourself - /Services/opticians/LeaveReview/DefaultView.aspx?id=OP_5LA_3188__000001_SW34PW,0,0,
Specsavers Opticians,OP_5H1_5763__000002_W60QB,OPT,29 Kings Mall,King Street,Hammersmith,,,W6 0PZ,Tel: 020 8748 3233, - ,,,No ratings yet Rate it yourself - /Services/opticians/LeaveReview/DefaultView.aspx?id=OP_5H1_5763__000002_W60QB,0,0,
Boots Opticians Ltd,OP_5H1_9655__000002_W60PZ,OPT,Unit 6 Kings Mall,King Street,Hammersmith,,,W6 0PZ,Tel: 020 8748 4453, - ,,,No ratings yet Rate it yourself - /Services/opticians/LeaveReview/DefaultView.aspx?id=OP_5H1_9655__000002_W60PZ,0,0,
L C Hall,OP_5H1_2487__000002_W69PA,OPT,202 Fulham Palace Road,Hammersmith,London,,,W6 9PA,Tel: 020 7385 4821, - ,,,2 ratings Rate it yourself - /Services/opticians/LeaveReview/DefaultView.aspx?id=OP_5H1_2487__000002_W69PA,,,
Lynch Opticians,OP_5H1_805__000001_W127JA,OPT,264 Uxbridge Road,Shepherds Bush,London,,,W12 7JA,Tel: 020 8743 4034, - ,,,No ratings yet Rate it yourself - /Services/opticians/LeaveReview/DefaultView.aspx?id=OP_5H1_805__000001_W127JA,0,0,
Chatoo Opticians,OP_5LC_131__000003_SW1X9JF,OPT,25f Lowndes Street,,London,,,SW1X 9JF,Tel: 020 7235 2783, - ,,,No ratings yet Rate it yourself - /Services/opticians/LeaveReview/DefaultView.aspx?id=OP_5LC_131__000003_SW1X9JF,0,0,
Dollond & Aitchison,OP_5LA_962__000001_SW1X9AS,OPT,127a Sloane Street,,London,,,SW1X 9AS,Tel: 020 7730 4870, - ,,,No ratings yet Rate it yourself - /Services/opticians/LeaveReview/DefaultView.aspx?id=OP_5LA_962__000001_SW1X9AS,0,0,
Oliver Peoples,OPT_SW1X9BX_1,OPT,,151 Sloane Street,,London,,SW1X 9BX,, - ,,,No ratings yet Rate it yourself - /Services/opticians/LeaveReview/DefaultView.aspx?id=OPT_SW1X9BX_1,0,0,
Specsavers Opticians,OP_5LC_81__000003_W22HR,OPT,173 Edgware Road,,London,,,W2 2HR,Tel: 020 7706 0404, - ,,,No ratings yet Rate it yourself - /Services/opticians/LeaveReview/DefaultView.aspx?id=OP_5LC_81__000003_W22HR,0,0,
Marble Arch Medical Centre,OP_5LC_13384__000001_W21ES,OPT,215-217 Edgware Road,,London,,,W2 1ES,Tel: 020 7723 5424, - ,,,2 ratings Rate it yourself - /Services/opticians/LeaveReview/DefaultView.aspx?id=OP_5LC_13384__000001_W21ES,,,
Kensington Heights Opticians,OP_5LA_2004__000002_W105PF,OPT,22 Golborne Road,,London,,,W10 5PF,Tel: 020 8964 1080, - ,,,No ratings yet Rate it yourself - /Services/opticians/LeaveReview/DefaultView.aspx?id=OP_5LA_2004__000002_W105PF,0,0,
Eye Care Marble Arch,-425 5LC__000001_W22JE,OPT,19 Edgware Road,,London,,,W2 2JE,Tel: 020 7402 3260, - ,,,No ratings yet Rate it yourself - /Services/opticians/LeaveReview/DefaultView.aspx?id=-425 5LC__000001_W22JE,0,0,
Ronald Brown Opticians,OP_5LC_7422__000001_W93NF,OPT,393 Harrow Road,,London,,,W9 3NF,Tel: 020 8969 2564, - ,,,No ratings yet Rate it yourself - /Services/opticians/LeaveReview/DefaultView.aspx?id=OP_5LC_7422__000001_W93NF,0,0,
Braham Optician,OP_5LC_1178__000001_NW88EX,OPT,92 Church Street,,,London,,NW8 8EX,Tel: 020 7723 8307, - ,,,1 rating Rate it yourself - /Services/opticians/LeaveReview/DefaultView.aspx?id=OP_5LC_1178__000001_NW88EX,,,yes
Realeyes - The Eye Clinic,OPT_W93QH_1,OPT,Realeyes - The Eye Clinic,568 Harrow Road,,London,,W9 3QH,Tel: 020 3897 0200, - ,,,No ratings yet Rate it yourself - /Services/opticians/LeaveReview/DefaultView.aspx?id=OPT_W93QH_1,0,0,
Fulham Eye Centre,OP_5H1_1739__000002_SW65SA,OPT,698 Fulham Road,Fulham,London,,,SW6 5SA,Tel: 020 7736 4011, - ,,,3 ratings Rate it yourself - /Services/opticians/LeaveReview/DefaultView.aspx?id=OP_5H1_1739__000002_SW65SA,,,
Walters Opticians,OP_5H1_4453__000001_SW62TF,OPT,112 Wandsworth Bridge Road,Fulham,London,,,SW6 2TF,Tel: 020 7736 8721, - ,,,No ratings yet Rate it yourself - /Services/opticians/LeaveReview/DefaultView.aspx?id=OP_5H1_4453__000001_SW62TF,0,0,
Viren Jani Optometrist,OP_5LC_8471__000001_W1K2TQ,OPT,15 New Quebec Street,,London,,,W1H 7RT,Tel: 020 77247788, - ,,,No ratings yet Rate it yourself - /Services/opticians/LeaveReview/DefaultView.aspx?id=OP_5LC_8471__000001_W1K2TQ,0,0,
Vision Care For Homeless People,OP_5LC_255__000001_SW1P1NL,OPT,West London Day Centre,134-136 Seymour Place,,London,,W1H 1NT,Tel: 020 7569 5900, - ,,,No ratings yet Rate it yourself - /Services/opticians/LeaveReview/DefaultView.aspx?id=OP_5LC_255__000001_SW1P1NL,0,0,
Lauder & Rees Opticians @ The Western Eye Hospital,-1525LC__000001_NW15YE,OPT,The Western Eye Hospital,Marylebone Road,London,,,NW1 5QH,Tel: 020 7724 6530, - ,,,1 rating Rate it yourself - /Services/opticians/LeaveReview/DefaultView.aspx?id=-1525LC__000001_NW15YE,,,
Crawford Street Opticians,OLC026355LC__000001_W1H1PN,OPT,7a  Wyndham Place,37 Crawford Street,London,,,W1H 1PN,Tel: 020 7724 8033, - ,,,No ratings yet Rate it yourself - /Services/opticians/LeaveReview/DefaultView.aspx?id=OLC026355LC__000001_W1H1PN,0,0,
David Clulow Opticians,OP_5LC_46__000003_W1A1AB,OPT,4th Floor,Selfridges,400 Oxford Street,London,,W1A 1AB,Tel: 020 7318 3353, - ,,,No ratings yet Rate it yourself - /Services/opticians/LeaveReview/DefaultView.aspx?id=OP_5LC_46__000003_W1A1AB,0,0,
Visioncare London Ltd,OP_5LC_1045__000001_W1M2LB,OPT,70 Baker Street,70 Baker Street,London,London,,W1U 7LB,Tel: 020 7935 8138, - ,,,1 rating Rate it yourself - /Services/opticians/LeaveReview/DefaultView.aspx?id=OP_5LC_1045__000001_W1M2LB,,,
Paris Miki London Ltd,OP_5LC_5922__000001_W1R7HG,OPT,,Paris Miki London Ltd,19 Duke Street,London,,W1U 1DJ,Tel: 020 7935 1341, - ,,,No ratings yet Rate it yourself - /Services/opticians/LeaveReview/DefaultView.aspx?id=OP_5LC_5922__000001_W1R7HG,0,0,
David Clulow Opticians,OP_5LC_12150__000001_SW1W9SJ,OPT,Victoria Place Shopping Centre,115 Buckingham Palace Road,London,,,SW1W 9SJ,Tel: 020 7233 8848, - ,,,No ratings yet Rate it yourself - /Services/opticians/LeaveReview/DefaultView.aspx?id=OP_5LC_12150__000001_SW1W9SJ,0,0,
In-Focus Optician,OP_5LC_2003__000001_NW16AG,OPT,19 Melcombe Street,,London,,,NW1 6AG,Tel: 020 7224 7400, - ,,,1 rating Rate it yourself - /Services/opticians/LeaveReview/DefaultView.aspx?id=OP_5LC_2003__000001_NW16AG,,,
Unger and Fagan Opticians,OP_5LC_13433__000001_W1H5PA,OPT,5 George Street,,Marylebone,London,,W1U 3QQ,Tel: 020 7486 6933, - ,,,No ratings yet Rate it yourself - /Services/opticians/LeaveReview/DefaultView.aspx?id=OP_5LC_13433__000001_W1H5PA,0,0,
Boots-London - Sedley Place,OLC016075LC__000001_W1C2JL,OPT,361 Oxford Street,,,London,,W1C 2JL,Tel: 0207 491 9644, - ,,,No ratings yet Rate it yourself - /Services/opticians/LeaveReview/DefaultView.aspx?id=OLC016075LC__000001_W1C2JL,0,0,
B J Trylska,OP_5H1_13864__000001_W120NA,OPT,71 Sedgeford Road,Shepherds Bush,London,,,W12 0NA,Tel: 020 8749 0792, - ,,,No ratings yet Rate it yourself - /Services/opticians/LeaveReview/DefaultView.aspx?id=OP_5H1_13864__000001_W120NA,0,0,
David Clulow Opticians,OP_5LC_503__000001_W1M9LE,OPT,41-43 Wigmore Street,,London,,,W1U 1PR,Tel: 020 7486 1485, - ,,,1 rating Rate it yourself - /Services/opticians/LeaveReview/DefaultView.aspx?id=OP_5LC_503__000001_W1M9LE,,,
Hollands Of London,OLOTHER5LC__000001_W1G8UX,OPT,3 New Cavendish Street,,London,,,W1G 8UX,Tel: 020 7487 4267, - ,,,No ratings yet Rate it yourself - /Services/opticians/LeaveReview/DefaultView.aspx?id=OLOTHER5LC__000001_W1G8UX,0,0,
Mallon & Taub Optician,-1425LC__000001_W1U4QB,OPT,,63 Paddington Street,Marylebone,London,,W1U 4JF,Tel: 020 7935 8200, - ,,,1 rating Rate it yourself - /Services/opticians/LeaveReview/DefaultView.aspx?id=-1425LC__000001_W1U4QB,,,
Boots-London - Wigmore St,OP_5LC_568__000001_W1U1PN,OPT,35 Wigmore Street,,,London,,W1U 1PW,Tel: 0207 580 4343, - ,,,No ratings yet Rate it yourself - /Services/opticians/LeaveReview/DefaultView.aspx?id=OP_5LC_568__000001_W1U1PN,0,0,
Karen Lockyer Optometrists,07252__000002_SW113BS,OPT,98 St John's Road,Battersea,London,,,SW11 3BS,Tel: 020 7228 0467, - ,,,No ratings yet Rate it yourself - /Services/opticians/LeaveReview/DefaultView.aspx?id=07252__000002_SW113BS,0,0,
Optique Opticians,OP_5LG_11706__000001_SW113BS,OPT,276 Battersea Park Road,,Battersea,,,SW11 3BS,Tel: 0207 228 2754, - ,,,1 rating Rate it yourself - /Services/opticians/LeaveReview/DefaultView.aspx?id=OP_5LG_11706__000001_SW113BS,,,
Specsavers Fulham Wharf (Sainsbury’s),ODS: TP98Y,OPT,,"26 Townmead Road, Sands End ",,London,,SW6 2GD,, - ,,,No ratings yet Rate it yourself - /Services/opticians/LeaveReview/DefaultView.aspx?id=ODS: TP98Y,0,0,
L K Leon Optician,OP_5LC_11271__000002_W1M7RL,OPT,29 New Cavendish Street,,London,,,W1G 9TU,Tel: 020 7486 9915, - ,,,No ratings yet Rate it yourself - /Services/opticians/LeaveReview/DefaultView.aspx?id=OP_5LC_11271__000002_W1M7RL,0,0,no
Specsavers Opticians,OLO1192205LC__000001_SW1E5JH,OPT,1 Cathedral Walk,Cardinal Place Victoria,London,,,SW1E 5JH,Tel: 020 7976 4250, - ,,,No ratings yet Rate it yourself - /Services/opticians/LeaveReview/DefaultView.aspx?id=OLO1192205LC__000001_SW1E5JH,0,0,
Ellerman Optician,OP_5LC_13381__000001_W91QJ,OPT,227 Maida Vale,,London,,,W9 1QJ,Tel: 020 7624 6380, - ,,,No ratings yet Rate it yourself - /Services/opticians/LeaveReview/DefaultView.aspx?id=OP_5LC_13381__000001_W91QJ,0,0,
Boots-London - Victoria,OP_5LC_5034__000003_SW1E5JL,OPT,145 Victoria Street,,London,London,,SW1E 5NH,Tel: 020 7834 4017, - ,,,No ratings yet Rate it yourself - /Services/opticians/LeaveReview/DefaultView.aspx?id=OP_5LC_5034__000003_SW1E5JL,0,0,
Optical Express,,OPT,,22 Harley Street,,London,,W1G 9AP,, - ,,,N/A - Data not available,,,
Optical Express,W1G 9AP_11111,OPT,22 Harley Street,,,London,,W1G 9AP,Tel: 0800 023 2020, - ,,,1 rating Rate it yourself - /Services/opticians/LeaveReview/DefaultView.aspx?id=W1G 9AP_11111,,,
Visioncare Medical Eye Centre,OP_5LC_2285__000001_W1G8QY,OPT,77 Harley Street,,,London,,W1G 8QN,Tel: 020 7935 1400, - ,,,No ratings yet Rate it yourself - /Services/opticians/LeaveReview/DefaultView.aspx?id=OP_5LC_2285__000001_W1G8QY,0,0,
Vision Express Opticians,OP_5LC_3710__000001_W1N9FA,OPT,263-265 Oxford Street,,London,,,W1C 2DF,Tel: 020 7409 7880, - ,,,1 rating Rate it yourself - /Services/opticians/LeaveReview/DefaultView.aspx?id=OP_5LC_3710__000001_W1N9FA,,,
Pimlico Eyecare ,OP_5LC_13402__000002_SW1V3EN,OPT,109 Lupus Street,,London,,,SW1V 3EN,Tel: 020 7233 8398, - ,,,No ratings yet Rate it yourself - /Services/opticians/LeaveReview/DefaultView.aspx?id=OP_5LC_13402__000002_SW1V3EN,0,0,
Sidfiz Optique,04BR,OPT,Sid Fiz Optique,46 Salusbury Road,,London,,NW6 6NN,Tel: 02076256694, - ,,,No ratings yet Rate it yourself - /Services/opticians/LeaveReview/DefaultView.aspx?id=04BR,0,0,
Sidfiz Optic,OPT_NW66NN_2,OPT,,46 Salusbury Road,,London,,NW6 6NN,, - ,,,No ratings yet Rate it yourself - /Services/opticians/LeaveReview/DefaultView.aspx?id=OPT_NW66NN_2,0,0,
Sidfiz Optic,OPT_NW66NN_1,OPT,,46 Salusbury Road,,London,,NW6 6NN,, - ,,,No ratings yet Rate it yourself - /Services/opticians/LeaveReview/DefaultView.aspx?id=OPT_NW66NN_1,0,0,
Schuller Opticians,OP_5LC_9331__000002_NW87NH,OPT,33 St. Johns Wood High Street,,London,,,NW8 7NH,Tel: 020 7722 8242, - ,,,1 rating Rate it yourself - /Services/opticians/LeaveReview/DefaultView.aspx?id=OP_5LC_9331__000002_NW87NH,,,
Safarian & Simon,OP_5LC_13404__000001_NW87NH,OPT,62 St John's Wood High Street,St. John's Wood,,London,Greater London,NW8 7SH,Tel: 0207 722 1917, - ,,,3 ratings Rate it yourself - /Services/opticians/LeaveReview/DefaultView.aspx?id=OP_5LC_13404__000001_NW87NH,,,
Clive Kay Opticians,OP_5LC_13369__000001_SW1V1RU,OPT,4 Warwick Way,,London,,,SW1V 1RU,Tel: 020 7834 7296, - ,,,No ratings yet Rate it yourself - /Services/opticians/LeaveReview/DefaultView.aspx?id=OP_5LC_13369__000001_SW1V1RU,0,0,
Safarian and Simon Opticians,TP9FW,OPT,,53 Abbey Road,,London,,NW8 0AD,, - ,,,1 rating Rate it yourself - /Services/opticians/LeaveReview/DefaultView.aspx?id=TP9FW,,,
I S Cohen,OP_5K7_6006__000003_NW64HJ,OPT,46 Kilburn High Road,,London,,,NW6 4HJ,Tel: 020 7624 9277, - ,,,No ratings yet Rate it yourself - /Services/opticians/LeaveReview/DefaultView.aspx?id=OP_5K7_6006__000003_NW64HJ,0,0,
Kensal Eyes Opticians,OP_5K5_4919__000001_NW103NR,OPT,1 Bridge House,Chamberlayne Road,London,,,NW10 3NR,Tel: 020 8969 4109, - ,,,No ratings yet Rate it yourself - /Services/opticians/LeaveReview/DefaultView.aspx?id=OP_5K5_4919__000001_NW103NR,0,0,
David Clulow Opticians,OP_5LC_1840__000001_SW1H0HW,OPT,61-71 Victoria Street,,London,,,SW1H 0HW,Tel: 020 7233 2339, - ,,,2 ratings Rate it yourself - /Services/opticians/LeaveReview/DefaultView.aspx?id=OP_5LC_1840__000001_SW1H0HW,,,
Eye Spy Opticians,COOL-32795HX__000003_W37DJ,OPT,1a East Acton Arcade,Old Ok Common Lane,East Acton,London,,W3 7DJ,Tel: 020 8746 9200, - ,,,No ratings yet Rate it yourself - /Services/opticians/LeaveReview/DefaultView.aspx?id=COOL-32795HX__000003_W37DJ,0,0,
Quinlans Opticians,647000__000001_SW1V2PD,OPT,,34 Moreton Street,,London,,SW1V 2PD,Tel: 02072337770, - ,,,No ratings yet Rate it yourself - /Services/opticians/LeaveReview/DefaultView.aspx?id=647000__000001_SW1V2PD,0,0,
BOOTS,SW15 1SP__000004_SW151SP,OPT,,63 Putney High Street,,Putney,,SW15 1SP,Tel: 0208 789 1820, - ,,,No ratings yet Rate it yourself - /Services/opticians/LeaveReview/DefaultView.aspx?id=SW15 1SP__000004_SW151SP,0,0,
Ashdown & Collins,OP_5K5_14713__000001_NW103JP,OPT,118 Chamberlayne Road,Kensal Rise,London,,,NW10 3JP,Tel: 020 8969 0881, - ,,,No ratings yet Rate it yourself - /Services/opticians/LeaveReview/DefaultView.aspx?id=OP_5K5_14713__000001_NW103JP,0,0,
Unia Opticians,OP_5LC_7309__000002_SW1P2HY,OPT,9 Strutton Ground,,St James’s Park,London,,SW1P 2HY,Tel: 020 7222 0066, - ,,,No ratings yet Rate it yourself - /Services/opticians/LeaveReview/DefaultView.aspx?id=OP_5LC_7309__000002_SW1P2HY,0,0,
Focal Point Opticians,OPT_SW130DQ_1,OPT,,70 Church Road,Barnes,London,,SW13 0DQ,Tel: 020 8748 1666, - ,,,No ratings yet Rate it yourself - /Services/opticians/LeaveReview/DefaultView.aspx?id=OPT_SW130DQ_1,0,0,