Organisation Name,NACS Code,Organisation Type,Address1,Address2,Address3,Address4,Address5,PostCode,Telephone Number,Opening time,Value  (Opening time),Banding Classification  (Opening time),NHS.UK users rating,Value  (NHS.UK users rating),Banding Classification  (NHS.UK users rating),Car parking (Is there car parking at this organisation?)
Optical Express,W1G 9AP_11111,OPT,22 Harley Street,,,London,,W1G 9AP,Tel: 0800 023 2020, - ,,,1 rating Rate it yourself - /Services/opticians/LeaveReview/DefaultView.aspx?id=W1G 9AP_11111,,,
Optical Express,,OPT,,22 Harley Street,,London,,W1G 9AP,, - ,,,N/A - Data not available,,,
Visioncare Medical Eye Centre,OP_5LC_2285__000001_W1G8QY,OPT,77 Harley Street,,,London,,W1G 8QN,Tel: 020 7935 1400, - ,,,No ratings yet Rate it yourself - /Services/opticians/LeaveReview/DefaultView.aspx?id=OP_5LC_2285__000001_W1G8QY,0,0,
Boots-London - Wigmore St,OP_5LC_568__000001_W1U1PN,OPT,35 Wigmore Street,,,London,,W1U 1PW,Tel: 0207 580 4343, - ,,,No ratings yet Rate it yourself - /Services/opticians/LeaveReview/DefaultView.aspx?id=OP_5LC_568__000001_W1U1PN,0,0,
Vision Express Opticians,OP_5LC_3710__000001_W1N9FA,OPT,263-265 Oxford Street,,London,,,W1C 2DF,Tel: 020 7409 7880, - ,,,1 rating Rate it yourself - /Services/opticians/LeaveReview/DefaultView.aspx?id=OP_5LC_3710__000001_W1N9FA,,,
L K Leon Optician,OP_5LC_11271__000002_W1M7RL,OPT,29 New Cavendish Street,,London,,,W1G 9TU,Tel: 020 7486 9915, - ,,,No ratings yet Rate it yourself - /Services/opticians/LeaveReview/DefaultView.aspx?id=OP_5LC_11271__000002_W1M7RL,0,0,no
David Clulow Opticians,OP_5LC_503__000001_W1M9LE,OPT,41-43 Wigmore Street,,London,,,W1U 1PR,Tel: 020 7486 1485, - ,,,1 rating Rate it yourself - /Services/opticians/LeaveReview/DefaultView.aspx?id=OP_5LC_503__000001_W1M9LE,,,
The Eye Place,,OPT,,5 Charlotte Place,,Fitzrovia London,,W1T 1SF,Tel: 020 7583 1936, - ,,,N/A - Data not available,,,
Hollands Of London,OLOTHER5LC__000001_W1G8UX,OPT,3 New Cavendish Street,,London,,,W1G 8UX,Tel: 020 7487 4267, - ,,,No ratings yet Rate it yourself - /Services/opticians/LeaveReview/DefaultView.aspx?id=OLOTHER5LC__000001_W1G8UX,0,0,
Zacks Eye Clinic,TP5H4,OPT,,30 Warren Street,,London,,W1T 5NF,Tel: 020 7713 7713, - ,,,No ratings yet Rate it yourself - /Services/opticians/LeaveReview/DefaultView.aspx?id=TP5H4,0,0,
Boots-London - Sedley Place,OLC016075LC__000001_W1C2JL,OPT,361 Oxford Street,,,London,,W1C 2JL,Tel: 0207 491 9644, - ,,,No ratings yet Rate it yourself - /Services/opticians/LeaveReview/DefaultView.aspx?id=OLC016075LC__000001_W1C2JL,0,0,
Unger and Fagan Opticians,OP_5LC_13433__000001_W1H5PA,OPT,5 George Street,,Marylebone,London,,W1U 3QQ,Tel: 020 7486 6933, - ,,,No ratings yet Rate it yourself - /Services/opticians/LeaveReview/DefaultView.aspx?id=OP_5LC_13433__000001_W1H5PA,0,0,
Orb Optical,OP_W1T4RE_33984,OPT,,12a Tottenham Road,,London,,W1T 4RE,, - ,,,1 rating Rate it yourself - /Services/opticians/LeaveReview/DefaultView.aspx?id=OP_W1T4RE_33984,,,
Mallon & Taub Optician,-1425LC__000001_W1U4QB,OPT,,63 Paddington Street,Marylebone,London,,W1U 4JF,Tel: 020 7935 8200, - ,,,1 rating Rate it yourself - /Services/opticians/LeaveReview/DefaultView.aspx?id=-1425LC__000001_W1U4QB,,,
Paris Miki London Ltd,OP_5LC_5922__000001_W1R7HG,OPT,,Paris Miki London Ltd,19 Duke Street,London,,W1U 1DJ,Tel: 020 7935 1341, - ,,,No ratings yet Rate it yourself - /Services/opticians/LeaveReview/DefaultView.aspx?id=OP_5LC_5922__000001_W1R7HG,0,0,
David Clulow Opticians,OP_5LC_46__000003_W1A1AB,OPT,4th Floor,Selfridges,400 Oxford Street,London,,W1A 1AB,Tel: 020 7318 3353, - ,,,No ratings yet Rate it yourself - /Services/opticians/LeaveReview/DefaultView.aspx?id=OP_5LC_46__000003_W1A1AB,0,0,
Sight Care ,OP_5LC_1023__000001_W1D2DZ,OPT,45 Oxford Street,,London,,,W1D 2DZ,Tel: 020 7434 2385, - ,,,No ratings yet Rate it yourself - /Services/opticians/LeaveReview/DefaultView.aspx?id=OP_5LC_1023__000001_W1D2DZ,0,0,
Boots-London - Tottenham Court Road,OP_5K7_5005__000001_W1T2BE,OPT,16-17 Tottenham Court Road,,,London,,W1T 1BE,Tel: 0207 580 6510, - ,,,No ratings yet Rate it yourself - /Services/opticians/LeaveReview/DefaultView.aspx?id=OP_5K7_5005__000001_W1T2BE,0,0,
Specsavers Opticians,OP_5K7_729__000002_W1P9DP,OPT,"Unit 6, 6-17 Tottenham Court Road",,London,,,W1T 1BG,Tel: 020 7580 5115, - ,,,1 rating Rate it yourself - /Services/opticians/LeaveReview/DefaultView.aspx?id=OP_5K7_729__000002_W1P9DP,,,
Visioncare London Ltd,OP_5LC_1045__000001_W1M2LB,OPT,70 Baker Street,70 Baker Street,London,London,,W1U 7LB,Tel: 020 7935 8138, - ,,,1 rating Rate it yourself - /Services/opticians/LeaveReview/DefaultView.aspx?id=OP_5LC_1045__000001_W1M2LB,,,
Store Street Opticians,TP8TM,OPT,,34 Store Street,,Camden,Greater London,WC1E 7BS,Tel: 020 7636 8925, - ,,,1 rating Rate it yourself - /Services/opticians/LeaveReview/DefaultView.aspx?id=TP8TM,,,
David Clulow Opticians,OP_5LC_9805__000001_W1V5PA,OPT,70 Old Compton Street,,London,,,W1D 4UL,Tel: 020 7437 4177, - ,,,No ratings yet Rate it yourself - /Services/opticians/LeaveReview/DefaultView.aspx?id=OP_5LC_9805__000001_W1V5PA,0,0,
Boots,OP_5HL_325__000001_W1B 5RA,OPT,Boots Opticians,44-46 regent street London,,Piccadilly,,W1B 5RA,Tel: 020 7287 2261, - ,,,No ratings yet Rate it yourself - /Services/opticians/LeaveReview/DefaultView.aspx?id=OP_5HL_325__000001_W1B 5RA,0,0,
Viren Jani Optometrist,OP_5LC_8471__000001_W1K2TQ,OPT,15 New Quebec Street,,London,,,W1H 7RT,Tel: 020 77247788, - ,,,No ratings yet Rate it yourself - /Services/opticians/LeaveReview/DefaultView.aspx?id=OP_5LC_8471__000001_W1K2TQ,0,0,
i-Optix Eye Care,GOC-D-13328-0108-NW1 2HN,OPT,,96 Drummond Street,Euston,London,,NW1 2HN,Tel: 020 7388 1122, - ,,,No ratings yet Rate it yourself - /Services/opticians/LeaveReview/DefaultView.aspx?id=GOC-D-13328-0108-NW1 2HN,0,0,yes
PRAMUKH EYECARE,OP 5K7__000002_NW14BU,OPT,2 Chester Court,Camden,London,,,NW1 4BU,Tel: 0207 935 9304, - ,,,No ratings yet Rate it yourself - /Services/opticians/LeaveReview/DefaultView.aspx?id=OP 5K7__000002_NW14BU,0,0,
In-Focus Optician,OP_5LC_2003__000001_NW16AG,OPT,19 Melcombe Street,,London,,,NW1 6AG,Tel: 020 7224 7400, - ,,,1 rating Rate it yourself - /Services/opticians/LeaveReview/DefaultView.aspx?id=OP_5LC_2003__000001_NW16AG,,,
Optical Express,OP_5K7_5009__000002_WC2H8EL,OPT,219-229 Shaftesbury Avenue,,,London,,WC2H 8EL,Tel: 0800 023 2020, - ,,,No ratings yet Rate it yourself - /Services/opticians/LeaveReview/DefaultView.aspx?id=OP_5K7_5009__000002_WC2H8EL,0,0,
Crawford Street Opticians,OLC026355LC__000001_W1H1PN,OPT,7a  Wyndham Place,37 Crawford Street,London,,,W1H 1PN,Tel: 020 7724 8033, - ,,,No ratings yet Rate it yourself - /Services/opticians/LeaveReview/DefaultView.aspx?id=OLC026355LC__000001_W1H1PN,0,0,
Eyecare Clinic,OP_5LC_8884__000001_WC2H7JS,OPT,19a Newport Court,,London,,,WC2H 7JS,Tel: 020 7734 3688, - ,,,No ratings yet Rate it yourself - /Services/opticians/LeaveReview/DefaultView.aspx?id=OP_5LC_8884__000001_WC2H7JS,0,0,
Washin Optical London,OP_5LC_2084__000001_W1R5PJ,OPT,14-20 Regent Street,,London,,,SW1Y 4PH,Tel: 020 7839 2091, - ,,,No ratings yet Rate it yourself - /Services/opticians/LeaveReview/DefaultView.aspx?id=OP_5LC_2084__000001_W1R5PJ,0,0,
Eye Care Marble Arch,-425 5LC__000001_W22JE,OPT,19 Edgware Road,,London,,,W2 2JE,Tel: 020 7402 3260, - ,,,No ratings yet Rate it yourself - /Services/opticians/LeaveReview/DefaultView.aspx?id=-425 5LC__000001_W22JE,0,0,
Lauder & Rees Opticians @ The Western Eye Hospital,-1525LC__000001_NW15YE,OPT,The Western Eye Hospital,Marylebone Road,London,,,NW1 5QH,Tel: 020 7724 6530, - ,,,1 rating Rate it yourself - /Services/opticians/LeaveReview/DefaultView.aspx?id=-1525LC__000001_NW15YE,,,
Vision Care For Homeless People,OP_5LC_255__000001_SW1P1NL,OPT,West London Day Centre,134-136 Seymour Place,,London,,W1H 1NT,Tel: 020 7569 5900, - ,,,No ratings yet Rate it yourself - /Services/opticians/LeaveReview/DefaultView.aspx?id=OP_5LC_255__000001_SW1P1NL,0,0,
David Clulow Opticians,OP_5LC_11207__000001_WC2E9JR,OPT,6 Neal Street,,London,,,WC2H 9LY,Tel: 020 7240 8284, - ,,,No ratings yet Rate it yourself - /Services/opticians/LeaveReview/DefaultView.aspx?id=OP_5LC_11207__000001_WC2E9JR,0,0,
Drury Porter Eyecare,OP_5K7_3022__000002_WC1N1AE,OPT,70 Brunswick Centre,Bloomsbury,London,Russell Square,,WC1N 1AE,Tel: 020 7837 3276, - ,,,No ratings yet Rate it yourself - /Services/opticians/LeaveReview/DefaultView.aspx?id=OP_5K7_3022__000002_WC1N1AE,0,0,
Brunswick Visionplus Ltd,OP_5K7_7001__000003_WC1N1AF,OPT,Unit 31 Brunswick Centre,,London,,,WC1N 1AF,Tel: 020 7520 0010, - ,,,No ratings yet Rate it yourself - /Services/opticians/LeaveReview/DefaultView.aspx?id=OP_5K7_7001__000003_WC1N1AF,0,0,
Camden Eye Clinic,OP_5K7_5006__000001_NW11ES,OPT,24 Charlton Street,24 Charlton Street,London,London,,NW1 1JH,Tel: 020 7383 2931, - ,,,1 rating Rate it yourself - /Services/opticians/LeaveReview/DefaultView.aspx?id=OP_5K7_5006__000001_NW11ES,,,
Specsavers Opticians,OP_5LC_81__000003_W22HR,OPT,173 Edgware Road,,London,,,W2 2HR,Tel: 020 7706 0404, - ,,,No ratings yet Rate it yourself - /Services/opticians/LeaveReview/DefaultView.aspx?id=OP_5LC_81__000003_W22HR,0,0,
RNIB,-60 5LC__000002_WC1H9NE,OPT,105 Judd Street,,,London,,WC1H 9NE,Tel: 020 7391 2368, - ,,,No ratings yet Rate it yourself - /Services/opticians/LeaveReview/DefaultView.aspx?id=-60 5LC__000002_WC1H9NE,0,0,
Boots-London - Strand,OP_5LC_2028__000001_WC2R0QE,OPT,428 Strand,,,London,,WC2R 0QE,Tel: 0207 240 2049, - ,,,No ratings yet Rate it yourself - /Services/opticians/LeaveReview/DefaultView.aspx?id=OP_5LC_2028__000001_WC2R0QE,0,0,
Marble Arch Medical Centre,OP_5LC_13384__000001_W21ES,OPT,215-217 Edgware Road,,London,,,W2 1ES,Tel: 020 7723 5424, - ,,,2 ratings Rate it yourself - /Services/opticians/LeaveReview/DefaultView.aspx?id=OP_5LC_13384__000001_W21ES,,,
Hodd Barnes Dickins,OP_5K7_4265__000001_WC1V6LF,OPT,94 High Holborn,,London,,,WC1V 6LF,Tel: 020 7242 3492, - ,,,No ratings yet Rate it yourself - /Services/opticians/LeaveReview/DefaultView.aspx?id=OP_5K7_4265__000001_WC1V6LF,0,0,
Schuller Opticians,OP_5K7_6010__000001_WC1N3LJ,OPT,44 Lambs Conduit Street,,London,,,WC1N 3LJ,Tel: 020 7404 2002, - ,,,No ratings yet Rate it yourself - /Services/opticians/LeaveReview/DefaultView.aspx?id=OP_5K7_6010__000001_WC1N3LJ,0,0,
Strand Specsavers Ltd ,OP_WC2R0AG_29378,OPT,,114 Strand,,London,,WC2R 0AG,Tel: 020 3077 4950, - ,,,6 ratings Rate it yourself - /Services/opticians/LeaveReview/DefaultView.aspx?id=OP_WC2R0AG_29378,,,
Camden Contact Lens Centre,OP_5K7_7046__000002_NW10JH,OPT,32-36 Camden High Street,,London,,,NW1 0JH,Tel: 020 7383 3838, - ,,,No ratings yet Rate it yourself - /Services/opticians/LeaveReview/DefaultView.aspx?id=OP_5K7_7046__000002_NW10JH,0,0,
Obhrai & Son Ltd,OP_5LC_913__000001_WC2R1JA,OPT,146 Strand,,London,,,WC2R 1JA,Tel: 020 7379 5226, - ,,,No ratings yet Rate it yourself - /Services/opticians/LeaveReview/DefaultView.aspx?id=OP_5LC_913__000001_WC2R1JA,0,0,
J L Opticians,OP_5K7_4669__000001_NW17JL,OPT,69 Camden High Street,,,London,,NW1 7JL,Tel: 020 7388 5432, - ,,,No ratings yet Rate it yourself - /Services/opticians/LeaveReview/DefaultView.aspx?id=OP_5K7_4669__000001_NW17JL,0,0,
Braham Optician,OP_5LC_1178__000001_NW88EX,OPT,92 Church Street,,,London,,NW8 8EX,Tel: 020 7723 8307, - ,,,1 rating Rate it yourself - /Services/opticians/LeaveReview/DefaultView.aspx?id=OP_5LC_1178__000001_NW88EX,,,yes
Vision Express Optical Lab,OP_5K7_6012__000001_WC1V6BG,OPT,37-39 High Holborn,,London,,,WC1V 6BG,Tel: 020 7831 2670, - ,,,No ratings yet Rate it yourself - /Services/opticians/LeaveReview/DefaultView.aspx?id=OP_5K7_6012__000001_WC1V6BG,0,0,
City Opticians,OP_5K7_8810__000001_WC2A1AA,OPT,75 Chancery Lane,,London,,,WC2A 1AA,Tel: 020 7405 4875, - ,,,No ratings yet Rate it yourself - /Services/opticians/LeaveReview/DefaultView.aspx?id=OP_5K7_8810__000001_WC2A1AA,0,0,
Lauder & Rees Optician,OP_5LC_2522__000001_W21RL,OPT,119 Praed Street,,London,,,W2 1RW,Tel: 020 7262 2514, - ,,,2 ratings Rate it yourself - /Services/opticians/LeaveReview/DefaultView.aspx?id=OP_5LC_2522__000001_W21RL,,,
Chakshu London,TP9AW,OPT,,97 Parkway,,London,,NW1 7PP,Tel: 0203 981 2907, - ,,,No ratings yet Rate it yourself - /Services/opticians/LeaveReview/DefaultView.aspx?id=TP9AW,0,0,
Specsavers Opticians,OP_5K7_6000__000001_NW50LU,OPT,126 Camden High Street,,,London,,NW1 0LU,Tel: 020 7482 4110, - ,,,No ratings yet Rate it yourself - /Services/opticians/LeaveReview/DefaultView.aspx?id=OP_5K7_6000__000001_NW50LU,0,0,
Specsavers Opticians,OP 932__000001_WC1V7PU,OPT,"Unit 4, 311-318 High Holborn",Camden,London,,,WC1V 7PU,Tel: 020 7404 4432, - ,,,No ratings yet Rate it yourself - /Services/opticians/LeaveReview/DefaultView.aspx?id=OP 932__000001_WC1V7PU,0,0,
OPTIX AT BROADGATE (MR KARBARON),10021__000001_EC2M2WA,OPT,175 Bishops Gate 2 Exchange Arcade,,London,,,EC2M 2WA,Tel: 020 7628 0330, - ,,,No ratings yet Rate it yourself - /Services/opticians/LeaveReview/DefaultView.aspx?id=10021__000001_EC2M2WA,0,0,
New Era Optical,OP_5K8_103__000001_EC1N7TR,OPT,54 Leather Lane,,London,,,EC1N 7TP,Tel: 020 7405 0618, - ,,,No ratings yet Rate it yourself - /Services/opticians/LeaveReview/DefaultView.aspx?id=OP_5K8_103__000001_EC1N7TR,0,0,
Specsavers Opticians,OLO1192205LC__000001_SW1E5JH,OPT,1 Cathedral Walk,Cardinal Place Victoria,London,,,SW1E 5JH,Tel: 020 7976 4250, - ,,,No ratings yet Rate it yourself - /Services/opticians/LeaveReview/DefaultView.aspx?id=OLO1192205LC__000001_SW1E5JH,0,0,
Safarian & Simon,OP_5LC_13404__000001_NW87NH,OPT,62 St John's Wood High Street,St. John's Wood,,London,Greater London,NW8 7SH,Tel: 0207 722 1917, - ,,,3 ratings Rate it yourself - /Services/opticians/LeaveReview/DefaultView.aspx?id=OP_5LC_13404__000001_NW87NH,,,
David Clulow Opticians,OP_5LC_1840__000001_SW1H0HW,OPT,61-71 Victoria Street,,London,,,SW1H 0HW,Tel: 020 7233 2339, - ,,,2 ratings Rate it yourself - /Services/opticians/LeaveReview/DefaultView.aspx?id=OP_5LC_1840__000001_SW1H0HW,,,
Chatoo Opticians,OP_5LC_131__000003_SW1X9JF,OPT,25f Lowndes Street,,London,,,SW1X 9JF,Tel: 020 7235 2783, - ,,,No ratings yet Rate it yourself - /Services/opticians/LeaveReview/DefaultView.aspx?id=OP_5LC_131__000003_SW1X9JF,0,0,
Schuller Opticians,OP_5LC_9331__000002_NW87NH,OPT,33 St. Johns Wood High Street,,London,,,NW8 7NH,Tel: 020 7722 8242, - ,,,1 rating Rate it yourself - /Services/opticians/LeaveReview/DefaultView.aspx?id=OP_5LC_9331__000002_NW87NH,,,
Boots-Holborn,OP_5K8_284__000002_EC1N2TD,OPT,122 Holborn,,,London,,EC1N 2TD,Tel: 0207 831 6467, - ,,,1 rating Rate it yourself - /Services/opticians/LeaveReview/DefaultView.aspx?id=OP_5K8_284__000002_EC1N2TD,,,
Boots-London - Victoria,OP_5LC_5034__000003_SW1E5JL,OPT,145 Victoria Street,,London,London,,SW1E 5NH,Tel: 020 7834 4017, - ,,,No ratings yet Rate it yourself - /Services/opticians/LeaveReview/DefaultView.aspx?id=OP_5LC_5034__000003_SW1E5JL,0,0,
BOWINGS,OP_5C3_14477__000001_EC4Y1JU,OPT,58 Fleet Street,London,London,,,EC4Y 1JU,Tel: 020 7353 7801, - ,,,No ratings yet Rate it yourself - /Services/opticians/LeaveReview/DefaultView.aspx?id=OP_5C3_14477__000001_EC4Y1JU,0,0,
Unia Opticians,OP_5LC_7309__000002_SW1P2HY,OPT,9 Strutton Ground,,St James’s Park,London,,SW1P 2HY,Tel: 020 7222 0066, - ,,,No ratings yet Rate it yourself - /Services/opticians/LeaveReview/DefaultView.aspx?id=OP_5LC_7309__000002_SW1P2HY,0,0,
David Clulow Opticians,OP_5LC_7__000006_SW1X7XL,OPT,87-135 Brompton Road,Knightsbridge,London,,,SW1X 7XL,Tel: 020 7893 8840, - ,,,No ratings yet Rate it yourself - /Services/opticians/LeaveReview/DefaultView.aspx?id=OP_5LC_7__000006_SW1X7XL,0,0,
GREGORY SEELEY,OP_5C3_14465__000001_EC4Y1HT,OPT,63 Fleet Street,City,,London,,EC4Y 1HT,Tel: 020 7353 1408, - ,,,No ratings yet Rate it yourself - /Services/opticians/LeaveReview/DefaultView.aspx?id=OP_5C3_14465__000001_EC4Y1HT,0,0,
My Eyes Opticians,OP_5K8_779__000001_EC1R4RA,OPT,68 Exmouth Market,,London,,,EC1R 4QP,Tel: 0207 278 8480, - ,,,No ratings yet Rate it yourself - /Services/opticians/LeaveReview/DefaultView.aspx?id=OP_5K8_779__000001_EC1R4RA,0,0,
David Clulow Opticians,OP_5LC_12150__000001_SW1W9SJ,OPT,Victoria Place Shopping Centre,115 Buckingham Palace Road,London,,,SW1W 9SJ,Tel: 020 7233 8848, - ,,,No ratings yet Rate it yourself - /Services/opticians/LeaveReview/DefaultView.aspx?id=OP_5LC_12150__000001_SW1W9SJ,0,0,
Vision Express,OP_EC4A2AX_30661,OPT,,108 Fleet St,,London,,EC4A 2AX,, - ,,,No ratings yet Rate it yourself - /Services/opticians/LeaveReview/DefaultView.aspx?id=OP_EC4A2AX_30661,0,0,
Anthoney Austin Opticians,OP_5K8_732__000001_,OPT,32-33 Cowcross Street,,London,,,EC1M 6DF,Tel: 020 7253 5570, - ,,,No ratings yet Rate it yourself - /Services/opticians/LeaveReview/DefaultView.aspx?id=OP_5K8_732__000001_,0,0,
36 Opticians,OLO98315LA__000001_SW31NU,OPT,36 Beauchamp Place,,London,,,SW3 1NU,Tel: 020 7581 6336, - ,,,No ratings yet Rate it yourself - /Services/opticians/LeaveReview/DefaultView.aspx?id=OLO98315LA__000001_SW31NU,0,0,
Angel Eye Centre ,OP_5K8_6693__000001_N19EX,OPT,85 Chapel Market,,London,,,N1 9EX,Tel: 020 7278 3535, - ,,,No ratings yet Rate it yourself - /Services/opticians/LeaveReview/DefaultView.aspx?id=OP_5K8_6693__000001_N19EX,0,0,
Insight Opticians,OP_5K8_198__000001_N19EZ,OPT,24 Chapel Market,,London,,,N1 9EZ,Tel: 020 7278 1212, - ,,,No ratings yet Rate it yourself - /Services/opticians/LeaveReview/DefaultView.aspx?id=OP_5K8_198__000001_N19EZ,0,0,
Alexander Opticians,OP_5K7_7005__000001_NW33DR,OPT,14b Elsworthy Terrace,,London,,,NW3 3DR,Tel: 020 7586 6579, - ,,,1 rating Rate it yourself - /Services/opticians/LeaveReview/DefaultView.aspx?id=OP_5K7_7005__000001_NW33DR,,,
EYELINK (SECOND SIGHT LTD),10024__000001_EC4V6DU,OPT,11 Ludgate,Broadgate,London,,,EC4V 6DU,Tel: 020 7329 4462, - ,,,No ratings yet Rate it yourself - /Services/opticians/LeaveReview/DefaultView.aspx?id=10024__000001_EC4V6DU,0,0,
Clive Kay Opticians,OP_5LC_13369__000001_SW1V1RU,OPT,4 Warwick Way,,London,,,SW1V 1RU,Tel: 020 7834 7296, - ,,,No ratings yet Rate it yourself - /Services/opticians/LeaveReview/DefaultView.aspx?id=OP_5LC_13369__000001_SW1V1RU,0,0,
Specsavers Islington,OP 5K8 6015__000003_N19ER,OPT,68 Chapel Market,Islington,London,,,N1 9ER,Tel: 020 7841 3030, - ,,,2 ratings Rate it yourself - /Services/opticians/LeaveReview/DefaultView.aspx?id=OP 5K8 6015__000003_N19ER,,,
Angel Eyes Opticians,OP_5K8_9323__000001_EC1V4LD,OPT,395 St. John Street,,London,,,EC1V 4LD,Tel: 020 7837 9418, - ,,,No ratings yet Rate it yourself - /Services/opticians/LeaveReview/DefaultView.aspx?id=OP_5K8_9323__000001_EC1V4LD,0,0,
Oliver Peoples,OPT_SW1X9BX_1,OPT,,151 Sloane Street,,London,,SW1X 9BX,, - ,,,No ratings yet Rate it yourself - /Services/opticians/LeaveReview/DefaultView.aspx?id=OPT_SW1X9BX_1,0,0,
S Squared Ltd,OP_5LD_12856__000001_SE17RG,OPT,33 Lower Marsh,Waterloo,London,,,SE1 7RG,Tel: 020 7633 0680, - ,,,No ratings yet Rate it yourself - /Services/opticians/LeaveReview/DefaultView.aspx?id=OP_5LD_12856__000001_SE17RG,0,0,
Dollond & Aitchison,OP_5LA_962__000001_SW1X9AS,OPT,127a Sloane Street,,London,,,SW1X 9AS,Tel: 020 7730 4870, - ,,,No ratings yet Rate it yourself - /Services/opticians/LeaveReview/DefaultView.aspx?id=OP_5LA_962__000001_SW1X9AS,0,0,
City University City Sight,OP_5K8_3701__000001_EC1V0HB,OPT,Tait Building,Northampton Square,London,London,,EC1V 0HB,Tel: 020 7040 8338, - ,,,No ratings yet Rate it yourself - /Services/opticians/LeaveReview/DefaultView.aspx?id=OP_5K8_3701__000001_EC1V0HB,0,0,
Optichic Optician,OP_5LC_13401__000001_W26BG,OPT,83 Bishops Bridge Road,,London,,,W2 6BG,Tel: 020 7229 8399, - ,,,1 rating Rate it yourself - /Services/opticians/LeaveReview/DefaultView.aspx?id=OP_5LC_13401__000001_W26BG,,,
Specsavers Opticians,000-500__000001_W26LY,OPT,148 Queensway,Bayswater,London,,,W2 6LY,Tel: 020 7985 7410, - ,,,No ratings yet Rate it yourself - /Services/opticians/LeaveReview/DefaultView.aspx?id=000-500__000001_W26LY,0,0,
New Vision ,34300__000003_W23RL,OPT,80 Queensway,Bayswater,London,,,W2 3RL,Tel: 020 7229 7799, - ,,,No ratings yet Rate it yourself - /Services/opticians/LeaveReview/DefaultView.aspx?id=34300__000003_W23RL,0,0,
VISION EXPRESS (UK)LTD,OP 5K8__000002_N10PQ,OPT,23-24 Upper Street,Islington,London,,,N1 0PQ,Tel: 0207 354 0057, - ,,,No ratings yet Rate it yourself - /Services/opticians/LeaveReview/DefaultView.aspx?id=OP 5K8__000002_N10PQ,0,0,
David Clulow,OP_5K8_790__000001_N10PQ,OPT,25 Upper Street,,London,,,N1 0PQ,Tel: 020 7704 0010, - ,,,No ratings yet Rate it yourself - /Services/opticians/LeaveReview/DefaultView.aspx?id=OP_5K8_790__000001_N10PQ,0,0,
Boots-London - Cheapside,OP_5C3_14483__000001_EC26AT,OPT,Unit 7,12 Paternoster Square,Cheapside,London,,EC4M 7DX,Tel: 0207 248 2820, - ,,,2 ratings Rate it yourself - /Services/opticians/LeaveReview/DefaultView.aspx?id=OP_5C3_14483__000001_EC26AT,,,
Vision Express Opticians,OP_5LC_606__000001_W24YQ,OPT,Unit 4 - Whiteleys Centre,Queensway,London,,,W2 4YQ,Tel: 0207 727 1888, - ,,,No ratings yet Rate it yourself - /Services/opticians/LeaveReview/DefaultView.aspx?id=OP_5LC_606__000001_W24YQ,0,0,
University Vision ,OL01235225LC__000002_SW72AZ,OPT,Imperial College,The Walkway Level 2,Shefield Building,Exhibition Road,,SW7 2AZ,Tel: 020 7594 9746, - ,,,No ratings yet Rate it yourself - /Services/opticians/LeaveReview/DefaultView.aspx?id=OL01235225LC__000002_SW72AZ,0,0,
Cult Vision,OP_EC1M7AA_071014,OPT,,14 Goswell Road,,London,,EC1M 7AA,Tel: 020 7251 1268, - ,,,No ratings yet Rate it yourself - /Services/opticians/LeaveReview/DefaultView.aspx?id=OP_EC1M7AA_071014,0,0,
Eyelevel,OP_5K8_5085__000001_N10PN,OPT,37 Upper Street,,London,,,N1 0PN,Tel: 020 7354 9277, - ,,,No ratings yet Rate it yourself - /Services/opticians/LeaveReview/DefaultView.aspx?id=OP_5K8_5085__000001_N10PN,0,0,
Quinlans Opticians,647000__000001_SW1V2PD,OPT,,34 Moreton Street,,London,,SW1V 2PD,Tel: 02072337770, - ,,,No ratings yet Rate it yourself - /Services/opticians/LeaveReview/DefaultView.aspx?id=647000__000001_SW1V2PD,0,0,
Betterspecs Opticians,OP_5K7_8885__000002_NW52AE,OPT,210 Kentish Town Road,Camden,London,,,NW5 2AD,Tel: 020 7482 3859, - ,,,4 ratings Rate it yourself - /Services/opticians/LeaveReview/DefaultView.aspx?id=OP_5K7_8885__000002_NW52AE,,,
Scrivens Opticians,OP_5K7_7423__000001_NW52JS,OPT,271 Kentish Town Road,271 Kentish Town Road,London,London,,NW5 2JS,Tel: 020 7485 2886, - ,,,46 ratings Rate it yourself - /Services/opticians/LeaveReview/DefaultView.aspx?id=OP_5K7_7423__000001_NW52JS,,,
Hattons Opticians,OP_5LD_190__000002_SE116EE,OPT,157 Lambeth Walk,,London,,,SE11 6EE,Tel: 020 7582 8877, - ,,,No ratings yet Rate it yourself - /Services/opticians/LeaveReview/DefaultView.aspx?id=OP_5LD_190__000002_SE116EE,0,0,
Safarian and Simon Opticians,TP9FW,OPT,,53 Abbey Road,,London,,NW8 0AD,, - ,,,1 rating Rate it yourself - /Services/opticians/LeaveReview/DefaultView.aspx?id=TP9FW,,,
Abbot Opticians,OP_5LA_13378__000001_SW72NA,OPT,13 The Arcade,South Kensington Station,London,,,SW7 2NA,Tel: 020 7581 2330, - ,,,No ratings yet Rate it yourself - /Services/opticians/LeaveReview/DefaultView.aspx?id=OP_5LA_13378__000001_SW72NA,0,0,
Pimlico Eyecare ,OP_5LC_13402__000002_SW1V3EN,OPT,109 Lupus Street,,London,,,SW1V 3EN,Tel: 020 7233 8398, - ,,,No ratings yet Rate it yourself - /Services/opticians/LeaveReview/DefaultView.aspx?id=OP_5LC_13402__000002_SW1V3EN,0,0,
Queens Crescent Eye Care,OP_5K7_596__000001_NW54DY,OPT,,58 Queens Crescent,Kentish Town,London,,NW5 4EE,Tel: 020 7485 3389, - ,,,No ratings yet Rate it yourself - /Services/opticians/LeaveReview/DefaultView.aspx?id=OP_5K7_596__000001_NW54DY,0,0,
Isis Opticians,OP_5LA_13985__000001_SW36SN,OPT,153c Fulham Road,,London,,,SW3 6SN,Tel: 020 7823 8080, - ,,,No ratings yet Rate it yourself - /Services/opticians/LeaveReview/DefaultView.aspx?id=OP_5LA_13985__000001_SW36SN,0,0,