Organisation Name,NACS Code,Organisation Type,Address1,Address2,Address3,Address4,Address5,PostCode,Telephone Number,Opening time,Value  (Opening time),Banding Classification  (Opening time),NHS.UK users rating,Value  (NHS.UK users rating),Banding Classification  (NHS.UK users rating),Car parking (Is there car parking at this organisation?)
Rutherford Eye Care,OP_5DG_9260__000002_PO381RZ,OPT,36 High Street,,Ventnor,,,PO38 1RZ,Tel: 01983 852996, - ,,,No ratings yet Rate it yourself - /Services/opticians/LeaveReview/DefaultView.aspx?id=OP_5DG_9260__000002_PO381RZ,0,0,
Hazel Smith Opticians,OP_5DG_780__000001_PO376JZ,OPT,11a High Street,,,Shanklin,Isle of Wight,PO37 6JZ,Tel: 01983 866023, - ,,,No ratings yet Rate it yourself - /Services/opticians/LeaveReview/DefaultView.aspx?id=OP_5DG_780__000001_PO376JZ,0,0,
Rutherford Eye Care,OP_5DG_4319__000002_PO369JL,OPT,19 Sandown Road,Lake,Sandown,,,PO36 9JL,Tel: 01983 407740, - ,,,No ratings yet Rate it yourself - /Services/opticians/LeaveReview/DefaultView.aspx?id=OP_5DG_4319__000002_PO369JL,0,0,
Jacqui Lamb,OP_5DG_13710__000001_PO331YE,OPT,37 Downs View Road,St. Helens,Ryde,,,PO33 1YE,Tel: 01983 872198, - ,,,No ratings yet Rate it yourself - /Services/opticians/LeaveReview/DefaultView.aspx?id=OP_5DG_13710__000001_PO331YE,0,0,
Eyeland Optical,OP_5DG_4157__000001_PO301SS,OPT,1 High Street,,Newport,,,PO30 1SS,Tel: 01983 529815, - ,,,No ratings yet Rate it yourself - /Services/opticians/LeaveReview/DefaultView.aspx?id=OP_5DG_4157__000001_PO301SS,0,0,
Rutherford Eye Care,OP_5DG_9261__000001_PO301BA,OPT,67 High Street,,Newport,,,PO30 1BA,Tel: 01983 524629, - ,,,No ratings yet Rate it yourself - /Services/opticians/LeaveReview/DefaultView.aspx?id=OP_5DG_9261__000001_PO301BA,0,0,
Vectis Optical Labatories Ltd,PO30 1BG__000001_PO301BG,OPT,81a High Street,,Newport,Isle Of Wight,,PO30 1BG,Tel: 01983 525272, - ,,,No ratings yet Rate it yourself - /Services/opticians/LeaveReview/DefaultView.aspx?id=PO30 1BG__000001_PO301BG,0,0,
Boots Opticians,OPT_PO301TP_1,OPT,,122-126 High Street,,Newport,,PO30 1TP,Tel: 01983 524654, - ,,,No ratings yet Rate it yourself - /Services/opticians/LeaveReview/DefaultView.aspx?id=OPT_PO301TP_1,0,0,
Vision Express (UK) Ltd t/a Batemans Opticians,OP_5DG_5164__000002_PO301TP,OPT,120 High Street,,Newport,,,PO30 1TP,Tel: 01983 522177, - ,,,No ratings yet Rate it yourself - /Services/opticians/LeaveReview/DefaultView.aspx?id=OP_5DG_5164__000002_PO301TP,0,0,
Specsavers,OP_5DG_13709__000001_PO301SE,OPT,107 High Street,,Newport,Isle Of Wight,,PO30 1TJ,Tel: 01983 821 280, - ,,,No ratings yet Rate it yourself - /Services/opticians/LeaveReview/DefaultView.aspx?id=OP_5DG_13709__000001_PO301SE,0,0,
J Dencer-Brown,OP_5DG_13631__000001_PO332RE,OPT,52 High Street,,Ryde,,,PO33 2RE,Tel: 01983 566820, - ,,,No ratings yet Rate it yourself - /Services/opticians/LeaveReview/DefaultView.aspx?id=OP_5DG_13631__000001_PO332RE,0,0,
Specsavers,PO33 2HT__000001_PO332HT,OPT,39 High Street,,Ryde,Isle Of Wight,Isle of Wight,PO33 2HT,Tel: 01983 617650, - ,,,No ratings yet Rate it yourself - /Services/opticians/LeaveReview/DefaultView.aspx?id=PO33 2HT__000001_PO332HT,0,0,
Medical Eye Centre,OP_5DG_4992__000001_PO332AA,OPT,4a Cross Street,,Ryde,,,PO33 2AA,Tel: 01983 562119, - ,,,No ratings yet Rate it yourself - /Services/opticians/LeaveReview/DefaultView.aspx?id=OP_5DG_4992__000001_PO332AA,0,0,
Eyeland Optical,OP_5DG_8791__000001_PO332PJ,OPT,2 St. Thomas' Square,,Ryde,,,PO33 2LS,Tel: 01983 811328, - ,,,No ratings yet Rate it yourself - /Services/opticians/LeaveReview/DefaultView.aspx?id=OP_5DG_8791__000001_PO332PJ,0,0,
Ryde Opticians and Hearing Centre,OP_5DG_701__000001_PO332LF,OPT,,40 Union Street,,Ryde,Isle of Wight,PO33 2LF,Tel: 01983 562591, - ,,,No ratings yet Rate it yourself - /Services/opticians/LeaveReview/DefaultView.aspx?id=OP_5DG_701__000001_PO332LF,0,0,
Willetts & Doig Optometrists,OP_5DG_8027__000001_PO317RY,OPT,21-22 High Street,,Cowes,Isle of Wight,Hampshire,PO31 7RY,Tel: 01983 293181, - ,,,No ratings yet Rate it yourself - /Services/opticians/LeaveReview/DefaultView.aspx?id=OP_5DG_8027__000001_PO317RY,0,0,
Tombs & Allen Opticians,PO12 1JH__000002_PO121JH,OPT,5 Portland Buildings Stoke Road,,Gosport,Hants,,PO12 1JH,Tel: 02392 583751, - ,,,No ratings yet Rate it yourself - /Services/opticians/LeaveReview/DefaultView.aspx?id=PO12 1JH__000002_PO121JH,0,0,
Specsavers,OP_5FE_1808__000001_PO53QH,OPT,22 Palmerston Road,,,Southsea,,PO5 3QH,Tel: 023 9229 7755, - ,,,No ratings yet Rate it yourself - /Services/opticians/LeaveReview/DefaultView.aspx?id=OP_5FE_1808__000001_PO53QH,0,0,
Phillips & Edgworth,OP_5LX_7311__000001_PO121LT,OPT,1a Stoke Road,,Gosport,,,PO12 1LT,Tel: 023 9258 0170, - ,,,1 rating Rate it yourself - /Services/opticians/LeaveReview/DefaultView.aspx?id=OP_5LX_7311__000001_PO121LT,,,
Chan's Optometrist,OP_5LX_10135__000001_PO139DA,OPT,90 High Street,,Lee-on-The-Solent,,,PO13 9DA,Tel: 023 9255 1919, - ,,,2 ratings Rate it yourself - /Services/opticians/LeaveReview/DefaultView.aspx?id=OP_5LX_10135__000001_PO139DA,,,
Sue Wassall Optometrist,OP_5LX_14831__000001_PO139BX,OPT,124 High Street,,Lee-on-The-Solent,Hampshire,,PO13 9DA,Tel: 023 9255 0723, - ,,,No ratings yet Rate it yourself - /Services/opticians/LeaveReview/DefaultView.aspx?id=OP_5LX_14831__000001_PO139BX,0,0,
E J Tomes (Opticians) Ltd,OP_5LX_4419__000002_PO121DU,OPT,119 High Street,,Gosport,,,PO12 1DU,Tel: 023 9252 7711, - ,,,No ratings yet Rate it yourself - /Services/opticians/LeaveReview/DefaultView.aspx?id=OP_5LX_4419__000002_PO121DU,0,0,
Specsavers,OP_5LX_1339__000003_PO121DU,OPT,120 High Street,,Gosport,Hampshire,,PO12 1DU,Tel: 023 9251 1211, - ,,,No ratings yet Rate it yourself - /Services/opticians/LeaveReview/DefaultView.aspx?id=OP_5LX_1339__000003_PO121DU,0,0,
Scrivens Opticians,OP_5LX_7250__000001_PO121DS,OPT,103 High Street,,,Gosport,,PO12 1DS,Tel: 023 9258 1719, - ,,,No ratings yet Rate it yourself - /Services/opticians/LeaveReview/DefaultView.aspx?id=OP_5LX_7250__000001_PO121DS,0,0,
Vision Express ,OP_5LX_5161__000002_PO121DS,OPT,107 High Street,,Gosport,Hampshire,,PO12 1DS,Tel: 023 9258 1635, - ,,,No ratings yet Rate it yourself - /Services/opticians/LeaveReview/DefaultView.aspx?id=OP_5LX_5161__000002_PO121DS,0,0,
Percy Harrison Opticians,OP_5FE_14832__000001_PO51LH,OPT,117 Elm Grove,Southsea,Portsmouth,Hampshire,,PO5 1LH,Tel: 023 9282 1921, - ,,,2 ratings Rate it yourself - /Services/opticians/LeaveReview/DefaultView.aspx?id=OP_5FE_14832__000001_PO51LH,,,
20/20 Vision,OP_5LX_9082__000001_PO123AP,OPT,55 Brockhurst Road,,Gosport,Hampshire,,PO12 3AP,Tel: 023 9258 4198, - ,,,No ratings yet Rate it yourself - /Services/opticians/LeaveReview/DefaultView.aspx?id=OP_5LX_9082__000001_PO123AP,0,0,
Dollond & Aitchison,OP_5FE_2__000001_PO11BU,OPT,119 Commercial Road,,Portsmouth,,,PO1 1BU,Tel: 023 9282 1053, - ,,,No ratings yet Rate it yourself - /Services/opticians/LeaveReview/DefaultView.aspx?id=OP_5FE_2__000001_PO11BU,0,0,
Ashleigh Opticians and Hearing Centre,S9W6V,OPT,,31 Fratton Road,Fratton,Portsmouth,Hampshire,PO1 5AB,Tel: 02392827158, - ,,,No ratings yet Rate it yourself - /Services/opticians/LeaveReview/DefaultView.aspx?id=S9W6V,0,0,
Vision Express (UK) Ltd,OP_5FE_3816__000001_PO14RJ,OPT,Unit 8 Cascades,,Portsmouth,,,PO1 4RJ,Tel: 023 9282 3444, - ,,,1 rating Rate it yourself - /Services/opticians/LeaveReview/DefaultView.aspx?id=OP_5FE_3816__000001_PO14RJ,,,
Boots-Portsmouth - Commercial Rd (in Boots UK),OP_5FE_11048__000002_PO11HB,OPT,194-204 Commercial Road,,,Portsmouth,Hampshire,PO1 1HB,Tel: 0239 273 6004, - ,,,No ratings yet Rate it yourself - /Services/opticians/LeaveReview/DefaultView.aspx?id=OP_5FE_11048__000002_PO11HB,0,0,
Asda Opticians,OPT_PO1 1SL,OPT,,The Bridge Shopping Centre,,Portsmouth,,PO1 1SL,Tel: 02392 841822, - ,,,No ratings yet Rate it yourself - /Services/opticians/LeaveReview/DefaultView.aspx?id=OPT_PO1 1SL,0,0,
Rutherford Eyecare,PO40 9AJ__000001_PO409AJ,OPT,3 Moa Place,,Freshwater,Isle Of Wight,,PO40 9DS,Tel: 01983 753532, - ,,,No ratings yet Rate it yourself - /Services/opticians/LeaveReview/DefaultView.aspx?id=PO40 9AJ__000001_PO409AJ,0,0,
Specsavers,OP_5FE_12040__000001_PO14BJ,OPT,205 Commercial Road,,,Portsmouth,,PO1 4BJ,Tel: 023 9229 6959, - ,,,No ratings yet Rate it yourself - /Services/opticians/LeaveReview/DefaultView.aspx?id=OP_5FE_12040__000001_PO14BJ,0,0,
R M Skidmore,OP_5DG_13635__000001_PO390DH,OPT,2a The Avenue,,Freshwater,,,PO39 0DH,Tel: 01983 753532, - ,,,No ratings yet Rate it yourself - /Services/opticians/LeaveReview/DefaultView.aspx?id=OP_5DG_13635__000001_PO390DH,0,0,
Stubbington Opticians and Hearing Centre,B6D7Y,OPT,,"39 Stubbington Green,",,Fareham,,PO14 2LE,Tel: 01329 663977, - ,,,No ratings yet Rate it yourself - /Services/opticians/LeaveReview/DefaultView.aspx?id=B6D7Y,0,0,
Ingrams Opticians,OP_5FE_10374__000001_PO27LR,OPT,202 Kingston Road,,Portsmouth,,,PO2 7LR,Tel: 023 9266 3446, - ,,,No ratings yet Rate it yourself - /Services/opticians/LeaveReview/DefaultView.aspx?id=OP_5FE_10374__000001_PO27LR,0,0,
Specsavers Opticians,TP8MV,OPT,,20 London Road,North End,Portsmouth,Hampshire,PO2 0LN,Tel: 02392 162992, - ,,,No ratings yet Rate it yourself - /Services/opticians/LeaveReview/DefaultView.aspx?id=TP8MV,0,0,
Portsea Island Opticians,OP_5FE_11047__000001_PO29DJ,OPT,144 London Road,,,Portmouth,Hampshire,PO2 9DQ,Tel: 023 9261 0710, - ,,,No ratings yet Rate it yourself - /Services/opticians/LeaveReview/DefaultView.aspx?id=OP_5FE_11047__000001_PO29DJ,0,0,
Asda Opticians,OPT_PO14 1TT,OPT,,Speedfields Park,,Fareham,,PO14 1TT,Tel: 01329 241885, - ,,,No ratings yet Rate it yourself - /Services/opticians/LeaveReview/DefaultView.aspx?id=OPT_PO14 1TT,0,0,
Anne Gill Eyecare,OPT_PO29JQ_1,OPT,,226 London Road,,Portsmouth,,PO2 9JQ,Tel: 023 9269 4442, - ,,,No ratings yet Rate it yourself - /Services/opticians/LeaveReview/DefaultView.aspx?id=OPT_PO29JQ_1,0,0,
Peter Collins,OP_5FD_1221__000001_PO119BL,OPT,30 Mengham Road,,Hayling Island,,,PO11 9BL,Tel: 023 9246 7887, - ,,,No ratings yet Rate it yourself - /Services/opticians/LeaveReview/DefaultView.aspx?id=OP_5FD_1221__000001_PO119BL,0,0,
Loat Opticians,PO11 9EF__000004_PO119EF,OPT,42a Elm Grove,,Hayling Island,Hampshire,,PO11 9EF,Tel: 02392 468555, - ,,,No ratings yet Rate it yourself - /Services/opticians/LeaveReview/DefaultView.aspx?id=PO11 9EF__000004_PO119EF,0,0,
Northern Parade Clinic,PO2 9NS__000001_PO29NS,OPT,Doyle Avenue,,Portsmouth,Hants,,PO2 9NS,Tel: 023 9266 2378, - ,,,No ratings yet Rate it yourself - /Services/opticians/LeaveReview/DefaultView.aspx?id=PO2 9NS__000001_PO29NS,0,0,
Cameron Davies Opticians,OP_5LX_12387__000001_PO169UN,OPT,50 West Street,Portchester,Fareham,,,PO16 9UN,Tel: 023 9237 3015, - ,,,No ratings yet Rate it yourself - /Services/opticians/LeaveReview/DefaultView.aspx?id=OP_5LX_12387__000001_PO169UN,0,0,
Vision Express,OP_5LX_14830__000001_PO160EP,OPT,13-14 Fareham Shopping Centre,,Fareham,Hampshire,,PO16 0EP,Tel: 01329 235700, - ,,,No ratings yet Rate it yourself - /Services/opticians/LeaveReview/DefaultView.aspx?id=OP_5LX_14830__000001_PO160EP,0,0,
Praills Opticians,PO16 0EN__000007_PO160EN,OPT,203d West Street,,Fareham,Hants,,PO16 0EN,Tel: 01329 280250, - ,,,No ratings yet Rate it yourself - /Services/opticians/LeaveReview/DefaultView.aspx?id=PO16 0EN__000007_PO160EN,0,0,
Direct Spex Ltd,PO16 0BG__000002_PO160BG,OPT,3 West Street,,Fareham,Hants,,PO16 0BG,Tel: 01329 285550, - ,,,No ratings yet Rate it yourself - /Services/opticians/LeaveReview/DefaultView.aspx?id=PO16 0BG__000002_PO160BG,0,0,
Leightons Opticians & Hearing Care,PO16 0AP__000001_PO160AP,OPT,81 West Street,,,Fareham,Hampshire,PO16 0AP,Tel: 01329 287 220, - ,,,No ratings yet Rate it yourself - /Services/opticians/LeaveReview/DefaultView.aspx?id=PO16 0AP__000001_PO160AP,0,0,
Specsavers,OP_5LX_12694__000001_PO160BA,OPT,37 West Street,,Fareham,Hampshire,,PO16 0BA,Tel: 01329 826126, - ,,,No ratings yet Rate it yourself - /Services/opticians/LeaveReview/DefaultView.aspx?id=OP_5LX_12694__000001_PO160BA,0,0,
Boots-Fareham - Westbury Mall,OP_5LX_9627__000002_PO160PE,OPT,21 Westbury Mall,,,Fareham Shopping Centre,Hampshire,PO16 0PE,Tel: 01329 221822, - ,,,1 rating Rate it yourself - /Services/opticians/LeaveReview/DefaultView.aspx?id=OP_5LX_9627__000002_PO160PE,,,
Tesco Opticians,PO6 4SR__000002_PO64SR,OPT,,Clement Atlee Way,,Portsmouth,Hampshire,PO6 4SR,Tel: 0845 601 3479, - ,,,No ratings yet Rate it yourself - /Services/opticians/LeaveReview/DefaultView.aspx?id=PO6 4SR__000002_PO64SR,0,0,
Rex Wingate & Partners,OP_5FE_4799__000002_PO64HG,OPT,177 Allaway Avenue,,Portsmouth,,,PO6 4HG,Tel: 023 9264 1222, - ,,,No ratings yet Rate it yourself - /Services/opticians/LeaveReview/DefaultView.aspx?id=OP_5FE_4799__000002_PO64HG,0,0,
Specsavers,PO6 3AG__000005_PO63AG,OPT,46a High Street,Cosham,,Portsmouth,,PO6 3AG,Tel: 023 9220 5110, - ,,,No ratings yet Rate it yourself - /Services/opticians/LeaveReview/DefaultView.aspx?id=PO6 3AG__000005_PO63AG,0,0,
Malik and Collins Limited,OP_5LX_8235__000001_SO319GQ,OPT,4 Shore Road,Warsash,Southampton,Hampshire,,SO31 9GQ,Tel: 01489 576947, - ,,,No ratings yet Rate it yourself - /Services/opticians/LeaveReview/DefaultView.aspx?id=OP_5LX_8235__000001_SO319GQ,0,0,
Specsavers,TP97X,OPT,,"Sainsburys, Fitzherbert Road, Farlington,",,Portsmouth,,PO6 1RR,, - ,,,No ratings yet Rate it yourself - /Services/opticians/LeaveReview/DefaultView.aspx?id=TP97X,0,0,
Boots-Lymington,OP_5A1_14091__000001_SO419AF,OPT,35 High Street,,Lymington,Hampshire,,SO41 9AF,Tel: 01590 671655, - ,,,No ratings yet Rate it yourself - /Services/opticians/LeaveReview/DefaultView.aspx?id=OP_5A1_14091__000001_SO419AF,0,0,
Scrivens Opticians,OP_5A1_14093__000001_SO419AG,OPT,,100 High Street,,Lymington,Hampshire,SO41 9AP,Tel: 01590 672645, - ,,,No ratings yet Rate it yourself - /Services/opticians/LeaveReview/DefaultView.aspx?id=OP_5A1_14093__000001_SO419AG,0,0,
Vision Express ,OP_5A1_14090__000001_SO419AJ,OPT,95 High Street,,Lymington,Hampshire,,SO41 9AP,Tel: 01590 677722, - ,,,No ratings yet Rate it yourself - /Services/opticians/LeaveReview/DefaultView.aspx?id=OP_5A1_14090__000001_SO419AJ,0,0,
Specsavers,OP_SO419AL_34942,OPT,,71 High Street,,Lymington,,SO41 9AL,, - ,,,No ratings yet Rate it yourself - /Services/opticians/LeaveReview/DefaultView.aspx?id=OP_SO419AL_34942,0,0,
Forrest Optometrists,OP_5FE_8799__000001_PO62AA,OPT,145 Havant Road,145 Havant Road,Portsmouth,Drayton,,PO6 2AA,Tel: 023 9237 6883, - ,,,No ratings yet Rate it yourself - /Services/opticians/LeaveReview/DefaultView.aspx?id=OP_5FE_8799__000001_PO62AA,0,0,
Hassan-Hicks Opticians,OP_5A1_14092__000001_SO419NB,OPT,18 St. Thomas Street,,Lymington,Hampshire,,SO41 9NB,Tel: 01590 675576, - ,,,No ratings yet Rate it yourself - /Services/opticians/LeaveReview/DefaultView.aspx?id=OP_5A1_14092__000001_SO419NB,0,0,
EyeStyle Centre Opticians Ltd,OP_5LX_4785__000001_SO316DX,OPT,16 Locks Heath Centre,Locks Heath,,Southampton,Hampshire,SO31 6DX,Tel: 01489 589760, - ,,,No ratings yet Rate it yourself - /Services/opticians/LeaveReview/DefaultView.aspx?id=OP_5LX_4785__000001_SO316DX,0,0,
Bridle Opticians,OP_5P6_OPTICIAN EAST WIT__000001_PO208DZ,OPT,16 Shore Road,,East Wittering,West Sussex,,PO20 8DZ,Tel: 01243 671717, - ,,,No ratings yet Rate it yourself - /Services/opticians/LeaveReview/DefaultView.aspx?id=OP_5P6_OPTICIAN EAST WIT__000001_PO208DZ,0,0,
20/20 Vision (Super Optical) Ltd,OP_5LX_14829__000001_SO317GE,OPT,20 Bridge Road,,Park Gate,Hampshire,,SO31 7GE,Tel: 01489 573300, - ,,,No ratings yet Rate it yourself - /Services/opticians/LeaveReview/DefaultView.aspx?id=OP_5LX_14829__000001_SO317GE,0,0,
Wingate Rex & Partners,SO3 7BB__000001_SO37BB,OPT,60 Botley Road,Park Gate,Portsmouth,Hants,,SO3 7BB,Tel: 01489 584169, - ,,,No ratings yet Rate it yourself - /Services/opticians/LeaveReview/DefaultView.aspx?id=SO3 7BB__000001_SO37BB,0,0,
Rex Wingate & Partners,OP_5LX_732__000001_SO311BB,OPT,60-62 Botley Road,,Park Gate,Hampshire,,SO31 1BB,Tel: 01489 584169, - ,,,No ratings yet Rate it yourself - /Services/opticians/LeaveReview/DefaultView.aspx?id=OP_5LX_732__000001_SO311BB,0,0,
Tesco Opticians,OP_PO91TR_29726,OPT,,Solent Road,,Havant,Hampshire,PO9 1TR,Tel: 0845 601 3479, - ,,,No ratings yet Rate it yourself - /Services/opticians/LeaveReview/DefaultView.aspx?id=OP_PO91TR_29726,0,0,
Matheson Optometrists,PO7 5LJ__000002_PO75LJ,OPT,20 London Road,Purbrook,Waterlooville,Hampshire,,PO7 5LJ,Tel: 02392 250605, - ,,,No ratings yet Rate it yourself - /Services/opticians/LeaveReview/DefaultView.aspx?id=PO7 5LJ__000002_PO75LJ,0,0,
Specsavers Limited,OPT_PO157PD_1,OPT,,Unit 4G Whiteley Shopping Centre,,Fareham,,PO15 7PD,, - ,,,No ratings yet Rate it yourself - /Services/opticians/LeaveReview/DefaultView.aspx?id=OPT_PO157PD_1,0,0,
Specsavers,OP_5FD_8859__000003_PO91PG,OPT,36-38 West Street,,Havant,,,PO9 1PG,Tel: 023 9249 8490, - ,,,No ratings yet Rate it yourself - /Services/opticians/LeaveReview/DefaultView.aspx?id=OP_5FD_8859__000003_PO91PG,0,0,
Boots Opticians,OPT_PO91US_1,OPT,,Unit 43 Meridian Shopping Centre,,Havant,,PO9 1UW,Tel: 0239 2481464, - ,,,1 rating Rate it yourself - /Services/opticians/LeaveReview/DefaultView.aspx?id=OPT_PO91US_1,,,
Rex Wingate & Partners,OP_5FD_8208__000001_PO91PR,OPT,26 North Street,,Havant,,,PO9 1PR,Tel: 023 9248 4184, - ,,,No ratings yet Rate it yourself - /Services/opticians/LeaveReview/DefaultView.aspx?id=OP_5FD_8208__000001_PO91PR,0,0,
Scrivens Opticians,OP_5FD_11108__000002_PO91PG,OPT,3 West Street,,,Havant,Hampshire,PO9 1UN,Tel: 023 9248 3445, - ,,,1 rating Rate it yourself - /Services/opticians/LeaveReview/DefaultView.aspx?id=OP_5FD_11108__000002_PO91PG,,,
ASDA Opticians,OP_5FD_14834__000001_PO93QW,OPT,Larchwood Avenue,Bedhampton,Havant,Hampshire,,PO9 3QW,Tel: 02392 445800, - ,,,1 rating Rate it yourself - /Services/opticians/LeaveReview/DefaultView.aspx?id=OP_5FD_14834__000001_PO93QW,,,
Selsey Eyecare Centre,OP_5L9_7786__000001_PO200QG,OPT,,90 High Street,,Selsey,,PO20 0QG,Tel: 01243 605222, - ,,,No ratings yet Rate it yourself - /Services/opticians/LeaveReview/DefaultView.aspx?id=OP_5L9_7786__000001_PO200QG,0,0,
Peter Collins Opticians,OPT_PO77DJ_1,OPT,,"6 The Precinct, London Road",,Waterlooville,,PO7 7DJ,, - ,,,No ratings yet Rate it yourself - /Services/opticians/LeaveReview/DefaultView.aspx?id=OPT_PO77DJ_1,0,0,
Scrivens Opticians & Hearing Care,00093__000001_SO456AQ,OPT,52 Pylewell Road,52 Pylewell Road,Hythe,Southampton (Hythe),Hampshire,SO45 6AQ,Tel: 023 8084 2230, - ,,,No ratings yet Rate it yourself - /Services/opticians/LeaveReview/DefaultView.aspx?id=00093__000001_SO456AQ,0,0,
Dawkins and Lodge Opticians,OP_5A1_14089__000001_SO456AN,OPT,Unit 4,1-5 The Marsh,Hythe,Southampton,Hampshire,SO45 6AL,Tel: 023 8084 3798, - ,,,No ratings yet Rate it yourself - /Services/opticians/LeaveReview/DefaultView.aspx?id=OP_5A1_14089__000001_SO456AN,0,0,
Vision Right (Carol Joy Underwood),01-07383__000001_SO315FB,OPT,17-18 Abbey Hill,Netley Abbey,,Southampton,,SO31 5FB,, - ,,,No ratings yet Rate it yourself - /Services/opticians/LeaveReview/DefaultView.aspx?id=01-07383__000001_SO315FB,0,0,
Jonathan C Hobbs Opticians,OP_5FD_5687__000002_PO77EX,OPT,63/65 London Road,,Waterlooville,,,PO7 7EX,Tel: 023 9225 4131, - ,,,No ratings yet Rate it yourself - /Services/opticians/LeaveReview/DefaultView.aspx?id=OP_5FD_5687__000002_PO77EX,0,0,
Large & Large Opticians,OP_5FD_3002__000001_PO77HE,OPT,8 Clock House,,Waterlooville,,,PO7 7HE,Tel: 023 9226 2971, - ,,,No ratings yet Rate it yourself - /Services/opticians/LeaveReview/DefaultView.aspx?id=OP_5FD_3002__000001_PO77HE,0,0,
Martin Steels Ltd,OP_5FD_3855__000002_PO107AW,OPT,4 The Old Flour Mill,Queen Street,,Emsworth,Hampshire,PO10 7BT,Tel: 01243 375141, - ,,,No ratings yet Rate it yourself - /Services/opticians/LeaveReview/DefaultView.aspx?id=OP_5FD_3855__000002_PO107AW,0,0,
Martin Steels Optometrists,N3O6K,OPT,,4 The Old Flour Mill,Queen Street,Emsworth,Hampshire,PO10 7BT,Tel: 01243375141, - ,,,No ratings yet Rate it yourself - /Services/opticians/LeaveReview/DefaultView.aspx?id=N3O6K,0,0,
Sue Wassall Optometrist,OP_5E9_3716__000001_PO175JW,OPT,"Knights Chambers, The Square",Wickham,Fareham,,,PO17 5JW,Tel: 01329 832706, - ,,,No ratings yet Rate it yourself - /Services/opticians/LeaveReview/DefaultView.aspx?id=OP_5E9_3716__000001_PO175JW,0,0,
Scrivens Opticians,OP_5FD_11109__000001_PO77HG,OPT,29 Wellington Way,,,Waterlooville,Hampshire,PO7 7ED,Tel: 023 9226 2054, - ,,,No ratings yet Rate it yourself - /Services/opticians/LeaveReview/DefaultView.aspx?id=OP_5FD_11109__000001_PO77HG,0,0,
Specsavers,OP_5FD_14838__000001_PO77DU,OPT,310 London Road,,Waterlooville,Hampshire,,PO7 7DU,Tel: 023 9225 9073, - ,,,No ratings yet Rate it yourself - /Services/opticians/LeaveReview/DefaultView.aspx?id=OP_5FD_14838__000001_PO77DU,0,0,
Jonathan C Hobbs Opticians,OP_5FD_8446__000002_PO95AL,OPT,4 Grewell Road,Leigh Park,Havant,,,PO9 5AL,Tel: 023 9247 5844, - ,,,No ratings yet Rate it yourself - /Services/opticians/LeaveReview/DefaultView.aspx?id=OP_5FD_8446__000002_PO95AL,0,0,
Tesco Opticians,SO31 8GN__000002_SO318GN,OPT,Hamble Lane,Bursledon,,Southampton,,SO31 8GN,Tel: 0345 6013479, - ,,,No ratings yet Rate it yourself - /Services/opticians/LeaveReview/DefaultView.aspx?id=SO31 8GN__000002_SO318GN,0,0,
Tesco Opticians,09876__000001_BH255PX,OPT,,Caird Avenue,,New Milton,,BH25 6BP,Tel: 0345 677 9489, - ,,,1 rating Rate it yourself - /Services/opticians/LeaveReview/DefaultView.aspx?id=09876__000001_BH255PX,,,
Denmead Eyecare,OP_5FD_7293__000002_PO76NU,OPT,Hambledon Road,Denmead,Waterlooville,Denmead,,PO7 6NU,Tel: 023 9226 6536, - ,,,No ratings yet Rate it yourself - /Services/opticians/LeaveReview/DefaultView.aspx?id=OP_5FD_7293__000002_PO76NU,0,0,
Richard C Arnold Optometrists,OP_5FD_3135__000002_PO88UJ,OPT,69 London Road,Cowplain,Waterlooville,,,PO8 8UJ,Tel: 023 9225 0641, - ,,,No ratings yet Rate it yourself - /Services/opticians/LeaveReview/DefaultView.aspx?id=OP_5FD_3135__000002_PO88UJ,0,0,
Rawlings Opticians,OP_5LY_14853__000002_SO304QU,OPT,10 St. Johns Centre,Hedge End,,Southampton,,SO30 4QU,Tel: 01489 788665, - ,,,No ratings yet Rate it yourself - /Services/opticians/LeaveReview/DefaultView.aspx?id=OP_5LY_14853__000002_SO304QU,0,0,
Scrivens Opticians & Hearing Care,OP_5LY_14852__000001_SO304FQ,OPT,7 Lower Northam Road,Hedge End,,Southampton,Hampshire,SO30 4FN,Tel: 01489 782131, - ,,,No ratings yet Rate it yourself - /Services/opticians/LeaveReview/DefaultView.aspx?id=OP_5LY_14852__000001_SO304FQ,0,0,
Kelly Eyecare,OP_5A1_14085__000002_SO427RB,OPT,43 Brookley Road,,Brockenhurst,Hampshire,,SO42 7RB,Tel: 01590 623297, - ,,,1 rating Rate it yourself - /Services/opticians/LeaveReview/DefaultView.aspx?id=OP_5A1_14085__000002_SO427RB,,,
Scrivens Opticians,OPT_BH256HY_1,OPT,,3 Mallard Buildings,,New Milton,,BH25 6HY,, - ,,,No ratings yet Rate it yourself - /Services/opticians/LeaveReview/DefaultView.aspx?id=OPT_BH256HY_1,0,0,
J P Loftus,BH25 6HY__000002_BH256HY,OPT,"3 Mallard Buildings,",Station Road,,New Milton,Hampshire,BH25 6HY,Tel: 01425 619 060, - ,,,No ratings yet Rate it yourself - /Services/opticians/LeaveReview/DefaultView.aspx?id=BH25 6HY__000002_BH256HY,0,0,
Vision Express ,OP_5A1_14094__000001_BH256LE,OPT,78 Station Road,,New Milton,Hampshire,,BH25 6LE,Tel: 01425 610977, - ,,,No ratings yet Rate it yourself - /Services/opticians/LeaveReview/DefaultView.aspx?id=OP_5A1_14094__000001_BH256LE,0,0,
Boots-New Milton,OP_BH256JX_46116,OPT,,20 Station Road,,New Milton,Hampshire,BH25 6JX,Tel: 01425 618412, - ,,,17 ratings Rate it yourself - /Services/opticians/LeaveReview/DefaultView.aspx?id=OP_BH256JX_46116,,,
Kelly Eyecare (Parkstone) Limited,OPT_BH256QJ_1,OPT,,"The George Business Centre, Christchurch Road",,New Milton,,BH25 6QJ,, - ,,,No ratings yet Rate it yourself - /Services/opticians/LeaveReview/DefaultView.aspx?id=OPT_BH256QJ_1,0,0,