Organisation Name,NACS Code,Organisation Type,Address1,Address2,Address3,Address4,Address5,PostCode,Telephone Number,Opening time,Value  (Opening time),Banding Classification  (Opening time),NHS.UK users rating,Value  (NHS.UK users rating),Banding Classification  (NHS.UK users rating),Car parking (Is there car parking at this organisation?)
Richard C Arnold Optometrists,OP_5L9_3134__000001_GU299PB,OPT,Red Lion Street,Church Hill,Midhurst,West Sussex,,GU29 9PB,Tel: 01730 814035, - ,,,No ratings yet Rate it yourself - /Services/opticians/LeaveReview/DefaultView.aspx?id=OP_5L9_3134__000001_GU299PB,0,0,
Barnham Opticians,OP_PO220HB_46265,OPT,,64 Barnham Road,,Barnham,Sussex,PO22 0ES,Tel: 01243 554091, - ,,,3 ratings Rate it yourself - /Services/opticians/LeaveReview/DefaultView.aspx?id=OP_PO220HB_46265,,,
Paxton & Welham,PAX001__000001_GU299BY,OPT,Rumbolds Hill,,Midhurst,West Sussex,,GU29 9BY,Tel: 01730 813788, - ,,,No ratings yet Rate it yourself - /Services/opticians/LeaveReview/DefaultView.aspx?id=PAX001__000001_GU299BY,0,0,
Martin Steels Ltd,OP_5P6_OPTICIAN MARTIN STEELS ARUNDEL__000001_BN18,OPT,39 Tarrant Street,,Arundel,West Sussex,,BN18 9DG,Tel: 01903 883444, - ,,,No ratings yet Rate it yourself - /Services/opticians/LeaveReview/DefaultView.aspx?id=OP_5P6_OPTICIAN MARTIN STEELS ARUNDEL__000001_BN18,0,0,
Specsavers Opticians,TP90N,OPT,,Sainsburys' Supermarket,Westhampnett Road,Chichester,Sussex,PO19 7YR,Tel: 01243 781691, - ,,,No ratings yet Rate it yourself - /Services/opticians/LeaveReview/DefaultView.aspx?id=TP90N,0,0,
North Opticians & Eyewear,OPT_PO191NB_1,OPT,,60 North Street,,Chichester,,PO19 1NB,Tel: 01243 940180, - ,,,1 rating Rate it yourself - /Services/opticians/LeaveReview/DefaultView.aspx?id=OPT_PO191NB_1,,,
Specsavers Opticians,OP_5L9_3469__000001_PO191HX,OPT,65 East Street,,Chichester,West Sussex,,PO19 1HL,Tel: 01243 533350, - ,,,No ratings yet Rate it yourself - /Services/opticians/LeaveReview/DefaultView.aspx?id=OP_5L9_3469__000001_PO191HX,0,0,
Boots-Chichester - North St,W1001__000002_PO191LQ,OPT,76-77 North Street,,,Chichester,West Sussex,PO19 1LQ,Tel: 01243 789 927, - ,,,1 rating Rate it yourself - /Services/opticians/LeaveReview/DefaultView.aspx?id=W1001__000002_PO191LQ,,,
Vision Express,O0M8Y,OPT,,74 South Street,,Chichester,West Sussex,PO19 1EE,Tel: 01243 380098, - ,,,No ratings yet Rate it yourself - /Services/opticians/LeaveReview/DefaultView.aspx?id=O0M8Y,0,0,
Forbes Eyecare Ltd,OP_5L9_11782__000001_PO191DS,OPT,60 South Street,,Chichester,West Sussex,,PO19 1DS,Tel: 01243 771573, - ,,,3 ratings Rate it yourself - /Services/opticians/LeaveReview/DefaultView.aspx?id=OP_5L9_11782__000001_PO191DS,,,
The Richard Tildesley Practice,,OPT,,51 West Street,,Chichester,,PO19 1RP,, - ,,,N/A - Data not available,,,
Specavers,TP9E3,OPT,,Sainsbury's,Shripney Road,Bognor Regis,Sussex,PO22 9FB,Tel: 01243 939769, - ,,,No ratings yet Rate it yourself - /Services/opticians/LeaveReview/DefaultView.aspx?id=TP9E3,0,0,
Tesco Opticians,10000__000002_PO193JT,OPT,Fishbourne Road East,,Chichester,West Sussex,,PO19 3JT,Tel: 0345 6779149, - ,,,No ratings yet Rate it yourself - /Services/opticians/LeaveReview/DefaultView.aspx?id=10000__000002_PO193JT,0,0,
Bridle Opticians,OP_5L9_10267__000002_PO227PP,OPT,112 Felpham Road,,Bognor Regis,West Sussex,,PO22 7PP,Tel: 01243 823467, - ,,,No ratings yet Rate it yourself - /Services/opticians/LeaveReview/DefaultView.aspx?id=OP_5L9_10267__000002_PO227PP,0,0,
Direct Optical,OP_5P6_OPTICIAN DIRECT OPT 2__000001_BN175EE,OPT,30 High Street,,Littlehampton,West Sussex,,BN17 5EE,Tel: 01903 715962, - ,,,No ratings yet Rate it yourself - /Services/opticians/LeaveReview/DefaultView.aspx?id=OP_5P6_OPTICIAN DIRECT OPT 2__000001_BN175EE,0,0,
20 Twenty Vision Eyecare,OPT_BN175EA_1,OPT,,66 High Street,,Littlehampton,West Sussex,BN17 5EA,Tel: 01903 366347, - ,,,No ratings yet Rate it yourself - /Services/opticians/LeaveReview/DefaultView.aspx?id=OPT_BN175EA_1,0,0,
Averns & Sandall,OP_5MC_9293__000001_RH204DH,OPT,5 North Street,,Storrington,West Sussex,,RH20 4DH,Tel: 01903 742640, - ,,,2 ratings Rate it yourself - /Services/opticians/LeaveReview/DefaultView.aspx?id=OP_5MC_9293__000001_RH204DH,,,
Walsh Opticians,OPT_PO211QG_1,OPT,,32 Crescent Road,,Bognor Regis,,PO21 1QG,Tel: 01243 823736, - ,,,No ratings yet Rate it yourself - /Services/opticians/LeaveReview/DefaultView.aspx?id=OPT_PO211QG_1,0,0,
C J M Walsh,OP_5L9_9505__000001_PO211QG,OPT,,32 Crescent Road,,Bognor Regis,Sussex,PO21 1QG,Tel: 01243 823736, - ,,,No ratings yet Rate it yourself - /Services/opticians/LeaveReview/DefaultView.aspx?id=OP_5L9_9505__000001_PO211QG,0,0,
Boots-Bognor Regis,OP_5L9_7418__000002_PO211PQ,OPT,47 London Road,,Bognor Regis,West Sussex,,PO21 1PQ,Tel: 01243 830317, - ,,,No ratings yet Rate it yourself - /Services/opticians/LeaveReview/DefaultView.aspx?id=OP_5L9_7418__000002_PO211PQ,0,0,
Specsavers Opticians,OP_5L9_3299__000002_PO211PY,OPT,22 London Road,,Bognor Regis,West Sussex,,PO21 1PY,Tel: 01243 842238, - ,,,1 rating Rate it yourself - /Services/opticians/LeaveReview/DefaultView.aspx?id=OP_5L9_3299__000002_PO211PY,,,
Thomas H Collison Ltd,OP_5L8_6217__000001_BN175HT,OPT,20 Beach Road,,Littlehampton,West Sussex,,BN17 5HT,Tel: 01903 716808, - ,,,No ratings yet Rate it yourself - /Services/opticians/LeaveReview/DefaultView.aspx?id=OP_5L8_6217__000001_BN175HT,0,0,
Martin Steels Ltd,OP_5MC_10264__000002_RH204NQ,OPT,5 Old Mill Square,,Storrington,West Sussex,,RH20 4NQ,Tel: 01903 740420, - ,,,No ratings yet Rate it yourself - /Services/opticians/LeaveReview/DefaultView.aspx?id=OP_5MC_10264__000002_RH204NQ,0,0,
Sight & Sound,OP_5L9_9776__000001_PO211RY,OPT,5 High Street,,Bognor Regis,West Sussex,,PO21 1RQ,Tel: 01243 823144, - ,,,1 rating Rate it yourself - /Services/opticians/LeaveReview/DefaultView.aspx?id=OP_5L9_9776__000001_PO211RY,,,
Aldwick Eyecare Centre,OP_5L9_8777__000001_PO212NY,OPT,,97 Aldwick Road,,Bognor Regis,,PO21 2NY,Tel: 01243 863464, - ,,,No ratings yet Rate it yourself - /Services/opticians/LeaveReview/DefaultView.aspx?id=OP_5L9_8777__000001_PO212NY,0,0,
Boots-Rustington,OPT_BN163DJ_1,OPT,,8 Churchill Parade,The Street,Rustington,West Sussex,BN16 3DJ,Tel: 01903 786330, - ,,,No ratings yet Rate it yourself - /Services/opticians/LeaveReview/DefaultView.aspx?id=OPT_BN163DJ_1,0,0,
Boots-Rustington,OP_5L8_10626__000003_BN163DJ,OPT,8 Churchill Parade,The Street,Rustington,Littlehampton,,BN16 3DJ,Tel: 01903 786 330, - ,,,No ratings yet Rate it yourself - /Services/opticians/LeaveReview/DefaultView.aspx?id=OP_5L8_10626__000003_BN163DJ,0,0,
Thomas H Collison Ltd,OP_5L8_3877__000001_BN163DP,OPT,109 The Street,,Rustington,West Sussex,,BN16 3DP,Tel: 01903 785048, - ,,,No ratings yet Rate it yourself - /Services/opticians/LeaveReview/DefaultView.aspx?id=OP_5L8_3877__000001_BN163DP,0,0,
Specsavers Opticians,OP_5P6_OPTICIAN SPECSAVERS RUSTINGTON__000002_BN16,OPT,136-138 The Street,,Rustington,West Sussex,,BN16 3DN,Tel: 01903 788667, - ,,,No ratings yet Rate it yourself - /Services/opticians/LeaveReview/DefaultView.aspx?id=OP_5P6_OPTICIAN SPECSAVERS RUSTINGTON__000002_BN16,0,0,
Asda Opticians ,OP_BN126PN_85745,OPT,,Littlehampton Road,Ferring,Worthing,West Sussex,BN12 6PN,Tel: 01903 540100, - ,,,No ratings yet Rate it yourself - /Services/opticians/LeaveReview/DefaultView.aspx?id=OP_BN126PN_85745,0,0,
Park & Brown  ,OP_5L9_2765__000001_RH149PF,OPT,32 High Street,,Billingshurst,West Sussex,,RH14 9PF,Tel: 01403 784682, - ,,,13 ratings Rate it yourself - /Services/opticians/LeaveReview/DefaultView.aspx?id=OP_5L9_2765__000001_RH149PF,,,
Venturi Optics Limited,3928,OPT,,5 Petworth Road,,Haslemere,,GU27 2JB,, - ,,,No ratings yet Rate it yourself - /Services/opticians/LeaveReview/DefaultView.aspx?id=3928,0,0,
Venturi Optics Limited,OPT_GU272JB_1,OPT,,5 Petworth Road,,Haslemere,,GU27 2JB,, - ,,,No ratings yet Rate it yourself - /Services/opticians/LeaveReview/DefaultView.aspx?id=OPT_GU272JB_1,0,0,
Chandlers Eyecare,M4G1X,OPT,2 Charter Walk,West Street,,Haslemere,Surrey,GU27 2AD,Tel: 01428 652 512, - ,,,No ratings yet Rate it yourself - /Services/opticians/LeaveReview/DefaultView.aspx?id=M4G1X,0,0,
Batemans  Opticians Ltd,OP_5L5_5818__000002_GU272LA,OPT,68 High Street,,,Haslemere,Surrey,GU27 2LA,Tel: 01428 642 224, - ,,,No ratings yet Rate it yourself - /Services/opticians/LeaveReview/DefaultView.aspx?id=OP_5L5_5818__000002_GU272LA,0,0,
Leightons Opticians & Hearing Care,OP_5L5_12053__000001_GU271BZ,OPT,,37 Wey Hill,,Haslemere,Surrey,GU27 1BZ,Tel: 01428 643 975, - ,,,No ratings yet Rate it yourself - /Services/opticians/LeaveReview/DefaultView.aspx?id=OP_5L5_12053__000001_GU271BZ,0,0,
Liphook Eyecare,OP_5DF_7292__000001_GU307DW,OPT,Liphook Eye Care,31 Station Road,Liphook,Hampshire,,GU30 7DW,Tel: 01428 725158, - ,,,No ratings yet Rate it yourself - /Services/opticians/LeaveReview/DefaultView.aspx?id=OP_5DF_7292__000001_GU307DW,0,0,
Individual Eyes,OP_5P6_OPTICIAN INDIVIDUAL EYES__000002_BN124PE,OPT,324 Goring Road,Goring-By-Sea,Worthing,West Sussex,,BN12 4PE,Tel: 01903 507771, - ,,,No ratings yet Rate it yourself - /Services/opticians/LeaveReview/DefaultView.aspx?id=OP_5P6_OPTICIAN INDIVIDUAL EYES__000002_BN124PE,0,0,
Martin Steels Optometrists,N3O6K,OPT,,4 The Old Flour Mill,Queen Street,Emsworth,Hampshire,PO10 7BT,Tel: 01243375141, - ,,,No ratings yet Rate it yourself - /Services/opticians/LeaveReview/DefaultView.aspx?id=N3O6K,0,0,
Martin Steels Ltd,OP_5FD_3855__000002_PO107AW,OPT,4 The Old Flour Mill,Queen Street,,Emsworth,Hampshire,PO10 7BT,Tel: 01243 375141, - ,,,No ratings yet Rate it yourself - /Services/opticians/LeaveReview/DefaultView.aspx?id=OP_5FD_3855__000002_PO107AW,0,0,
Vision Express,OP_5L8_10453__000001_BN124AD,OPT,,48 Goring Road,,Worthing,,BN12 4AD,Tel: 01903 247042, - ,,,No ratings yet Rate it yourself - /Services/opticians/LeaveReview/DefaultView.aspx?id=OP_5L8_10453__000001_BN124AD,0,0,
Boots-Worthing - Goring Rd,OP_5L8_10097__000001_BN124AL,OPT,6 Wallace Parade,,Goring Road,Worthing,West Sussex,BN12 4AL,Tel: 01903 249 177, - ,,,No ratings yet Rate it yourself - /Services/opticians/LeaveReview/DefaultView.aspx?id=OP_5L8_10097__000001_BN124AL,0,0,
Richard C. Arnold Optometrists,OP_5FD_10298__000001_GU323JU,OPT,3-4 Exchange Building,High Street,,Petersfield,,GU32 3JU,Tel: 01730 263302, - ,,,No ratings yet Rate it yourself - /Services/opticians/LeaveReview/DefaultView.aspx?id=OP_5FD_10298__000001_GU323JU,0,0,
Vision Express,GU32 3JA__000001_GU323JA,OPT,,14 Rams Walk,,Petersfield,Hampshire,GU32 3JA,Tel: 01730 235 977, - ,,,No ratings yet Rate it yourself - /Services/opticians/LeaveReview/DefaultView.aspx?id=GU32 3JA__000001_GU323JA,0,0,
Specsavers Opticians,OP_GU323HJ_46229,OPT,Specsavers Opticians,3-4 The Square,,Petersfield,Hampshire,GU32 3HJ,Tel: 01730 710820, - ,,,No ratings yet Rate it yourself - /Services/opticians/LeaveReview/DefaultView.aspx?id=OP_GU323HJ_46229,0,0,
A Matheson,GU32 3DT__000001_GU323DT,OPT,17 Chapel Street,,Petersfield,Hants,,GU32 3DT,Tel: 01730 261442, - ,,,No ratings yet Rate it yourself - /Services/opticians/LeaveReview/DefaultView.aspx?id=GU32 3DT__000001_GU323DT,0,0,
Owen Leigh Optometry,OP_5FD_14836__000001_GU323LA,OPT,28 The Spain,,Petersfield,Hampshire,,GU32 3LA,Tel: 01730 710174, - ,,,No ratings yet Rate it yourself - /Services/opticians/LeaveReview/DefaultView.aspx?id=OP_5FD_14836__000001_GU323LA,0,0,
Morgan-Owen & Coates Optometrist,OP_5FD_9132__000001_GU323EL,OPT,37 Lavant Street,,Petersfield,Hampshire,,GU32 3EL,Tel: 01730 264258, - ,,,No ratings yet Rate it yourself - /Services/opticians/LeaveReview/DefaultView.aspx?id=OP_5FD_9132__000001_GU323EL,0,0,
Bridle Opticians,OP_5P6_OPTICIAN EAST WIT__000001_PO208DZ,OPT,16 Shore Road,,East Wittering,West Sussex,,PO20 8DZ,Tel: 01243 671717, - ,,,No ratings yet Rate it yourself - /Services/opticians/LeaveReview/DefaultView.aspx?id=OP_5P6_OPTICIAN EAST WIT__000001_PO208DZ,0,0,
Thomas H Collison Ltd,OP_5L8_4863__000001_BN149DB,OPT,7 Cricketers Parade,Broadwater,Worthing,West Sussex,,BN14 9DB,Tel: 01903 231041, - ,,,No ratings yet Rate it yourself - /Services/opticians/LeaveReview/DefaultView.aspx?id=OP_5L8_4863__000001_BN149DB,0,0,
Selsey Eyecare Centre,OP_5L9_7786__000001_PO200QG,OPT,,90 High Street,,Selsey,,PO20 0QG,Tel: 01243 605222, - ,,,No ratings yet Rate it yourself - /Services/opticians/LeaveReview/DefaultView.aspx?id=OP_5L9_7786__000001_PO200QG,0,0,
Zaman Opticians Limited,OPT_GU266HJ_1,OPT,,"Edinburgh House,",Crossways Road,Grayshott,Surrey,GU26 6HJ,Tel: 01428 609707, - ,,,1 rating Rate it yourself - /Services/opticians/LeaveReview/DefaultView.aspx?id=OPT_GU266HJ_1,,,
Matheson Optometrists,OP_5DF_1789__000002_GU266HF,OPT,3-4 Victoria Terraces,"Crossways Road, Grayshott",Hindhead,,,GU26 6HJ,Tel: 01428 606069, - ,,,No ratings yet Rate it yourself - /Services/opticians/LeaveReview/DefaultView.aspx?id=OP_5DF_1789__000002_GU266HF,0,0,
Jonathan C Hobbs Opticians,OP_5FD_8446__000002_PO95AL,OPT,4 Grewell Road,Leigh Park,Havant,,,PO9 5AL,Tel: 023 9247 5844, - ,,,No ratings yet Rate it yourself - /Services/opticians/LeaveReview/DefaultView.aspx?id=OP_5FD_8446__000002_PO95AL,0,0,
Boots-Worthing - Montague St,OP_5L8_315__000003_BN113HE,OPT,48-52 Montague Street,,,Worthing,West Sussex,BN11 3HE,Tel: 01903 211882, - ,,,No ratings yet Rate it yourself - /Services/opticians/LeaveReview/DefaultView.aspx?id=OP_5L8_315__000003_BN113HE,0,0,
Specsavers Opticians,OP_5P6_OPTICIAN SPECSAVERS WORTHING__000007_BN113H,OPT,61-63 Montague Street,,Worthing,West Sussex,,BN11 3HE,Tel: 01903 215555, - ,,,No ratings yet Rate it yourself - /Services/opticians/LeaveReview/DefaultView.aspx?id=OP_5P6_OPTICIAN SPECSAVERS WORTHING__000007_BN113H,0,0,
Robinson Opticians,OP_5P6_9546__000001_BN443RD,OPT,,78 HIgh Street,,Steyning,,BN44 3RD,Tel: 01903 813392, - ,,,No ratings yet Rate it yourself - /Services/opticians/LeaveReview/DefaultView.aspx?id=OP_5P6_9546__000001_BN443RD,0,0,yes
Boots-Worthing - Montague Centre,OP_5L8_9593__000001_BN111YJ,OPT,11 Montague Centre,,,Worthing,West Sussex,BN11 1YJ,Tel: 01903 209180, - ,,,No ratings yet Rate it yourself - /Services/opticians/LeaveReview/DefaultView.aspx?id=OP_5L8_9593__000001_BN111YJ,0,0,
Thomas H Collison Ltd,OP_5L8_11115__000001_BN111SY,OPT,1-1a Liverpool Buildings,Liverpool Road,Worthing,West Sussex,,BN11 1SY,Tel: 01903 821015, - ,,,No ratings yet Rate it yourself - /Services/opticians/LeaveReview/DefaultView.aspx?id=OP_5L8_11115__000001_BN111SY,0,0,
Vision Express,OP_5L8_6853__000001_BN113HA,OPT,32 Montague Street,,Worthing,West Sussex,,BN11 3HA,Tel: 01903 212244, - ,,,No ratings yet Rate it yourself - /Services/opticians/LeaveReview/DefaultView.aspx?id=OP_5L8_6853__000001_BN113HA,0,0,
Rex Wingate & Partners,OP_5FD_8208__000001_PO91PR,OPT,26 North Street,,Havant,,,PO9 1PR,Tel: 023 9248 4184, - ,,,No ratings yet Rate it yourself - /Services/opticians/LeaveReview/DefaultView.aspx?id=OP_5FD_8208__000001_PO91PR,0,0,
Scrivens Opticians,OP_5FD_11108__000002_PO91PG,OPT,3 West Street,,,Havant,Hampshire,PO9 1UN,Tel: 023 9248 3445, - ,,,1 rating Rate it yourself - /Services/opticians/LeaveReview/DefaultView.aspx?id=OP_5FD_11108__000002_PO91PG,,,
Boots Opticians,OPT_PO91US_1,OPT,,Unit 43 Meridian Shopping Centre,,Havant,,PO9 1UW,Tel: 0239 2481464, - ,,,1 rating Rate it yourself - /Services/opticians/LeaveReview/DefaultView.aspx?id=OPT_PO91US_1,,,
Direct Optical,V0X1I,OPT,,80 Dominion Road,,Worthing,West Sussex,BN14 8JT,Tel: 01903206380, - ,,,No ratings yet Rate it yourself - /Services/opticians/LeaveReview/DefaultView.aspx?id=V0X1I,0,0,
Southcoast Opticians,OP_5FD_7643__000001_PO80BT,OPT,31 Highcroft Industrial Estate,Enterprise Road,Horndean,Waterlooville,Hampshire,PO8 0BT,Tel: 023 9259 9411, - ,,,No ratings yet Rate it yourself - /Services/opticians/LeaveReview/DefaultView.aspx?id=OP_5FD_7643__000001_PO80BT,0,0,
Specsavers,OP_5FD_8859__000003_PO91PG,OPT,36-38 West Street,,Havant,,,PO9 1PG,Tel: 023 9249 8490, - ,,,No ratings yet Rate it yourself - /Services/opticians/LeaveReview/DefaultView.aspx?id=OP_5FD_8859__000003_PO91PG,0,0,
Helen Hill ,OP_5FD_8448__000001_PO80JS,OPT,39 Drift Road,Clanfield,Waterlooville,,,PO8 0JS,Tel: 023 9257 1028, - ,,,No ratings yet Rate it yourself - /Services/opticians/LeaveReview/DefaultView.aspx?id=OP_5FD_8448__000001_PO80JS,0,0,
Tesco Opticians,OP_PO91TR_29726,OPT,,Solent Road,,Havant,Hampshire,PO9 1TR,Tel: 0845 601 3479, - ,,,No ratings yet Rate it yourself - /Services/opticians/LeaveReview/DefaultView.aspx?id=OP_PO91TR_29726,0,0,
Richard C Arnold Optometrists,OP_5FD_3135__000002_PO88UJ,OPT,69 London Road,Cowplain,Waterlooville,,,PO8 8UJ,Tel: 023 9225 0641, - ,,,No ratings yet Rate it yourself - /Services/opticians/LeaveReview/DefaultView.aspx?id=OP_5FD_3135__000002_PO88UJ,0,0,
Chandlers Opticians,OP_5DF_866__000002_GU350TN,OPT,5 Forest Centre,,Bordon,,,GU35 0TN,Tel: 01420 477444, - ,,,No ratings yet Rate it yourself - /Services/opticians/LeaveReview/DefaultView.aspx?id=OP_5DF_866__000002_GU350TN,0,0,
ASDA Opticians,OP_5FD_14834__000001_PO93QW,OPT,Larchwood Avenue,Bedhampton,Havant,Hampshire,,PO9 3QW,Tel: 02392 445800, - ,,,1 rating Rate it yourself - /Services/opticians/LeaveReview/DefaultView.aspx?id=OP_5FD_14834__000001_PO93QW,,,
Lancing Optical & Hearing Centre,OP_5L8_10080__000001_BN159BA,OPT,16 Queens Parade,North Road,Lancing,West Sussex,,BN15 9BA,Tel: 01903 753289, - ,,,No ratings yet Rate it yourself - /Services/opticians/LeaveReview/DefaultView.aspx?id=OP_5L8_10080__000001_BN159BA,0,0,
Lancing Eye Care,OP_5L8_11149__000001_BN158AA,OPT,6a Station Parade,,Lancing,West Sussex,,BN15 8AA,Tel: 01903 752021, - ,,,3 ratings Rate it yourself - /Services/opticians/LeaveReview/DefaultView.aspx?id=OP_5L8_11149__000001_BN158AA,,,
Specsavers,OP_5FD_14838__000001_PO77DU,OPT,310 London Road,,Waterlooville,Hampshire,,PO7 7DU,Tel: 023 9225 9073, - ,,,No ratings yet Rate it yourself - /Services/opticians/LeaveReview/DefaultView.aspx?id=OP_5FD_14838__000001_PO77DU,0,0,
Loat Opticians,PO11 9EF__000004_PO119EF,OPT,42a Elm Grove,,Hayling Island,Hampshire,,PO11 9EF,Tel: 02392 468555, - ,,,No ratings yet Rate it yourself - /Services/opticians/LeaveReview/DefaultView.aspx?id=PO11 9EF__000004_PO119EF,0,0,
Peter Collins,OP_5FD_1221__000001_PO119BL,OPT,30 Mengham Road,,Hayling Island,,,PO11 9BL,Tel: 023 9246 7887, - ,,,No ratings yet Rate it yourself - /Services/opticians/LeaveReview/DefaultView.aspx?id=OP_5FD_1221__000001_PO119BL,0,0,
Peter Collins Opticians,OPT_PO77DJ_1,OPT,,"6 The Precinct, London Road",,Waterlooville,,PO7 7DJ,, - ,,,No ratings yet Rate it yourself - /Services/opticians/LeaveReview/DefaultView.aspx?id=OPT_PO77DJ_1,0,0,
Scrivens Opticians,OP_5FD_11109__000001_PO77HG,OPT,29 Wellington Way,,,Waterlooville,Hampshire,PO7 7ED,Tel: 023 9226 2054, - ,,,No ratings yet Rate it yourself - /Services/opticians/LeaveReview/DefaultView.aspx?id=OP_5FD_11109__000001_PO77HG,0,0,
Large & Large Opticians,OP_5FD_3002__000001_PO77HE,OPT,8 Clock House,,Waterlooville,,,PO7 7HE,Tel: 023 9226 2971, - ,,,No ratings yet Rate it yourself - /Services/opticians/LeaveReview/DefaultView.aspx?id=OP_5FD_3002__000001_PO77HE,0,0,
Jonathan C Hobbs Opticians,OP_5FD_5687__000002_PO77EX,OPT,63/65 London Road,,Waterlooville,,,PO7 7EX,Tel: 023 9225 4131, - ,,,No ratings yet Rate it yourself - /Services/opticians/LeaveReview/DefaultView.aspx?id=OP_5FD_5687__000002_PO77EX,0,0,
Henfield Optical Ltd,OP_5MC_9728__000001_BN59DA,OPT,High Street,,Henfield,West Sussex,,BN5 9DA,Tel: 01273 493822, - ,,,No ratings yet Rate it yourself - /Services/opticians/LeaveReview/DefaultView.aspx?id=OP_5MC_9728__000001_BN59DA,0,0,
Henfield Eye Care,OP_5P6_OPTICIAN NIGEL BROWN__000002_BN59DA,OPT,High Street,,Henfield,West Sussex,,BN5 9DA,Tel: 01273 494030, - ,,,No ratings yet Rate it yourself - /Services/opticians/LeaveReview/DefaultView.aspx?id=OP_5P6_OPTICIAN NIGEL BROWN__000002_BN59DA,0,0,
Matheson Optometrists,PO7 5LJ__000002_PO75LJ,OPT,20 London Road,Purbrook,Waterlooville,Hampshire,,PO7 5LJ,Tel: 02392 250605, - ,,,No ratings yet Rate it yourself - /Services/opticians/LeaveReview/DefaultView.aspx?id=PO7 5LJ__000002_PO75LJ,0,0,
Boots-Cranleigh,GU6 8RG__000001_GU68RG,OPT,Unit 3,Stocklund Square,170 High Street,Cranleigh,Surrey,GU6 8RG,Tel: 01483 276994, - ,,,No ratings yet Rate it yourself - /Services/opticians/LeaveReview/DefaultView.aspx?id=GU6 8RG__000001_GU68RG,0,0,
Cranleigh Specsavers Ltd,TP8NR,OPT,,Specsavers Opticians,,"104 High Street, Cranleigh",,GU6 8AJ,, - ,,,No ratings yet Rate it yourself - /Services/opticians/LeaveReview/DefaultView.aspx?id=TP8NR,0,0,
Batemans Opticians Ltd,OP_5L5_2968__000002_GU68AG,OPT,Dunford House,58 High Street,,Cranleigh,Surrey,GU6 8AG,Tel: 01483 272 750, - ,,,No ratings yet Rate it yourself - /Services/opticians/LeaveReview/DefaultView.aspx?id=OP_5L5_2968__000002_GU68AG,0,0,
Gregory & Seeley,OP_5L5_9748__000001_GU68AU,OPT,Tylers Building,High Street,Cranleigh,,,GU6 8AU,Tel: 01483 272 629, - ,,,No ratings yet Rate it yourself - /Services/opticians/LeaveReview/DefaultView.aspx?id=OP_5L5_9748__000001_GU68AU,0,0,
Specsavers,TP97X,OPT,,"Sainsburys, Fitzherbert Road, Farlington,",,Portsmouth,,PO6 1RR,, - ,,,No ratings yet Rate it yourself - /Services/opticians/LeaveReview/DefaultView.aspx?id=TP97X,0,0,
Vision Express,OP_5MC_12036__000001_RH121PB,OPT,23 West Street,,Horsham,West Sussex,,RH12 1PB,Tel: 01403 256636, - ,,,No ratings yet Rate it yourself - /Services/opticians/LeaveReview/DefaultView.aspx?id=OP_5MC_12036__000001_RH121PB,0,0,
Boots-Horsham - West St,OP_5MC_3630__000001_RH121PP,OPT,39 West Street,,Horsham,West Sussex,,RH12 1PP,Tel: 01403 253553, - ,,,1 rating Rate it yourself - /Services/opticians/LeaveReview/DefaultView.aspx?id=OP_5MC_3630__000001_RH121PP,,,
Forrest Optometrists,OP_5FE_8799__000001_PO62AA,OPT,145 Havant Road,145 Havant Road,Portsmouth,Drayton,,PO6 2AA,Tel: 023 9237 6883, - ,,,No ratings yet Rate it yourself - /Services/opticians/LeaveReview/DefaultView.aspx?id=OP_5FE_8799__000001_PO62AA,0,0,
Specsavers Opticians,OP_5P6_OPTICIAN SPECSAVERS HORSHAM__000001_RH121PL,OPT,57 West Street,,Horsham,West Sussex,,RH12 1PL,Tel: 01403 275115, - ,,,1 rating Rate it yourself - /Services/opticians/LeaveReview/DefaultView.aspx?id=OP_5P6_OPTICIAN SPECSAVERS HORSHAM__000001_RH121PL,,,
Denmead Eyecare,OP_5FD_7293__000002_PO76NU,OPT,Hambledon Road,Denmead,Waterlooville,Denmead,,PO7 6NU,Tel: 023 9226 6536, - ,,,No ratings yet Rate it yourself - /Services/opticians/LeaveReview/DefaultView.aspx?id=OP_5FD_7293__000002_PO76NU,0,0,
Opticial Express,OP_12345_RH12 1HQ,OPT,25 Swan Walk,,,Horsham,West Sussex,RH12 1HQ,Tel: 0800 023 2020, - ,,,No ratings yet Rate it yourself - /Services/opticians/LeaveReview/DefaultView.aspx?id=OP_12345_RH12 1HQ,0,0,
Jennifer Armstrong Optician,OP_5L8_6540__000001_BN435DB,OPT,86 High Street,,Shoreham By Sea,,,BN43 5DB,Tel: 01273 462887, - ,,,No ratings yet Rate it yourself - /Services/opticians/LeaveReview/DefaultView.aspx?id=OP_5L8_6540__000001_BN435DB,0,0,
Louise Sloan Opticians,OPT_RH121EH_2,OPT,,1 Piries Place,,Horsham,,RH12 1EH,Tel: 01403 264682, - ,,,No ratings yet Rate it yourself - /Services/opticians/LeaveReview/DefaultView.aspx?id=OPT_RH121EH_2,0,0,
Edminson Butler Optician,OP_5L8_10932__000001_BN435ZD,OPT,2 The Vinery,St. Mary's Road,Shoreham-By-Sea,West Sussex,,BN43 5ZA,Tel: 01273 453567, - ,,,No ratings yet Rate it yourself - /Services/opticians/LeaveReview/DefaultView.aspx?id=OP_5L8_10932__000001_BN435ZD,0,0,
Thomas H Collison Ltd,OP_5L8_2965__000001_BN435WA,OPT,33 Brunswick Road,,Shoreham By Sea,West Sussex,,BN43 5WA,Tel: 01273 455098, - ,,,No ratings yet Rate it yourself - /Services/opticians/LeaveReview/DefaultView.aspx?id=OP_5L8_2965__000001_BN435WA,0,0,
Bliinx Eyecare Studios,GU35 9LU__000001_GU359LU,OPT,Ganders Business Park,Kingsley,Bordon,Hampshire,,GU35 9LU,Tel: 01420 478899, - ,,,No ratings yet Rate it yourself - /Services/opticians/LeaveReview/DefaultView.aspx?id=GU35 9LU__000001_GU359LU,0,0,