Organisation Name,NACS Code,Organisation Type,Address1,Address2,Address3,Address4,Address5,PostCode,Telephone Number,Opening time,Value  (Opening time),Banding Classification  (Opening time),NHS.UK users rating,Value  (NHS.UK users rating),Banding Classification  (NHS.UK users rating),Car parking (Is there car parking at this organisation?)
Matheson Optometrists,OP_5DF_14849__000001_GU345HG,OPT,47 Winchester Road,Four Marks,Alton,,,GU34 5HG,Tel: 01420 560082, - ,,,No ratings yet Rate it yourself - /Services/opticians/LeaveReview/DefaultView.aspx?id=OP_5DF_14849__000001_GU345HG,0,0,
Matheson Optometrists,OP_5E9_572__000001_SO249AG,OPT,1-3 West Street,,,Alresford,,SO24 9AG,Tel: 01962 732336, - ,,,2 ratings Rate it yourself - /Services/opticians/LeaveReview/DefaultView.aspx?id=OP_5E9_572__000001_SO249AG,,,
Rawlings Opticians,OP_5E9_6187__000001_SO249AT,OPT,Bay Tree House,26 West Street,Alresford,Hampshire,,SO24 9AT,Tel: 01962 733269, - ,,,2 ratings Rate it yourself - /Services/opticians/LeaveReview/DefaultView.aspx?id=OP_5E9_6187__000001_SO249AT,,,
Leightons Opticians & Hearing Care,OP_5DF_1179__000001_GU341EN,OPT,,90 High Street,,Alton,Hampshire,GU34 1EN,Tel: 01420 83070, - ,,,No ratings yet Rate it yourself - /Services/opticians/LeaveReview/DefaultView.aspx?id=OP_5DF_1179__000001_GU341EN,0,0,
Alton Eyecare,GU34 1HA__000001_GU341HA,OPT,23 Market Street,,Alton,Hants,,GU34 1HA,Tel: 01420 542363, - ,,,No ratings yet Rate it yourself - /Services/opticians/LeaveReview/DefaultView.aspx?id=GU34 1HA__000001_GU341HA,0,0,
Specsavers Alton,564738__000002_GU341AW,OPT,,58 High Street,,Alton,,GU34 1ET,Tel: 01420 593600, - ,,,No ratings yet Rate it yourself - /Services/opticians/LeaveReview/DefaultView.aspx?id=564738__000002_GU341AW,0,0,
Rawlings Opticians,OP_5DF_4855__000001_GU341AW,OPT,36 High Street,,Alton,Hampshire,,GU34 1BD,Tel: 01420 84230, - ,,,No ratings yet Rate it yourself - /Services/opticians/LeaveReview/DefaultView.aspx?id=OP_5DF_4855__000001_GU341AW,0,0,
Boots Opticians,OPT_GU341BN_1,OPT,,30 High Street,,Hampshire,,GU34 1BN,Tel: 0142084396, - ,,,No ratings yet Rate it yourself - /Services/opticians/LeaveReview/DefaultView.aspx?id=OPT_GU341BN_1,0,0,
Leightons Opticians & Hearing Care,OP_5DF_9286__000001_RG217DE,OPT,,9-11 Church Street,,Basingstoke,Hampshire,RG21 7QG,Tel: 01256 321068, - ,,,No ratings yet Rate it yourself - /Services/opticians/LeaveReview/DefaultView.aspx?id=OP_5DF_9286__000001_RG217DE,0,0,
Buyspecs Direct,OPT_RG211NX_1,OPT,,"Yard House, May Place",,Basingstoke,,RG21 1NX,, - ,,,No ratings yet Rate it yourself - /Services/opticians/LeaveReview/DefaultView.aspx?id=OPT_RG211NX_1,0,0,
Batemans Opticians,OP_5DF_270__000001_RG217LN,OPT,13 Kensington House,Festival Centre,,Basingstoke,Hampshire,RG21 7LN,Tel: 01256 321327, - ,,,No ratings yet Rate it yourself - /Services/opticians/LeaveReview/DefaultView.aspx?id=OP_5DF_270__000001_RG217LN,0,0,
David Clulow Opticians,OP_5DF_8373__000001_RG217JY,OPT,25 Mayfair House,25 Mayfair House,,Basingstoke,Hampshire,RG21 7JY,Tel: 01256 332113, - ,,,No ratings yet Rate it yourself - /Services/opticians/LeaveReview/DefaultView.aspx?id=OP_5DF_8373__000001_RG217JY,0,0,
Vision Express,OP_5DF_12805__000001_RG217LD,OPT,"Unit 4, Chiswick House","Unit 4, Chiswick House",,Basingstoke,,RG21 7LD,Tel: 01256 814824, - ,,,No ratings yet Rate it yourself - /Services/opticians/LeaveReview/DefaultView.aspx?id=OP_5DF_12805__000001_RG217LD,0,0,
Specsavers,OP_5DF_1542__000001_RG217JR,OPT,5 Chiswick House,Festival Place,,Basingstoke,,RG21 7LD,Tel: 01256 479429, - ,,,98 ratings Rate it yourself - /Services/opticians/LeaveReview/DefaultView.aspx?id=OP_5DF_1542__000001_RG217JR,,,
Prime Opticians,F6T5F,OPT,,"Unit 3a, Old Basing Mall",,Basingstoke,Hampshire,RG21 7AW,Tel: 01256 278 278, - ,,,No ratings yet Rate it yourself - /Services/opticians/LeaveReview/DefaultView.aspx?id=F6T5F,0,0,
Boots-Basingstoke - Old Basing Mall,OP_5DF_6102__000002_RG217LW,OPT,15 Old Basing Mall,,,Basingstoke,Hampshire,RG21 7LW,Tel: 01256 364943, - ,,,1 rating Rate it yourself - /Services/opticians/LeaveReview/DefaultView.aspx?id=OP_5DF_6102__000002_RG217LW,,,
Tesco Opticians,654321__000001_RG248BE,OPT,District Shopping Centre,Chineham,,Basingstoke,,RG24 8BE,Tel: 0345 601 3479, - ,,,1 rating Rate it yourself - /Services/opticians/LeaveReview/DefaultView.aspx?id=654321__000001_RG248BE,,,
Chineham Centre Opticians,OP_5DF_11440__000002_RG248BQ,OPT,17 Chineham Shopping Centre,Chineham,,Basingstoke,,RG24 8BQ,Tel: 01256 327564, - ,,,1 rating Rate it yourself - /Services/opticians/LeaveReview/DefaultView.aspx?id=OP_5DF_11440__000002_RG248BQ,,,
Tesco Opticians,OP_SO237RS_29727,OPT,,Easton Lane,,Winchester,Hampshire,SO23 7RS,Tel: 0845 601 3479, - ,,,No ratings yet Rate it yourself - /Services/opticians/LeaveReview/DefaultView.aspx?id=OP_SO237RS_29727,0,0,
The Opticians,OP_5G6_9543__000001_RG291LA,OPT,,113a High Street,,Odiham,Hampshire,RG29 1LA,Tel: 01256 703707, - ,,,No ratings yet Rate it yourself - /Services/opticians/LeaveReview/DefaultView.aspx?id=OP_5G6_9543__000001_RG291LA,0,0,
Bliinx Eyecare Studios,GU35 9LU__000001_GU359LU,OPT,Ganders Business Park,Kingsley,Bordon,Hampshire,,GU35 9LU,Tel: 01420 478899, - ,,,No ratings yet Rate it yourself - /Services/opticians/LeaveReview/DefaultView.aspx?id=GU35 9LU__000001_GU359LU,0,0,
Specsavers,OP_5E9_643__000001_SO238AF,OPT,The Brooks Centre,,Winchester,Hampshire,,SO23 8QY,Tel: 01962 844833, - ,,,1 rating Rate it yourself - /Services/opticians/LeaveReview/DefaultView.aspx?id=OP_5E9_643__000001_SO238AF,,,
Boots-Winchester - High St,OP_5E9_1446__000001_SO239AY,OPT,144 High Street,,Winchester,Winchester,Hampshire,SO23 9AY,Tel: 01962 854553, - ,,,No ratings yet Rate it yourself - /Services/opticians/LeaveReview/DefaultView.aspx?id=OP_5E9_1446__000001_SO239AY,0,0,
Leightons Opticians & Hearing Care,OP_5E9_158__000001_SO238AH,OPT,,67 St. Georges Street,,Winchester,Hampshire,SO23 8AH,Tel: 01962 852961, - ,,,No ratings yet Rate it yourself - /Services/opticians/LeaveReview/DefaultView.aspx?id=OP_5E9_158__000001_SO238AH,0,0,
Vision Express,OP_5E9_2258__000002_SO239BL,OPT,,40 High Street,,Winchester,Hampshire,SO23 9BL,Tel: 01962 856850, - ,,,No ratings yet Rate it yourself - /Services/opticians/LeaveReview/DefaultView.aspx?id=OP_5E9_2258__000002_SO239BL,0,0,
Specsavers Opticians,OPT_SO239AH_1,OPT,,106a High Street,,Winchester,,SO23 9AH,, - ,,,No ratings yet Rate it yourself - /Services/opticians/LeaveReview/DefaultView.aspx?id=OPT_SO239AH_1,0,0,
Rawlings Opticians,OP_5E9_615__000003_SO239BX,OPT,60-61 High Street,,Winchester,Hampshire,,SO23 9BX,Tel: 01962 853082, - ,,,1 rating Rate it yourself - /Services/opticians/LeaveReview/DefaultView.aspx?id=OP_5E9_615__000003_SO239BX,,,
Eyesite Opticians,OP_5E9_12451__000001_SO239BX,OPT,Southgate Corner,65 High Street,,Winchester,Hampshire,SO23 9BX,Tel: 01962 864446, - ,,,No ratings yet Rate it yourself - /Services/opticians/LeaveReview/DefaultView.aspx?id=OP_5E9_12451__000001_SO239BX,0,0,
Brown & White (Opticians) Ltd,OP_5G6_7713__000001_RG279DJ,OPT,Bourne House,London Road,,Hook,Hampshire,RG27 9DJ,Tel: 01256 763016, - ,,,No ratings yet Rate it yourself - /Services/opticians/LeaveReview/DefaultView.aspx?id=OP_5G6_7713__000001_RG279DJ,0,0,
Chandlers Opticians,OP_5DF_866__000002_GU350TN,OPT,5 Forest Centre,,Bordon,,,GU35 0TN,Tel: 01420 477444, - ,,,No ratings yet Rate it yourself - /Services/opticians/LeaveReview/DefaultView.aspx?id=OP_5DF_866__000002_GU350TN,0,0,
Morgan-Owen & Coates Optometrist,OP_5FD_9132__000001_GU323EL,OPT,37 Lavant Street,,Petersfield,Hampshire,,GU32 3EL,Tel: 01730 264258, - ,,,No ratings yet Rate it yourself - /Services/opticians/LeaveReview/DefaultView.aspx?id=OP_5FD_9132__000001_GU323EL,0,0,
A Matheson,GU32 3DT__000001_GU323DT,OPT,17 Chapel Street,,Petersfield,Hants,,GU32 3DT,Tel: 01730 261442, - ,,,No ratings yet Rate it yourself - /Services/opticians/LeaveReview/DefaultView.aspx?id=GU32 3DT__000001_GU323DT,0,0,
Owen Leigh Optometry,OP_5FD_14836__000001_GU323LA,OPT,28 The Spain,,Petersfield,Hampshire,,GU32 3LA,Tel: 01730 710174, - ,,,No ratings yet Rate it yourself - /Services/opticians/LeaveReview/DefaultView.aspx?id=OP_5FD_14836__000001_GU323LA,0,0,
Specsavers Opticians,OP_GU323HJ_46229,OPT,Specsavers Opticians,3-4 The Square,,Petersfield,Hampshire,GU32 3HJ,Tel: 01730 710820, - ,,,No ratings yet Rate it yourself - /Services/opticians/LeaveReview/DefaultView.aspx?id=OP_GU323HJ_46229,0,0,
Vision Express,GU32 3JA__000001_GU323JA,OPT,,14 Rams Walk,,Petersfield,Hampshire,GU32 3JA,Tel: 01730 235 977, - ,,,No ratings yet Rate it yourself - /Services/opticians/LeaveReview/DefaultView.aspx?id=GU32 3JA__000001_GU323JA,0,0,
Richard C. Arnold Optometrists,OP_5FD_10298__000001_GU323JU,OPT,3-4 Exchange Building,High Street,,Petersfield,,GU32 3JU,Tel: 01730 263302, - ,,,No ratings yet Rate it yourself - /Services/opticians/LeaveReview/DefaultView.aspx?id=OP_5FD_10298__000001_GU323JU,0,0,
Ashleigh Sight Care,OP_5E9_14316__000003_SO321AB,OPT,,3 High Street,,Bishops Waltham,Hampshire,SO32 1AB,Tel: 01489 891182, - ,,,No ratings yet Rate it yourself - /Services/opticians/LeaveReview/DefaultView.aspx?id=OP_5E9_14316__000003_SO321AB,0,0,yes
Saxby's,OP_5E9_6269__000001_SO321AR,OPT,Saxby's,2 Houchin Street,Bishops Waltham,Southampton,,SO32 1AR,Tel: 01489 896330, - ,,,No ratings yet Rate it yourself - /Services/opticians/LeaveReview/DefaultView.aspx?id=OP_5E9_6269__000001_SO321AR,0,0,
The Optical Studio,OP_5L5_14611__000001_GU97LL,OPT,,19 Lion and Lamb Yard,Farnham,Surrey,,GU9 7LL,Tel: 01252 717 717, - ,,,No ratings yet Rate it yourself - /Services/opticians/LeaveReview/DefaultView.aspx?id=OP_5L5_14611__000001_GU97LL,0,0,
C.E. Hall Opticians,OP_5L5_14612__000003_GU97HH,OPT,111 West Street,,,Farnham,Surrey,GU9 7HH,Tel: 01252 713 785, - ,,,No ratings yet Rate it yourself - /Services/opticians/LeaveReview/DefaultView.aspx?id=OP_5L5_14612__000003_GU97HH,0,0,
Specsavers,OP_5L5_14615__000004_GU97HH,OPT,119 West Street,Farnham,Surrey,,,GU9 7HH,Tel: 01252 727 737, - ,,,No ratings yet Rate it yourself - /Services/opticians/LeaveReview/DefaultView.aspx?id=OP_5L5_14615__000004_GU97HH,0,0,
Bartlett & Austin,OP_5L5_14605__000001_GU97DN,OPT,9 West Street,Farnham,,Surrey,,GU9 7DN,Tel: 01252 715 728, - ,,,No ratings yet Rate it yourself - /Services/opticians/LeaveReview/DefaultView.aspx?id=OP_5L5_14605__000001_GU97DN,0,0,
Leightons Opticians & Hearing Care,OP_5L5_7999__000001_GU97PH,OPT,,46 Downing Street,,Farnham,Surrey,GU9 7PH,Tel: 01252 711 369, - ,,,No ratings yet Rate it yourself - /Services/opticians/LeaveReview/DefaultView.aspx?id=OP_5L5_7999__000001_GU97PH,0,0,
Boots-Farnham,OP_5L5_3466__000002_GU97NW,OPT,30 The Borough,,,Farnham,Surrey,GU9 7NW,Tel: 01252 715 540, - ,,,No ratings yet Rate it yourself - /Services/opticians/LeaveReview/DefaultView.aspx?id=OP_5L5_3466__000002_GU97NW,0,0,
Optisave,OP_5L5_14614__000001_GU97TX,OPT,13 Woolmead,Farnham,Surrey,,,GU9 7TX,Tel: 01252 717 655, - ,,,No ratings yet Rate it yourself - /Services/opticians/LeaveReview/DefaultView.aspx?id=OP_5L5_14614__000001_GU97TX,0,0,
Liphook Eyecare,OP_5DF_7292__000001_GU307DW,OPT,Liphook Eye Care,31 Station Road,Liphook,Hampshire,,GU30 7DW,Tel: 01428 725158, - ,,,No ratings yet Rate it yourself - /Services/opticians/LeaveReview/DefaultView.aspx?id=OP_5DF_7292__000001_GU307DW,0,0,
Leightons Opticians & Hearing Care,OP_5DF_7434__000001_RG264HN,OPT,,Dental Surgery,Newchurch Road,Tadley,Hampshire,RG26 4HN,Tel: 0118 981 2250, - ,,,No ratings yet Rate it yourself - /Services/opticians/LeaveReview/DefaultView.aspx?id=OP_5DF_7434__000001_RG264HN,0,0,
Brown & White (Opticians) Ltd,OP_5G6_5186__000001_GU513BU,OPT,341 Fleet Road,,Fleet,,,GU51 3NT,Tel: 01252 616830, - ,,,1 rating Rate it yourself - /Services/opticians/LeaveReview/DefaultView.aspx?id=OP_5G6_5186__000001_GU513BU,,,
John Harwood Optometrist,OP_5G6_13202__000002_GU513PQ,OPT,202 Fleet Road,,Fleet,Hampshire,,GU51 4BY,Tel: 01252 613733, - ,,,No ratings yet Rate it yourself - /Services/opticians/LeaveReview/DefaultView.aspx?id=OP_5G6_13202__000002_GU513PQ,0,0,
Optimum Vision Clinic,01-26429,OPT,,"The Falcon Garage, Burghfield Road",,Tadley,Hampshire,RG26 4QY,Tel: 0118 9810267, - ,,,161 ratings Rate it yourself - /Services/opticians/LeaveReview/DefaultView.aspx?id=01-26429,,,yes
Boots-Fleet,OP_5G6_5230__000002_GU513LA,OPT,Unit 23,Hart Shopping Centre,Fleet Road,Fleet,Hampshire,GU51 3LA,Tel: 01252 629 259, - ,,,No ratings yet Rate it yourself - /Services/opticians/LeaveReview/DefaultView.aspx?id=OP_5G6_5230__000002_GU513LA,0,0,
Leightons Opticians & Hearing Care,OP_5G6_14843__000001_GU514BE,OPT,,168b Fleet Road,,Fleet,Hampshire,GU51 4BE,Tel: 01252 617753, - ,,,No ratings yet Rate it yourself - /Services/opticians/LeaveReview/DefaultView.aspx?id=OP_5G6_14843__000001_GU514BE,0,0,
Specsavers,OP_5G6_12127__000001_GU513PQ,OPT,231 Fleet Road,,Fleet,Hampshire,,GU51 4BN,Tel: 01252 815 275, - ,,,No ratings yet Rate it yourself - /Services/opticians/LeaveReview/DefaultView.aspx?id=OP_5G6_12127__000001_GU513PQ,0,0,
Helen Hill ,OP_5FD_8448__000001_PO80JS,OPT,39 Drift Road,Clanfield,Waterlooville,,,PO8 0JS,Tel: 023 9257 1028, - ,,,No ratings yet Rate it yourself - /Services/opticians/LeaveReview/DefaultView.aspx?id=OP_5FD_8448__000001_PO80JS,0,0,
Zaman Opticians Limited,OPT_GU266HJ_1,OPT,,"Edinburgh House,",Crossways Road,Grayshott,Surrey,GU26 6HJ,Tel: 01428 609707, - ,,,1 rating Rate it yourself - /Services/opticians/LeaveReview/DefaultView.aspx?id=OPT_GU266HJ_1,,,
Matheson Optometrists,OP_5DF_1789__000002_GU266HF,OPT,3-4 Victoria Terraces,"Crossways Road, Grayshott",Hindhead,,,GU26 6HJ,Tel: 01428 606069, - ,,,No ratings yet Rate it yourself - /Services/opticians/LeaveReview/DefaultView.aspx?id=OP_5DF_1789__000002_GU266HF,0,0,
Rawlings Opticians,OP_5LY_14074__000001_SO533DB,OPT,,"14 Fryern Arcade, Winchester Road",Chandlers Ford,Chandlers Ford,,SO53 2DQ,Tel: 023 8025 2428, - ,,,No ratings yet Rate it yourself - /Services/opticians/LeaveReview/DefaultView.aspx?id=OP_5LY_14074__000001_SO533DB,0,0,
Leightons Opticians & Hearing Care,OP_5LY_14073__000001_SO532QD,OPT,,"4-5 The Mall, Winchester Road",Chandlers Ford,Southampton,Hampshire,SO53 2QD,Tel: 02380 266 181, - ,,,No ratings yet Rate it yourself - /Services/opticians/LeaveReview/DefaultView.aspx?id=OP_5LY_14073__000001_SO532QD,0,0,
Vision Express,OP_SO505RH_30046,OPT,,25 Market Street,,Eastleigh,Hampshire,SO50 5RH,Tel: 02380 650640, - ,,,No ratings yet Rate it yourself - /Services/opticians/LeaveReview/DefaultView.aspx?id=OP_SO505RH_30046,0,0,
Specsavers,OPT_SO505RG_1,OPT,,35-37 Market Street,,Eastleigh,Hampshire,SO50 5RG,Tel: 02380 620011, - ,,,1 rating Rate it yourself - /Services/opticians/LeaveReview/DefaultView.aspx?id=OPT_SO505RG_1,,,
Boots Opticians,OPT_SO505SF_1,OPT,,48 Swan Centre,,Eastleigh,,SO50 5SF,, - ,,,1 rating Rate it yourself - /Services/opticians/LeaveReview/DefaultView.aspx?id=OPT_SO505SF_1,,,
Specsavers,OP_5LY_14851__000001_SO509EP,OPT,9 Leigh Road,,Eastleigh,Hampshire,,SO50 9EP,Tel: 023 8062 0011, - ,,,No ratings yet Rate it yourself - /Services/opticians/LeaveReview/DefaultView.aspx?id=OP_5LY_14851__000001_SO509EP,0,0,
Specsavers,OP_5G6_3553__000001_GU111EG,OPT,25 Union Street,,Aldershot,Hampshire,,GU11 1EG,Tel: 01252 345 556, - ,,,No ratings yet Rate it yourself - /Services/opticians/LeaveReview/DefaultView.aspx?id=OP_5G6_3553__000001_GU111EG,0,0,
Hampson Opticians,OP_SO532FW_85744,OPT,,3A Hursley Road,,Chandlers Ford,,SO53 2FW,, - ,,,No ratings yet Rate it yourself - /Services/opticians/LeaveReview/DefaultView.aspx?id=OP_SO532FW_85744,0,0,
Tesco Opticians,OP_SP101UZ_29725,OPT,,River Way,,Andover,Hampshire,SP10 1UZ,Tel: 0345 601 3479, - ,,,No ratings yet Rate it yourself - /Services/opticians/LeaveReview/DefaultView.aspx?id=OP_SP101UZ_29725,0,0,
Vision Express,OP_5G6_1652__000003_GU111DB,OPT,13a Wellington Centre,,Aldershot,Hampshire,,GU11 1DB,Tel: 01252 323491, - ,,,No ratings yet Rate it yourself - /Services/opticians/LeaveReview/DefaultView.aspx?id=OP_5G6_1652__000003_GU111DB,0,0,
Optisave,OP_5G6_14844__000004_GU111DB,OPT,26-27 The Galleries,,Aldershot,Hampshire,,GU11 1DB,Tel: 01252 319234, - ,,,No ratings yet Rate it yourself - /Services/opticians/LeaveReview/DefaultView.aspx?id=OP_5G6_14844__000004_GU111DB,0,0,
CGW Limited,OPT_SO533DA_1,OPT,,7 Bournemouth Road,,Chandlers Ford,,SO53 3DA,, - ,,,No ratings yet Rate it yourself - /Services/opticians/LeaveReview/DefaultView.aspx?id=OPT_SO533DA_1,0,0,
Specsavers,OP_5E9_5988__000001_SP101NG,OPT,,72 High Street,,Andover,Hampshire,SP10 1NG,Tel: 01264 339 369, - ,,,2 ratings Rate it yourself - /Services/opticians/LeaveReview/DefaultView.aspx?id=OP_5E9_5988__000001_SP101NG,,,
West Country Eyecare,OL/5FT__000004_SP101NG,OPT,76 High Street,,andover,Hants,,SP10 1NG,Tel: 01264 366165, - ,,,No ratings yet Rate it yourself - /Services/opticians/LeaveReview/DefaultView.aspx?id=OL/5FT__000004_SP101NG,0,0,
McGregor & Hull Eye Care Centre,OP_5G6_14840__000001_GU111DX,OPT,3 Wellington Street,Aldershot,Hampshire,,,GU11 1DX,Tel: 01252 661162, - ,,,No ratings yet Rate it yourself - /Services/opticians/LeaveReview/DefaultView.aspx?id=OP_5G6_14840__000001_GU111DX,0,0,
Boots-Andover - High St,OP_5E9_6071__000001_SP101LP,OPT,63 High Street,,,Andover,Hampshire,SP10 1LP,Tel: 01264 352887, - ,,,2 ratings Rate it yourself - /Services/opticians/LeaveReview/DefaultView.aspx?id=OP_5E9_6071__000001_SP101LP,,,
Southcoast Opticians,OP_5FD_7643__000001_PO80BT,OPT,31 Highcroft Industrial Estate,Enterprise Road,Horndean,Waterlooville,Hampshire,PO8 0BT,Tel: 023 9259 9411, - ,,,No ratings yet Rate it yourself - /Services/opticians/LeaveReview/DefaultView.aspx?id=OP_5FD_7643__000001_PO80BT,0,0,
Vision Express,OP_5E9_1549__000001_SP101LU,OPT,45 Chantry Way,The Chantry Centre,andover,Hampshire,,SP10 1LQ,Tel: 01264 324801, - ,,,No ratings yet Rate it yourself - /Services/opticians/LeaveReview/DefaultView.aspx?id=OP_5E9_1549__000001_SP101LU,0,0,
Brian Craig Eyecare Ltd,OP_5G6_14842__000001_GU111HT,OPT,44 Station Road,Aldershot,,Hampshire,,GU11 1HT,Tel: 01252 324048, - ,,,No ratings yet Rate it yourself - /Services/opticians/LeaveReview/DefaultView.aspx?id=OP_5G6_14842__000001_GU111HT,0,0,
Leightons Opticians & Hearing Care,OP_5E9_433__000001_SP101RW,OPT,,68 The Chantry Centre,,Andover,Hampshire,SP10 1RW,Tel: 01264 365695, - ,,,No ratings yet Rate it yourself - /Services/opticians/LeaveReview/DefaultView.aspx?id=OP_5E9_433__000001_SP101RW,0,0,
Denmead Eyecare,OP_5FD_7293__000002_PO76NU,OPT,Hambledon Road,Denmead,Waterlooville,Denmead,,PO7 6NU,Tel: 023 9226 6536, - ,,,No ratings yet Rate it yourself - /Services/opticians/LeaveReview/DefaultView.aspx?id=OP_5FD_7293__000002_PO76NU,0,0,
Peter Bennett,SO53 3AF__000001_SO533AF,OPT,232 Bournemouth Road,Chandlers Ford,Eastleigh,Hants,,SO53 3AF,, - ,,,No ratings yet Rate it yourself - /Services/opticians/LeaveReview/DefaultView.aspx?id=SO53 3AF__000001_SO533AF,0,0,
Leightons Opticians & Hearing Care,OP_5L5_12053__000001_GU271BZ,OPT,,37 Wey Hill,,Haslemere,Surrey,GU27 1BZ,Tel: 01428 643 975, - ,,,No ratings yet Rate it yourself - /Services/opticians/LeaveReview/DefaultView.aspx?id=OP_5L5_12053__000001_GU271BZ,0,0,
Sue Wassall Optometrist,OP_5E9_3716__000001_PO175JW,OPT,"Knights Chambers, The Square",Wickham,Fareham,,,PO17 5JW,Tel: 01329 832706, - ,,,No ratings yet Rate it yourself - /Services/opticians/LeaveReview/DefaultView.aspx?id=OP_5E9_3716__000001_PO175JW,0,0,
Costco Wholesale UK Ltd,CO-1833-8,OPT,,Templar Avenue,,Farnborough,,GU14 6FE,Tel: 01252 896 945, - ,,,No ratings yet Rate it yourself - /Services/opticians/LeaveReview/DefaultView.aspx?id=CO-1833-8,0,0,
Carol Underwood,PCTCAROLUNDERWOOD1__000001_SP103DG,OPT,King George Road,,andover,Hants,,SP10 3DG,Tel: 0845 602 3842, - ,,,No ratings yet Rate it yourself - /Services/opticians/LeaveReview/DefaultView.aspx?id=PCTCAROLUNDERWOOD1__000001_SP103DG,0,0,
ASDA Opticians,OP_5LY_14072__000002_SO533YJ,OPT,Bournemouth Road,Chandlers Ford,Eastleigh,Hampshire,,SO53 3YJ,Tel: 023 8026 8341, - ,,,147 ratings Rate it yourself - /Services/opticians/LeaveReview/DefaultView.aspx?id=OP_5LY_14072__000002_SO533YJ,,,
Specsavers Opticians,,OPT,Sainsburys,Tollbar Way,Hedge End,Southampton,Hampshire,SO30 2UH,Tel: 01489 232 234, - ,,,N/A - Data not available,,,
M&S Opticians - Hedge End,H8W0C,OPT,,"Toll Bar Way, Hedge End",,Southampton,Hampshire,SO30 2UH,Tel: 01322 918085, - ,,,3 ratings Rate it yourself - /Services/opticians/LeaveReview/DefaultView.aspx?id=H8W0C,,,
Chandlers Eyecare,M4G1X,OPT,2 Charter Walk,West Street,,Haslemere,Surrey,GU27 2AD,Tel: 01428 652 512, - ,,,No ratings yet Rate it yourself - /Services/opticians/LeaveReview/DefaultView.aspx?id=M4G1X,0,0,
Batemans  Opticians Ltd,OP_5L5_5818__000002_GU272LA,OPT,68 High Street,,,Haslemere,Surrey,GU27 2LA,Tel: 01428 642 224, - ,,,No ratings yet Rate it yourself - /Services/opticians/LeaveReview/DefaultView.aspx?id=OP_5L5_5818__000002_GU272LA,0,0,
Venturi Optics Limited,OPT_GU272JB_1,OPT,,5 Petworth Road,,Haslemere,,GU27 2JB,, - ,,,No ratings yet Rate it yourself - /Services/opticians/LeaveReview/DefaultView.aspx?id=OPT_GU272JB_1,0,0,
Venturi Optics Limited,3928,OPT,,5 Petworth Road,,Haslemere,,GU27 2JB,, - ,,,No ratings yet Rate it yourself - /Services/opticians/LeaveReview/DefaultView.aspx?id=3928,0,0,
Richard C Arnold Optometrists,OP_5FD_3135__000002_PO88UJ,OPT,69 London Road,Cowplain,Waterlooville,,,PO8 8UJ,Tel: 023 9225 0641, - ,,,No ratings yet Rate it yourself - /Services/opticians/LeaveReview/DefaultView.aspx?id=OP_5FD_3135__000002_PO88UJ,0,0,
Buyspecs Direct,TP0ML,OPT,,"Unit 9, Pipers Court",Berkshire Drive,Thatcham,Berkshire,RG19 4ER,Tel: 01635 293578, - ,,,No ratings yet Rate it yourself - /Services/opticians/LeaveReview/DefaultView.aspx?id=TP0ML,0,0,
ASDA Opticians,OP_5G6_14839__000002_GU147LT,OPT,Asda Stores Ltd,West Meade,Farnborough,Hampshire,,GU14 7LT,Tel: 01252 557292, - ,,,No ratings yet Rate it yourself - /Services/opticians/LeaveReview/DefaultView.aspx?id=OP_5G6_14839__000002_GU147LT,0,0,
Scrivens Opticians & Hearing Care,OP_5LY_14852__000001_SO304FQ,OPT,7 Lower Northam Road,Hedge End,,Southampton,Hampshire,SO30 4FN,Tel: 01489 782131, - ,,,No ratings yet Rate it yourself - /Services/opticians/LeaveReview/DefaultView.aspx?id=OP_5LY_14852__000001_SO304FQ,0,0,
Specsavers,OP_5G6_5949__000002_GU146YA,OPT,Princes Mead Centre,,,Farnborough,,GU14 6YA,Tel: 01252 370 498, - ,,,No ratings yet Rate it yourself - /Services/opticians/LeaveReview/DefaultView.aspx?id=OP_5G6_5949__000002_GU146YA,0,0,
Boots-Farnborough,OP_5G6_5035__000001_GU147RZ,OPT,87-91 Queensmead,,,Farnborough,Hampshire,GU14 7RZ,Tel: 01252 549100, - ,,,No ratings yet Rate it yourself - /Services/opticians/LeaveReview/DefaultView.aspx?id=OP_5G6_5035__000001_GU147RZ,0,0,
Speccies,GU14 7RL__000001_GU147RL,OPT,71 Queens Mead,,Farnborough,Hants,,GU14 7RL,Tel: 01252 373008, - ,,,No ratings yet Rate it yourself - /Services/opticians/LeaveReview/DefaultView.aspx?id=GU14 7RL__000001_GU147RL,0,0,
Rawlings Opticians,OP_5LY_14853__000002_SO304QU,OPT,10 St. Johns Centre,Hedge End,,Southampton,,SO30 4QU,Tel: 01489 788665, - ,,,No ratings yet Rate it yourself - /Services/opticians/LeaveReview/DefaultView.aspx?id=OP_5LY_14853__000002_SO304QU,0,0,
Brian Craig Eyecare Ltd,GU14 7NY__000002_GU147NY,OPT,20 Victoria Road,,Farnborough,Hampshire,,GU14 7NY,, - ,,,No ratings yet Rate it yourself - /Services/opticians/LeaveReview/DefaultView.aspx?id=GU14 7NY__000002_GU147NY,0,0,
Leightons Opticians & Hearing Care,OP_5G6_8593__000001_GU147NY,OPT,20 Victoria Road,.,Farnborough,.,,GU14 7NY,Tel: 01252 545666, - ,,,No ratings yet Rate it yourself - /Services/opticians/LeaveReview/DefaultView.aspx?id=OP_5G6_8593__000001_GU147NY,0,0,