Organisation Name,NACS Code,Organisation Type,Address1,Address2,Address3,Address4,Address5,PostCode,Telephone Number,Opening time,Value  (Opening time),Banding Classification  (Opening time),NHS.UK users rating,Value  (NHS.UK users rating),Banding Classification  (NHS.UK users rating),Car parking (Is there car parking at this organisation?)
Peel & Gudgin Opticians,OP_5JW_11956__000001_IP331LS,OPT,Abbey House,30 Angel Hill,Bury St. Edmunds,,,IP33 1LS,Tel: 01284 754541, - ,,,No ratings yet Rate it yourself - /Services/opticians/LeaveReview/DefaultView.aspx?id=OP_5JW_11956__000001_IP331LS,0,0,
Boots-Bury St Edmunds - Brentgovel St,OP_5JW_4595__000001_IP331EB,OPT,5 Brentgovel Street,,Bury St. Edmunds,Suffolk,,IP33 1EB,Tel: 01284 768328, - ,,,No ratings yet Rate it yourself - /Services/opticians/LeaveReview/DefaultView.aspx?id=OP_5JW_4595__000001_IP331EB,0,0,
Scrivens Ltd,OP_5JW_13102__000001_IP331LW,OPT,43 Abbeygate Street,,,Bury St Edmunds,Suffolk,IP33 1LW,Tel: 01284 702061, - ,,,No ratings yet Rate it yourself - /Services/opticians/LeaveReview/DefaultView.aspx?id=OP_5JW_13102__000001_IP331LW,0,0,
Specsavers Opticians,OP_5JW_11921__000002_IP331BE,OPT,,10 Buttermarket,Bury St. Edmunds,Suffolk,,IP33 1DB,Tel: 01284 702240, - ,,,No ratings yet Rate it yourself - /Services/opticians/LeaveReview/DefaultView.aspx?id=OP_5JW_11921__000002_IP331BE,0,0,
Vision Express,OP_5JW_14192__000001_IP331DD,OPT,12-13 Buttermarket,,Bury St Edmunds,Suffolk,,IP33 1DP,Tel: 01284 750776, - ,,,No ratings yet Rate it yourself - /Services/opticians/LeaveReview/DefaultView.aspx?id=OP_5JW_14192__000001_IP331DD,0,0,
Scotts Opticians,OP_5JW_1353__000001_IP331BJ,OPT,,58 Abbeygate Street,,Bury St. Edmunds,Suffolk,IP33 1LB,Tel: 01284 754616, - ,,,No ratings yet Rate it yourself - /Services/opticians/LeaveReview/DefaultView.aspx?id=OP_5JW_1353__000001_IP331BJ,0,0,
Boots-Bury St Edmunds - Cornhill,OP_5JW_1093__000002_IP331BT,OPT,11-13 Cornhill,,,Bury St Edmunds,Suffolk,IP33 1BX,Tel: 01284 703013, - ,,,1 rating Rate it yourself - /Services/opticians/LeaveReview/DefaultView.aspx?id=OP_5JW_1093__000002_IP331BT,,,
Wigram and Ware (Bury) Ltd,OP_5JW_7581__000001_IP331BS,OPT,4 Central Walk,,Bury St. Edmunds,Suffolk,,IP33 1BS,Tel: 01284 753821, - ,,,No ratings yet Rate it yourself - /Services/opticians/LeaveReview/DefaultView.aspx?id=OP_5JW_7581__000001_IP331BS,0,0,
F G Brown & Associates Ltd,OP_5JT_9924__000001_IP141BB,OPT,Denmark House,41 Bury Street,,Stowmarket,Suffolk,IP14 1HA,Tel: 01449 612812, - ,,,No ratings yet Rate it yourself - /Services/opticians/LeaveReview/DefaultView.aspx?id=OP_5JT_9924__000001_IP141BB,0,0,yes
Asda Opticians,OPT_IP14 1DE,OPT,,MEADOW CENTRE,WILKS WAY,STOWMARKET,,IP14 1DE,Tel: 01449 763083, - ,,,2 ratings Rate it yourself - /Services/opticians/LeaveReview/DefaultView.aspx?id=OPT_IP14 1DE,,,
Peel & Gudgin Opticians,OP_5JT_7588__000001_IP141EF,OPT,11 Station Road West,,Stowmarket,Suffolk,,IP14 1EF,Tel: 01449 612984, - ,,,No ratings yet Rate it yourself - /Services/opticians/LeaveReview/DefaultView.aspx?id=OP_5JT_7588__000001_IP141EF,0,0,
Specsavers,OP_5JT_14932__000002_IP141AH,OPT,11 Ipswich Street,,Stowmarket,Suffolk,,IP14 1AH,Tel: 01449 618280, - ,,,No ratings yet Rate it yourself - /Services/opticians/LeaveReview/DefaultView.aspx?id=OP_5JT_14932__000002_IP141AH,0,0,
Scotts Opticians,OP_5G1_3800__000001_IP242DT,OPT,Red Cross Building,Guildhall Street,Thetford,Norfolk,,IP24 2DT,Tel: 01842 764831, - ,,,No ratings yet Rate it yourself - /Services/opticians/LeaveReview/DefaultView.aspx?id=OP_5G1_3800__000001_IP242DT,0,0,
Specsavers Opticians,PREMISES_IP242BG__000001_IP242BG,OPT,20 Riverside Walk,,Thetford,Norfolk,,IP24 2BG,Tel: 01842 826565, - ,,,No ratings yet Rate it yourself - /Services/opticians/LeaveReview/DefaultView.aspx?id=PREMISES_IP242BG__000001_IP242BG,0,0,
Boots-Thetford,OP_5G1_11564__000003_IP242AP,OPT,26-28 King Street,,,Thetford,Norfolk,IP24 2AP,Tel: 01842 753356, - ,,,No ratings yet Rate it yourself - /Services/opticians/LeaveReview/DefaultView.aspx?id=OP_5G1_11564__000003_IP242AP,0,0,
Needham Market Opticians,OP-01-9208-5PT__000001_IP68DG,OPT,102 High Street,,Needham Market,Suffolk,,IP6 8DG,Tel: 01449 723180, - ,,,No ratings yet Rate it yourself - /Services/opticians/LeaveReview/DefaultView.aspx?id=OP-01-9208-5PT__000001_IP68DG,0,0,
Scrivens Ltd,OP_5JW_13236__000002_IP287EF,OPT,25 Market Place,,,Mildenhall,Suffolk,IP28 7EF,Tel: 01638 716383, - ,,,No ratings yet Rate it yourself - /Services/opticians/LeaveReview/DefaultView.aspx?id=OP_5JW_13236__000002_IP287EF,0,0,
Boots-Mildenhall,OP_5JW_2465__000001_IP287LF,OPT,1 New Street,,,Mildenhall,Suffolk,IP28 7EN,Tel: 01638 713017, - ,,,No ratings yet Rate it yourself - /Services/opticians/LeaveReview/DefaultView.aspx?id=OP_5JW_2465__000001_IP287LF,0,0,
Scrivens Optical Hearing,OP_5G1_37__000001_IP224AG,OPT,45 Mere Street,,,Diss,Norfolk,IP22 4AG,Tel: 01379 642739, - ,,,No ratings yet Rate it yourself - /Services/opticians/LeaveReview/DefaultView.aspx?id=OP_5G1_37__000001_IP224AG,0,0,
Specsavers Opticians,060409__000001_IP224AD,OPT,9-11 Mere Street,,Diss,Norfolk,,IP22 4AD,Tel: 01379 658490, - ,,,No ratings yet Rate it yourself - /Services/opticians/LeaveReview/DefaultView.aspx?id=060409__000001_IP224AD,0,0,
Adkins Opticians,OP_5G1_7337__000001_IP223JZ,OPT,,2 Market Hill,,Diss,Norfolk,IP22 4JZ,Tel: 01379 650899, - ,,,1 rating Rate it yourself - /Services/opticians/LeaveReview/DefaultView.aspx?id=OP_5G1_7337__000001_IP223JZ,,,
A Stodel Optometrist,OP_5G1_7182__000002_IP223LB,OPT,15 Market Place,,Diss,Norfolk,,IP22 4AB,Tel: 01379 642598, - ,,,No ratings yet Rate it yourself - /Services/opticians/LeaveReview/DefaultView.aspx?id=OP_5G1_7182__000002_IP223LB,0,0,
Medical Eye Centre,OP_5JW_2729__000001_CO109HZ,OPT,"Lotus Cottage, Hall Street",Long Melford,Sudbury,,,CO10 9HZ,Tel: 01787 377741, - ,,,No ratings yet Rate it yourself - /Services/opticians/LeaveReview/DefaultView.aspx?id=OP_5JW_2729__000001_CO109HZ,0,0,
Helen Ashby Opticians,OP_5JW_886__000001_IP270AA,OPT,9 Market Hill,,Brandon,Suffolk,,IP27 0AA,Tel: 01842 815055, - ,,,No ratings yet Rate it yourself - /Services/opticians/LeaveReview/DefaultView.aspx?id=OP_5JW_886__000001_IP270AA,0,0,
Lakenheath Opticians,OP_5JW_3555__000001_IP279JS,OPT,36 High Street,Lakenheath,,Brandon,Suffolk,IP27 9JS,Tel: 01842 861999, - ,,,No ratings yet Rate it yourself - /Services/opticians/LeaveReview/DefaultView.aspx?id=OP_5JW_3555__000001_IP279JS,0,0,
Boots-Sudbury - North St,OP_5JW_863__000002_CO106RB,OPT,9 North Street,,,Sudbury,Suffolk,CO10 1RB,Tel: 01787 372590, - ,,,No ratings yet Rate it yourself - /Services/opticians/LeaveReview/DefaultView.aspx?id=OP_5JW_863__000002_CO106RB,0,0,
Sage Opticians,A8L6S,OPT,,20 Market Hill,,"Sudbury, Suffolk",,CO10 2EA,Tel: 01787 323775, - ,,,No ratings yet Rate it yourself - /Services/opticians/LeaveReview/DefaultView.aspx?id=A8L6S,0,0,
Specsavers Opticians,OP_5JW_468730__000002_CO102EA,OPT,6a Market Hill,,Sudbury,Suffolk,,CO10 2EA,Tel: 01787 468730, - ,,,No ratings yet Rate it yourself - /Services/opticians/LeaveReview/DefaultView.aspx?id=OP_5JW_468730__000002_CO102EA,0,0,
"Wardale, Williams Opticians",OP_5JW_4463__000001_CO106ET,OPT,Wardale Williams,50 Gainsborough Street,,Sudbury,Suffolk,CO10 2ET,Tel: 01787 372492, - ,,,No ratings yet Rate it yourself - /Services/opticians/LeaveReview/DefaultView.aspx?id=OP_5JW_4463__000001_CO106ET,0,0,yes
Dunstone Optometry,OP_5JT_6400__000001_IP75DZ,OPT,3 Queen Street,Hadleigh,,Ipswich,,IP7 5DZ,Tel: 01473 823755, - ,,,No ratings yet Rate it yourself - /Services/opticians/LeaveReview/DefaultView.aspx?id=OP_5JT_6400__000001_IP75DZ,0,0,
Hadleigh Eye & Hearing Centre,B9O9L,OPT,43 High Street,43B High Street,Ipswich,Ipswich,,IP7 5AB,Tel: 01473 828801, - ,,,2 ratings Rate it yourself - /Services/opticians/LeaveReview/DefaultView.aspx?id=B9O9L,,,
Scotts Opticians,OP_5JW_8892__000001_CB88LX,OPT,1 High Street,,Newmarket,Suffolk,,CB8 8LX,Tel: 01638 662475, - ,,,No ratings yet Rate it yourself - /Services/opticians/LeaveReview/DefaultView.aspx?id=OP_5JW_8892__000001_CB88LX,0,0,
Scrivens Ltd,OP_5JW_10132__000002_CB88HT,OPT,,78 High Street,,Newmarket,Suffolk,CB8 8JX,Tel: 01638 661620, - ,,,No ratings yet Rate it yourself - /Services/opticians/LeaveReview/DefaultView.aspx?id=OP_5JW_10132__000002_CB88HT,0,0,
Peters Opticians,OP_5JW_3756__000002_CB88EQ,OPT,,14 The Rookery,,Newmarket,Suffolk,CB8 8EQ,Tel: 01638 660107, - ,,,1 rating Rate it yourself - /Services/opticians/LeaveReview/DefaultView.aspx?id=OP_5JW_3756__000002_CB88EQ,,,
Specsavers,OP_5JW_14930__000003_CB88EQ,OPT,,1 The Guineas,,Newmarket,,CB8 8EQ,Tel: 01638 565270, - ,,,No ratings yet Rate it yourself - /Services/opticians/LeaveReview/DefaultView.aspx?id=OP_5JW_14930__000003_CB88EQ,0,0,
Boots Opticians (Newmarket),TP53M,OPT,,Unit 54 The Guinness Shopping Centre,,Suffolk,,CB8 8EQ,, - ,,,2 ratings Rate it yourself - /Services/opticians/LeaveReview/DefaultView.aspx?id=TP53M,,,
Spectacular Opticians,OP_5JW_3419__000001_CB88JP,OPT,126 High Street,,Newmarket,Suffolk,,CB8 8JP,Tel: 01638 662774, - ,,,No ratings yet Rate it yourself - /Services/opticians/LeaveReview/DefaultView.aspx?id=OP_5JW_3419__000001_CB88JP,0,0,
ASDA Opticians,OP_5JQ_14008__000002_IP15PD,OPT,Asda Stores Ltd,Goddard Road,,Ipswich,,IP1 5PD,Tel: 01473 464723, - ,,,No ratings yet Rate it yourself - /Services/opticians/LeaveReview/DefaultView.aspx?id=OP_5JQ_14008__000002_IP15PD,0,0,
Cecil C Amey Ltd,OP_5G1_473__000003_NR172AH,OPT,11 Church Street,,Attleborough,,,NR17 2AH,Tel: 01953 453109, - ,,,No ratings yet Rate it yourself - /Services/opticians/LeaveReview/DefaultView.aspx?id=OP_5G1_473__000003_NR172AH,0,0,
Martin Christopher Opticians,OP_5G1_9850__000002_NR172AH,OPT,Church Street,,Attleborough,Norfolk,,NR17 2AH,Tel: 01953 452564, - ,,,No ratings yet Rate it yourself - /Services/opticians/LeaveReview/DefaultView.aspx?id=OP_5G1_9850__000002_NR172AH,0,0,
Eyecare Opticians,OP_5JQ_2629__000001_IP14HA,OPT,341 Norwich Road,,Ipswich,Suffolk,,IP1 4HA,Tel: 01473 747000, - ,,,No ratings yet Rate it yourself - /Services/opticians/LeaveReview/DefaultView.aspx?id=OP_5JQ_2629__000001_IP14HA,0,0,
R H Jeffery & Associates,OP_5JQ_4554__000001_IP13QU,OPT,28 Anglesea Road,,Ipswich,Suffolk,,IP1 3PP,Tel: 01473 210672, - ,,,No ratings yet Rate it yourself - /Services/opticians/LeaveReview/DefaultView.aspx?id=OP_5JQ_4554__000001_IP13QU,0,0,
Tesco Opticians Ipswich,CO-1998_24092015,OPT,,"42 London Road, Copdock Interchange",,Ipswich,,IP1 2HB,, - ,,,No ratings yet Rate it yourself - /Services/opticians/LeaveReview/DefaultView.aspx?id=CO-1998_24092015,0,0,
Cecil C Amey Ltd,OP_5G1_10131__000001_IP256AB,OPT,,13 High Street,,Watton,Norfolk,IP25 6AB,Tel: 01953 881535, - ,,,No ratings yet Rate it yourself - /Services/opticians/LeaveReview/DefaultView.aspx?id=OP_5G1_10131__000001_IP256AB,0,0,
Kite Opticians,OP_5JQ_3066__000001_IP13LU,OPT,38 Berners Street,,,Ipswich,Suffolk,IP1 3LU,Tel: 01473 255250, - ,,,No ratings yet Rate it yourself - /Services/opticians/LeaveReview/DefaultView.aspx?id=OP_5JQ_3066__000001_IP13LU,0,0,
Vision Express,OP_5JQ_13694__000001_IP13BB,OPT,3 Tower Ramparts,Tavern Street,Ipswich,,,IP1 3DH,Tel: 01473 281199, - ,,,No ratings yet Rate it yourself - /Services/opticians/LeaveReview/DefaultView.aspx?id=OP_5JQ_13694__000001_IP13BB,0,0,
Boots-Ipswich - Tavern St,OP_5JQ_8836__000002_IP13AA,OPT,5 Tavern Street,,,Ipswich,Suffolk,IP1 3AA,Tel: 01473 258256, - ,,,1 rating Rate it yourself - /Services/opticians/LeaveReview/DefaultView.aspx?id=OP_5JQ_8836__000002_IP13AA,,,
Loach & Wade Opticians,OP_5JK_4424__000001_CB75DS,OPT,23a Churchgate Street Soham,,Ely,Cambridgeshire,,CB7 5DS,Tel: 01353 722667, - ,,,No ratings yet Rate it yourself - /Services/opticians/LeaveReview/DefaultView.aspx?id=OP_5JK_4424__000001_CB75DS,0,0,
Observatory Opticians,OP_5JQ_3639__000001_IP11SS,OPT,Observatory the Opticians,8 Queen Street,,Ipswich,Suffolk,IP1 1SS,Tel: 01473 252595, - ,,,3 ratings Rate it yourself - /Services/opticians/LeaveReview/DefaultView.aspx?id=OP_5JQ_3639__000001_IP11SS,,,
Optical Express,IP1 1SW_11111,OPT,Clydesdale House (3rd floor),,,Ipswich,Suffolk,IP1 1SW,Tel: 0800 023 2020, - ,,,No ratings yet Rate it yourself - /Services/opticians/LeaveReview/DefaultView.aspx?id=IP1 1SW_11111,0,0,
A J Rawling,OP_5JQ_13693__000001_IP13DB,OPT,14 Northgate Street,,Ipswich,Suffolk,,IP1 3DB,Tel: 01473 252026, - ,,,1 rating Rate it yourself - /Services/opticians/LeaveReview/DefaultView.aspx?id=OP_5JQ_13693__000001_IP13DB,,,no
Specsavers Opticians,OP_5JQ_6836__000001_IP13AW,OPT,46a Tavern Street,,Ipswich,Suffolk,,IP1 3AW,Tel: 01473 210333, - ,,,4 ratings Rate it yourself - /Services/opticians/LeaveReview/DefaultView.aspx?id=OP_5JQ_6836__000001_IP13AW,,,
Ryco Optics ,D13094,OPT,,"10a The Causeway, Burwell",,Cambridge,,CB25 0DU,, - ,,,No ratings yet Rate it yourself - /Services/opticians/LeaveReview/DefaultView.aspx?id=D13094,0,0,
Boots-Ipswich - Upper Brook St,OP_5JQ_10211__000001_IP41EE,OPT,16 Upper Brook Street,,,Ipswich,Suffolk,IP4 1EE,Tel: 01473 252 359, - ,,,No ratings yet Rate it yourself - /Services/opticians/LeaveReview/DefaultView.aspx?id=OP_5JQ_10211__000001_IP41EE,0,0,
Eyedeal Opticians,OL_22/5/2006_5PR__000001_IP41EJ,OPT,20 Carr Street,,Ipswich,Suffolk,,IP4 1EJ,Tel: 01473 251702, - ,,,No ratings yet Rate it yourself - /Services/opticians/LeaveReview/DefaultView.aspx?id=OL_22/5/2006_5PR__000001_IP41EJ,0,0,
Billson Opticians,OP_5JW_13692__000001_CB99EG,OPT,10 Queens Square,,Haverhill,Suffolk,,CB9 9EG,Tel: 01440 714441, - ,,,No ratings yet Rate it yourself - /Services/opticians/LeaveReview/DefaultView.aspx?id=OP_5JW_13692__000001_CB99EG,0,0,
Armstrong & North Ltd,01-17721,OPT,,36 Carr Street,,Ipswich,,IP4 1EN,Tel: 01473 226009, - ,,,No ratings yet Rate it yourself - /Services/opticians/LeaveReview/DefaultView.aspx?id=01-17721,0,0,
Boots-Haverhill,OP_5JW_7789__000001_CB98AH,OPT,41 High Street,,Haverhill,Suffolk,,CB9 8AH,Tel: 01440 702789, - ,,,No ratings yet Rate it yourself - /Services/opticians/LeaveReview/DefaultView.aspx?id=OP_5JW_7789__000001_CB98AH,0,0,
Specsavers Opticians,OP_5JW_765060__000001_CB98AR,OPT,8 The Chauntry,High Street,Haverhill,Suffolk,,CB9 8AR,Tel: 01440 765060, - ,,,No ratings yet Rate it yourself - /Services/opticians/LeaveReview/DefaultView.aspx?id=OP_5JW_765060__000001_CB98AR,0,0,
H E Kersey,OP_5JQ_4378__000001_IP41BA,OPT,22 Tacket Street,,Ipswich,Suffolk,,IP4 1BA,Tel: 01473 406567, - ,,,No ratings yet Rate it yourself - /Services/opticians/LeaveReview/DefaultView.aspx?id=OP_5JQ_4378__000001_IP41BA,0,0,
Observatory Opticians,OP_5JW_4154__000001_CB98HB,OPT,Observatory the Opticians,1 Camps Road,,Haverhill,Suffolk,CB9 8HB,Tel: 01440 761922, - ,,,No ratings yet Rate it yourself - /Services/opticians/LeaveReview/DefaultView.aspx?id=OP_5JW_4154__000001_CB98HB,0,0,
Primesight Opticians,OP_5JQ_14007__000002_IP44EL,OPT,432 Woodbridge Road,,Ipswich,Suffolk,,IP4 4EL,Tel: 01473 724158, - ,,,No ratings yet Rate it yourself - /Services/opticians/LeaveReview/DefaultView.aspx?id=OP_5JQ_14007__000002_IP44EL,0,0,
Jeffery & Associates,OP_5G1_9719__000001_IP209BE,OPT,10 Old Market Place,,Harleston,,,IP20 9BE,Tel: 01379 853494, - ,,,No ratings yet Rate it yourself - /Services/opticians/LeaveReview/DefaultView.aspx?id=OP_5G1_9719__000001_IP209BE,0,0,
Cecil C Amey Ltd,OP_5G1_8186__000001_IP209AS,OPT,,33b The Thoroughfare,,Harleston,Norfolk,IP20 9AS,Tel: 01379 853504, - ,,,No ratings yet Rate it yourself - /Services/opticians/LeaveReview/DefaultView.aspx?id=OP_5G1_8186__000001_IP209AS,0,0,
Country Vision,OP_5JR_13690__000001_IP139AN,OPT,11a Market Hill,,Framlingham,Suffolk,,IP13 9AN,Tel: 01728 621250, - ,,,3 ratings Rate it yourself - /Services/opticians/LeaveReview/DefaultView.aspx?id=OP_5JR_13690__000001_IP139AN,,,
M Shepherd Optometrist ,V7C4R,OPT,,"1 Cooper Court, The Street",Longstratton,Norfolk,,NR15 2XG,Tel: 01508 532 669, - ,,,No ratings yet Rate it yourself - /Services/opticians/LeaveReview/DefaultView.aspx?id=V7C4R,0,0,
Cecil C Amey Ltd,OP_5G1_3108__000002_NR180BB,OPT,,10 Market Place,,Wymondham,Norfolk,NR18 0AQ,Tel: 01953 605181, - ,,,No ratings yet Rate it yourself - /Services/opticians/LeaveReview/DefaultView.aspx?id=OP_5G1_3108__000002_NR180BB,0,0,
Community Primary Opth Clinic,OP_TAG_U/K__000001_CO92DL,OPT,78 Hedingham Road,,Halstead,Essex,,CO9 2DL,Tel: 01787 291010, - ,,,No ratings yet Rate it yourself - /Services/opticians/LeaveReview/DefaultView.aspx?id=OP_TAG_U/K__000001_CO92DL,0,0,
Wardale Williams Opticians,OP_TAG_9147__000001_CO92AP,OPT,Wardale Williams,28 High Street,,Halstead,Essex,CO9 2AP,Tel: 01787 472209, - ,,,2 ratings Rate it yourself - /Services/opticians/LeaveReview/DefaultView.aspx?id=OP_TAG_9147__000001_CO92AP,,,
Billson Opticians,OP_TAG_10093__000001_CO92JG,OPT,82 High Street,,Halstead,Essex,,CO9 2JG,Tel: 01787 472847, - ,,,No ratings yet Rate it yourself - /Services/opticians/LeaveReview/DefaultView.aspx?id=OP_TAG_10093__000001_CO92JG,0,0,
Mark G Walker Opticians,167800__000002_CO62DQ,OPT,Viaduct Lodge,Colchester Road,Chappel,Essex,,CO6 2DQ,Tel: 01206 243427, - ,,,No ratings yet Rate it yourself - /Services/opticians/LeaveReview/DefaultView.aspx?id=167800__000002_CO62DQ,0,0,
Simon Kleyn Opticians,OP_TAG_13386__000001_CO62QX,OPT,,106,High Street,Earls Colne,Essex,CO6 2QX,Tel: 01787223213, - ,,,1 rating Rate it yourself - /Services/opticians/LeaveReview/DefaultView.aspx?id=OP_TAG_13386__000001_CO62QX,,,
Specsavers Optical Group Ltd,5PP2000,OPT,,Ely Lisle Lane Sainsbury's,,Ely,,CB7 4AS,, - ,,,No ratings yet Rate it yourself - /Services/opticians/LeaveReview/DefaultView.aspx?id=5PP2000,0,0,
Tesco Opticians Ely,CB7 4DJ,OPT,,Angel Drove,,Ely,,CB7 4DJ,, - ,,,No ratings yet Rate it yourself - /Services/opticians/LeaveReview/DefaultView.aspx?id=CB7 4DJ,0,0,
Burrows & Sunaway,OP_5JR_14932__000001_IP121AQ,OPT,16 The Thoroughfare,,Woodbridge,Suffolk,,IP12 1AQ,Tel: 01394 383211, - ,,,1 rating Rate it yourself - /Services/opticians/LeaveReview/DefaultView.aspx?id=OP_5JR_14932__000001_IP121AQ,,,
Steven Dewberry Opticians,OP_5JR_3328__000001_IP121BX,OPT,Quay Street,,Woodbridge,Suffolk,,IP12 1BX,Tel: 01394 385130, - ,,,No ratings yet Rate it yourself - /Services/opticians/LeaveReview/DefaultView.aspx?id=OP_5JR_3328__000001_IP121BX,0,0,
Eyepractice Limited,OP_5JR_1253__000002_IP121AH,OPT,77 Thoroughfare,,,Woodbridge,Suffolk,IP12 1AH,Tel: 01394 382718, - ,,,No ratings yet Rate it yourself - /Services/opticians/LeaveReview/DefaultView.aspx?id=OP_5JR_1253__000002_IP121AH,0,0,no
Scrivens Opticians,OP_5JK_12276__000002_CB74AF,OPT,6 Buttermarket,,,Ely,Cambridgeshire,CB7 4AF,Tel: 01353 665282, - ,,,No ratings yet Rate it yourself - /Services/opticians/LeaveReview/DefaultView.aspx?id=OP_5JK_12276__000002_CB74AF,0,0,
Specsavers Opticians,OP_5JK_12281__000002_CB74LF,OPT,45 High Street,,Ely,Cambridgeshire,,CB7 4LF,Tel: 01353 653120, - ,,,No ratings yet Rate it yourself - /Services/opticians/LeaveReview/DefaultView.aspx?id=OP_5JK_12281__000002_CB74LF,0,0,
Wades of Ely Ltd ,OP_5JK_2958__000001_CB74JU,OPT,2 High Street,,,Ely,Cambridgeshire,CB7 4JU,Tel: 01353 662674, - ,,,No ratings yet Rate it yourself - /Services/opticians/LeaveReview/DefaultView.aspx?id=OP_5JK_2958__000001_CB74JU,0,0,
Loach & Wade,8 5PP__000002_CB61NE,OPT,7 Granby Street Littleport,,Ely,Cambridgeshire,,CB6 1NE,Tel: 01353 862333, - ,,,No ratings yet Rate it yourself - /Services/opticians/LeaveReview/DefaultView.aspx?id=8 5PP__000002_CB61NE,0,0,
Spectacular Opthalmic Opticians,OP_5JK_12277__000001_CB74LJ,OPT,7a High Street,,Ely,Cambridgeshire,,CB7 4LJ,Tel: 01353 659333, - ,,,No ratings yet Rate it yourself - /Services/opticians/LeaveReview/DefaultView.aspx?id=OP_5JK_12277__000001_CB74LJ,0,0,
Premiere Specs Centre,OP_5AH_1101__000001_CO111AH,OPT,29 High Street,,Manningtree,Essex,,CO11 1AH,Tel: 01206 396396, - ,,,No ratings yet Rate it yourself - /Services/opticians/LeaveReview/DefaultView.aspx?id=OP_5AH_1101__000001_CO111AH,0,0,
Piper & Priem Optometrists,OP_5AH_13299__000001_CO111AJ,OPT,30 High Street,,Manningtree,Essex,,CO11 1AJ,Tel: 01206 392529, - ,,,4 ratings Rate it yourself - /Services/opticians/LeaveReview/DefaultView.aspx?id=OP_5AH_13299__000001_CO111AJ,,,
Billson Opticians,515PP__000001_CB214HS,OPT,55 High Street Linton,,Cambridge,Cambridgeshire,,CB21 4HS,Tel: 01223 891333, - ,,,No ratings yet Rate it yourself - /Services/opticians/LeaveReview/DefaultView.aspx?id=515PP__000001_CB214HS,0,0,
Templemans Opticians (Home Visits),5P1/OPH1__000002_SS67QA,OPT,,25 Easton Road,Sutton Heath,Woodbridge,,IP12 3TD,Tel: 01268 777729, - ,,,1 rating Rate it yourself - /Services/opticians/LeaveReview/DefaultView.aspx?id=5P1/OPH1__000002_SS67QA,,,
Briscoe & Briscoe Opticians,OP_5JT_13702__000001_IP91LX,OPT,"Dorian House",The Street,Shotley,Suffolk,,IP9 1LX,Tel: 01473 788772, - ,,,No ratings yet Rate it yourself - /Services/opticians/LeaveReview/DefaultView.aspx?id=OP_5JT_13702__000001_IP91LX,0,0,
Healthcall Optical Services Ltd,OP_5G1_6799__000001_NR46XB,OPT,Suite 5,Cringleford Business Centre,Intwood,,,NR4 6XB,Tel: 01603 455197, - ,,,No ratings yet Rate it yourself - /Services/opticians/LeaveReview/DefaultView.aspx?id=OP_5G1_6799__000001_NR46XB,0,0,
Parker Optometrists,OP_5CY_3006__000003_PE389JZ,OPT,5 Wales Court,,Downham Market,,,PE38 9JZ,Tel: 01366 382118, - ,,,1 rating Rate it yourself - /Services/opticians/LeaveReview/DefaultView.aspx?id=OP_5CY_3006__000003_PE389JZ,,,
Spectacular Opticians,OP_5CY_8392__000001_PE389DH,OPT,2 Maltings Mall,Bridge Street,Downham Market,,,PE38 9DH,Tel: 01366 385241, - ,,,No ratings yet Rate it yourself - /Services/opticians/LeaveReview/DefaultView.aspx?id=OP_5CY_8392__000001_PE389DH,0,0,
Coe  Costa & Moore,OP_5A2_5284__000001_NR46NW,OPT,Eaton Centre -  Church Lane,Eaton,Norwich,,,NR4 6NW,Tel: 01603 501260, - ,,,2 ratings Rate it yourself - /Services/opticians/LeaveReview/DefaultView.aspx?id=OP_5A2_5284__000001_NR46NW,,,
Centenary Opticians,E4C7U,OPT,,3 Bowthorpe Centre,Wendene,Norwich,Norfolk,NR5 9HA,Tel: 01603 945611, - ,,,No ratings yet Rate it yourself - /Services/opticians/LeaveReview/DefaultView.aspx?id=E4C7U,0,0,
S J Williams,OP_5GN_13383__000001_CB101EU,OPT,21 King Street,,Saffron Walden,Essex,,CB10 1EU,Tel: 01799 523302, - ,,,1 rating Rate it yourself - /Services/opticians/LeaveReview/DefaultView.aspx?id=OP_5GN_13383__000001_CB101EU,,,
D H Thomas,OP_5GN_10846__000001_CB101EJ,OPT,"Suite 2, Goldhill House",Gold Street,Saffron Walden,Essex,,CB10 1EJ,Tel: 01799 525957, - ,,,No ratings yet Rate it yourself - /Services/opticians/LeaveReview/DefaultView.aspx?id=OP_5GN_10846__000001_CB101EJ,0,0,
Boots-Saffron Walden,OP_5GN_10289__000001_CB101EE,OPT,44 High Street,,,Saffron Walden,Essex,CB10 1EE,Tel: 01799 522 175, - ,,,1 rating Rate it yourself - /Services/opticians/LeaveReview/DefaultView.aspx?id=OP_5GN_10289__000001_CB101EE,,,
Abbott & Murdoch Opticians,OP_5G1_13933__000002_NR147JR,OPT,4 The Street,,Poringland,NORWICH,Norfolk,NR14 7JR,Tel: 01508 494670, - ,,,1 rating Rate it yourself - /Services/opticians/LeaveReview/DefaultView.aspx?id=OP_5G1_13933__000002_NR147JR,,,
Scrivens Opticians & Hearing Care,OP_5AH_6821__000001_CO123QB,OPT,,175 High Street,Dovercourt,Harwich,Essex,CO12 3QB,Tel: 01255 553433, - ,,,No ratings yet Rate it yourself - /Services/opticians/LeaveReview/DefaultView.aspx?id=OP_5AH_6821__000001_CO123QB,0,0,
Joseph Lord Opticians (part of the Goldsmith Webb Group,OP_5AH_2892__000001_CO123PN,OPT,145 High Street,,,Dovercourt,Essex,CO12 3AX,Tel: 01255 551661, - ,,,No ratings yet Rate it yourself - /Services/opticians/LeaveReview/DefaultView.aspx?id=OP_5AH_2892__000001_CO123PN,0,0,
Eyes Rite Opticians,OP_5AH_8759__000001_CO123JR,OPT,54 Kingsway,Dovercourt,Harwich,,,CO12 3JR,Tel: 01255 502059, - ,,,No ratings yet Rate it yourself - /Services/opticians/LeaveReview/DefaultView.aspx?id=OP_5AH_8759__000001_CO123JR,0,0,