Organisation Name,NACS Code,Organisation Type,Address1,Address2,Address3,Address4,Address5,PostCode,Telephone Number,Opening time,Value  (Opening time),Banding Classification  (Opening time),NHS.UK users rating,Value  (NHS.UK users rating),Banding Classification  (NHS.UK users rating),Car parking (Is there car parking at this organisation?)
Hassan-Hicks Opticians,OP_5A1_14092__000001_SO419NB,OPT,18 St. Thomas Street,,Lymington,Hampshire,,SO41 9NB,Tel: 01590 675576, - ,,,No ratings yet Rate it yourself - /Services/opticians/LeaveReview/DefaultView.aspx?id=OP_5A1_14092__000001_SO419NB,0,0,
Specsavers,OP_SO419AL_34942,OPT,,71 High Street,,Lymington,,SO41 9AL,, - ,,,No ratings yet Rate it yourself - /Services/opticians/LeaveReview/DefaultView.aspx?id=OP_SO419AL_34942,0,0,
Vision Express ,OP_5A1_14090__000001_SO419AJ,OPT,95 High Street,,Lymington,Hampshire,,SO41 9AP,Tel: 01590 677722, - ,,,No ratings yet Rate it yourself - /Services/opticians/LeaveReview/DefaultView.aspx?id=OP_5A1_14090__000001_SO419AJ,0,0,
Scrivens Opticians,OP_5A1_14093__000001_SO419AG,OPT,,100 High Street,,Lymington,Hampshire,SO41 9AP,Tel: 01590 672645, - ,,,No ratings yet Rate it yourself - /Services/opticians/LeaveReview/DefaultView.aspx?id=OP_5A1_14093__000001_SO419AG,0,0,
Boots-Lymington,OP_5A1_14091__000001_SO419AF,OPT,35 High Street,,Lymington,Hampshire,,SO41 9AF,Tel: 01590 671655, - ,,,No ratings yet Rate it yourself - /Services/opticians/LeaveReview/DefaultView.aspx?id=OP_5A1_14091__000001_SO419AF,0,0,
Tesco Opticians,09876__000001_BH255PX,OPT,,Caird Avenue,,New Milton,,BH25 6BP,Tel: 0345 677 9489, - ,,,1 rating Rate it yourself - /Services/opticians/LeaveReview/DefaultView.aspx?id=09876__000001_BH255PX,,,
J P Loftus,BH25 6HY__000002_BH256HY,OPT,"3 Mallard Buildings,",Station Road,,New Milton,Hampshire,BH25 6HY,Tel: 01425 619 060, - ,,,No ratings yet Rate it yourself - /Services/opticians/LeaveReview/DefaultView.aspx?id=BH25 6HY__000002_BH256HY,0,0,
Scrivens Opticians,OPT_BH256HY_1,OPT,,3 Mallard Buildings,,New Milton,,BH25 6HY,, - ,,,No ratings yet Rate it yourself - /Services/opticians/LeaveReview/DefaultView.aspx?id=OPT_BH256HY_1,0,0,
Vision Express ,OP_5A1_14094__000001_BH256LE,OPT,78 Station Road,,New Milton,Hampshire,,BH25 6LE,Tel: 01425 610977, - ,,,No ratings yet Rate it yourself - /Services/opticians/LeaveReview/DefaultView.aspx?id=OP_5A1_14094__000001_BH256LE,0,0,
Boots-New Milton,OP_BH256JX_46116,OPT,,20 Station Road,,New Milton,Hampshire,BH25 6JX,Tel: 01425 618412, - ,,,17 ratings Rate it yourself - /Services/opticians/LeaveReview/DefaultView.aspx?id=OP_BH256JX_46116,,,
Kelly Eyecare (Parkstone) Limited,OPT_BH256QJ_1,OPT,,"The George Business Centre, Christchurch Road",,New Milton,,BH25 6QJ,, - ,,,No ratings yet Rate it yourself - /Services/opticians/LeaveReview/DefaultView.aspx?id=OPT_BH256QJ_1,0,0,
Kelly Eyecare,OP_5A1_14085__000002_SO427RB,OPT,43 Brookley Road,,Brockenhurst,Hampshire,,SO42 7RB,Tel: 01590 623297, - ,,,1 rating Rate it yourself - /Services/opticians/LeaveReview/DefaultView.aspx?id=OP_5A1_14085__000002_SO427RB,,,
Howie & Tickner Ltd,OP_5FN_2085__000001_BH235EL,OPT,,6 Highcliffe Corner,Lymington Road,HIGHCLIFFE,Dorset,BH23 5EL,Tel: 01425 272382, - ,,,No ratings yet Rate it yourself - /Services/opticians/LeaveReview/DefaultView.aspx?id=OP_5FN_2085__000001_BH235EL,0,0,
R M Skidmore,OP_5DG_13635__000001_PO390DH,OPT,2a The Avenue,,Freshwater,,,PO39 0DH,Tel: 01983 753532, - ,,,No ratings yet Rate it yourself - /Services/opticians/LeaveReview/DefaultView.aspx?id=OP_5DG_13635__000001_PO390DH,0,0,
Bournemouth Vision Centre,OP_5FN_13766__000003_BH235ET,OPT,T/A Your Eyesite,304 Lymington Road,Highcliffe,,,BH23 5ET,Tel: 01425 272991, - ,,,No ratings yet Rate it yourself - /Services/opticians/LeaveReview/DefaultView.aspx?id=OP_5FN_13766__000003_BH235ET,0,0,
Your Eye Site,OPT_BH235ET_1,OPT,,304 Lymington Road,,Highcliffe,,BH23 5ET,, - ,,,No ratings yet Rate it yourself - /Services/opticians/LeaveReview/DefaultView.aspx?id=OPT_BH235ET_1,0,0,
Rutherford Eyecare,PO40 9AJ__000001_PO409AJ,OPT,3 Moa Place,,Freshwater,Isle Of Wight,,PO40 9DS,Tel: 01983 753532, - ,,,No ratings yet Rate it yourself - /Services/opticians/LeaveReview/DefaultView.aspx?id=PO40 9AJ__000001_PO409AJ,0,0,
Nicholson Eyecare,OP_5A1_14084__000001_BH238NJ,OPT,1 Runnymeade,Ringwood Road,Bransgore,,,BH23 8NJ,Tel: 01425 673343, - ,,,No ratings yet Rate it yourself - /Services/opticians/LeaveReview/DefaultView.aspx?id=OP_5A1_14084__000001_BH238NJ,0,0,
Johnsen Optical Ltd,OP_5FN_8753__000001_BH231BW,OPT,21 Church Street,,Christchurch,,,BH23 1BW,Tel: 01202 485476, - ,,,No ratings yet Rate it yourself - /Services/opticians/LeaveReview/DefaultView.aspx?id=OP_5FN_8753__000001_BH231BW,0,0,
Boots-Christchurch,CO-3328__000003_BH231QA,OPT,Unit 8,Saxon Square Shopping Centre,,Christchurch,,BH23 1QA,Tel: 01202 480975, - ,,,No ratings yet Rate it yourself - /Services/opticians/LeaveReview/DefaultView.aspx?id=CO-3328__000003_BH231QA,0,0,
Specsavers Opticians (Christchurch Specsavers Ltd),OP_5FN_14711__000001_BH231AY,OPT,34 High Street,,Christchurch,Dorset,,BH23 1AY,Tel: 01202 480 707, - ,,,3 ratings Rate it yourself - /Services/opticians/LeaveReview/DefaultView.aspx?id=OP_5FN_14711__000001_BH231AY,,,
"Taylormade Eyecare Limited, Trading As Raxworthy Opticians",OP_5FN_3435__000001_BH231QE,OPT,51 Bargates,,Christchurch,Christchurch,,BH23 1QE,Tel: 01202 484888, - ,,,No ratings yet Rate it yourself - /Services/opticians/LeaveReview/DefaultView.aspx?id=OP_5FN_3435__000001_BH231QE,0,0,
Tesco Stores Ltd,OP_5CE_2771__000001_BH77DY,OPT,Riverside Avenue,,Bournemouth,Bournemouth,,BH7 7DY,Tel: 0345 677 9094, - ,,,No ratings yet Rate it yourself - /Services/opticians/LeaveReview/DefaultView.aspx?id=OP_5CE_2771__000001_BH77DY,0,0,
Julian May Opticians ,5QN-11__000001_BH63QX,OPT,101 Southbourne Grove,Southbourne,,Bournemouth,Dorset,BH6 3QY,Tel: 01202 432435, - ,,,4 ratings Rate it yourself - /Services/opticians/LeaveReview/DefaultView.aspx?id=5QN-11__000001_BH63QX,,,yes
Bournemouth Vision Centre (Maven Optics Ltd) ,OP_5CE_13750__000001_BH63QU,OPT,63 Southbourne Grove,Southbourne,Bournemouth,,,BH6 3QU,Tel: 01202 424491, - ,,,1 rating Rate it yourself - /Services/opticians/LeaveReview/DefaultView.aspx?id=OP_5CE_13750__000001_BH63QU,,,
PBS Optical,OPT_BH241TW_1,OPT,,Cornerways Cottage,,Ringwood,,BH24 1TW,, - ,,,No ratings yet Rate it yourself - /Services/opticians/LeaveReview/DefaultView.aspx?id=OPT_BH241TW_1,0,0,
Scrivens Opticians & Hearing Care,00093__000001_SO456AQ,OPT,52 Pylewell Road,52 Pylewell Road,Hythe,Southampton (Hythe),Hampshire,SO45 6AQ,Tel: 023 8084 2230, - ,,,No ratings yet Rate it yourself - /Services/opticians/LeaveReview/DefaultView.aspx?id=00093__000001_SO456AQ,0,0,
Dawkins and Lodge Opticians,OP_5A1_14089__000001_SO456AN,OPT,Unit 4,1-5 The Marsh,Hythe,Southampton,Hampshire,SO45 6AL,Tel: 023 8084 3798, - ,,,No ratings yet Rate it yourself - /Services/opticians/LeaveReview/DefaultView.aspx?id=OP_5A1_14089__000001_SO456AN,0,0,
Eye See Eye,OP_5A1_14098__000001_BH241DG,OPT,17-19 Christchurch Road,Friday's Cross,Ringwood,,,BH24 1DG,Tel: 01425 477922, - ,,,No ratings yet Rate it yourself - /Services/opticians/LeaveReview/DefaultView.aspx?id=OP_5A1_14098__000001_BH241DG,0,0,
Kelly Eyecare,OP_5A1_14099__000001_BH241AB,OPT,17 High Street,,Ringwood,Hampshire,,BH24 1AB,Tel: 01425 478545, - ,,,No ratings yet Rate it yourself - /Services/opticians/LeaveReview/DefaultView.aspx?id=OP_5A1_14099__000001_BH241AB,0,0,
Scrivens Opticians,OP_5A1_14100__000001_BH241AD,OPT,49 High Street,,Ringwood,Hampshire,,BH24 1AD,Tel: 01425 472534, - ,,,No ratings yet Rate it yourself - /Services/opticians/LeaveReview/DefaultView.aspx?id=OP_5A1_14100__000001_BH241AD,0,0,
Specsavers,BH24 1AT__000001_BH241AT,OPT,2 The Furlong Centre,,Ringwood,Hants,,BH24 1AT,Tel: 01425 484480, - ,,,No ratings yet Rate it yourself - /Services/opticians/LeaveReview/DefaultView.aspx?id=BH24 1AT__000001_BH241AT,0,0,
Mobile-Eyes-UK Ltd,CO-3448__000001_BH89NL,OPT,28 Feversham Heights,Feversham Avenue,Bournemouth,Dorset,,BH8 9NL,Tel: 01202 770400, - ,,,No ratings yet Rate it yourself - /Services/opticians/LeaveReview/DefaultView.aspx?id=CO-3448__000001_BH89NL,0,0,
Scrivens Ltd,OP_5CE_4954__000003_BH14BP,OPT,,652 Christchurch Road,,Boscombe,Dorset,BH1 4BP,Tel: 01202 396154, - ,,,No ratings yet Rate it yourself - /Services/opticians/LeaveReview/DefaultView.aspx?id=OP_5CE_4954__000003_BH14BP,0,0,
M&S Opticians - Castlepoint,O7K0D,OPT,,"Castlepoint Shopping Centre, Yeomans Way",,Bournemouth,Dorset,BH8 9UL,Tel: 01202 059316, - ,,,3 ratings Rate it yourself - /Services/opticians/LeaveReview/DefaultView.aspx?id=O7K0D,,,
Specsavers Opticians (Boscombe Visionplus Ltd),OP_5CE_3178__000004_BH14BP,OPT,,594-598 Christchurch Road,,BOURNEMOUTH,Dorset,BH1 4BH,Tel: 01202 303307, - ,,,3 ratings Rate it yourself - /Services/opticians/LeaveReview/DefaultView.aspx?id=OP_5CE_3178__000004_BH14BP,,,
Leightons Opticians & Hearing Care,OP_5A1_14101__000001_SO403DG,OPT,,17 Water Lane,Totton,Southampton,Hampshire,SO40 3DG,Tel: 02380 862 456, - ,,,1 rating Rate it yourself - /Services/opticians/LeaveReview/DefaultView.aspx?id=OP_5A1_14101__000001_SO403DG,,,
Asda Stores Ltd.,OP_5CE_14967__000002_BH89UP,OPT,Castlepoint Centre,Castle Lane West,,Bournemouth,,BH8 9UP,Tel: 01202 844412, - ,,,No ratings yet Rate it yourself - /Services/opticians/LeaveReview/DefaultView.aspx?id=OP_5CE_14967__000002_BH89UP,0,0,
Optique Opticians,OP_5A1_14102__000001_SO403BU,OPT,89 Junction Road,,Totton,Southampton (Totton),Hampshire,SO40 3BU,Tel: 023 8087 0002, - ,,,No ratings yet Rate it yourself - /Services/opticians/LeaveReview/DefaultView.aspx?id=OP_5A1_14102__000001_SO403BU,0,0,
Clapham Eyecare,OPT_SO403BX_1,OPT,,9 Commercial Road,,Totton,,SO40 3BX,, - ,,,No ratings yet Rate it yourself - /Services/opticians/LeaveReview/DefaultView.aspx?id=OPT_SO403BX_1,0,0,
Specsavers,SO40 3BX__000003_SO403BX,OPT,11 Commercial Road,,,Totton,,SO40 3BX,Tel: 02380 580 070, - ,,,No ratings yet Rate it yourself - /Services/opticians/LeaveReview/DefaultView.aspx?id=SO40 3BX__000003_SO403BX,0,0,
Willetts & Doig Optometrists,OP_5DG_8027__000001_PO317RY,OPT,21-22 High Street,,Cowes,Isle of Wight,Hampshire,PO31 7RY,Tel: 01983 293181, - ,,,No ratings yet Rate it yourself - /Services/opticians/LeaveReview/DefaultView.aspx?id=OP_5DG_8027__000001_PO317RY,0,0,
City Optical Ltd,SO15 1HA__000001_SO151HA,OPT,28 City Industrial Park,Southampton Road,Southampton,Hants,,SO15 1HA,Tel: 02380 631716, - ,,,No ratings yet Rate it yourself - /Services/opticians/LeaveReview/DefaultView.aspx?id=SO15 1HA__000001_SO151HA,0,0,
Costco Wholesale UK Ltd,OPT_SO158TA_1,OPT,,Regents Park Road,,Southampton,,SO15 8TA,Tel: 02380 764 825, - ,,,No ratings yet Rate it yourself - /Services/opticians/LeaveReview/DefaultView.aspx?id=OPT_SO158TA_1,0,0,
M&S Opticians - West Quay,X7E5B,OPT,,23 Harbour Parade,West Quay,Southampton,Hampshire,SO15 1QB,Tel: 02382 356769, - ,,,1 rating Rate it yourself - /Services/opticians/LeaveReview/DefaultView.aspx?id=X7E5B,,,
Vision Express,OP_5L1_14115__000001_SO151QD,OPT,Unit Su31,Upper Level,West Quay Shopping Centre,,,SO15 1QD,Tel: 023 8063 5436, - ,,,No ratings yet Rate it yourself - /Services/opticians/LeaveReview/DefaultView.aspx?id=OP_5L1_14115__000001_SO151QD,0,0,
Boots-Southampton - Above Bar (in Boots UK),OP_5L1_14106__000002_SO147DX,OPT,19-29 Above Bar Street,,,Southampton,Hampshire,SO14 7DX,Tel: 0238 033 1897, - ,,,No ratings yet Rate it yourself - /Services/opticians/LeaveReview/DefaultView.aspx?id=OP_5L1_14106__000002_SO147DX,0,0,
Specsavers,OP_5L1_14113__000002_SO143HE,OPT,,15 Above Bar,,Southampton,,SO14 7DX,Tel: 023 8063 6105, - ,,,No ratings yet Rate it yourself - /Services/opticians/LeaveReview/DefaultView.aspx?id=OP_5L1_14113__000002_SO143HE,0,0,
Vision Right (Carol Joy Underwood),01-07383__000001_SO315FB,OPT,17-18 Abbey Hill,Netley Abbey,,Southampton,,SO31 5FB,, - ,,,No ratings yet Rate it yourself - /Services/opticians/LeaveReview/DefaultView.aspx?id=01-07383__000001_SO315FB,0,0,
Boots-Southampton - Above Bar,OP_5L1_14107__000001_SO147DT,OPT,86 Above Bar Street,,,Southampton,Hampshire,SO14 7DT,Tel: 0238 022 3441, - ,,,No ratings yet Rate it yourself - /Services/opticians/LeaveReview/DefaultView.aspx?id=OP_5L1_14107__000001_SO147DT,0,0,
Asda Stores Ltd,OP_5CE_14403__000002_BH88DL,OPT,Asda Store,St. Paul's Road,,BOURNEMOUTH,Dorset,BH8 8DL,Tel: 01202 200192, - ,,,No ratings yet Rate it yourself - /Services/opticians/LeaveReview/DefaultView.aspx?id=OP_5CE_14403__000002_BH88DL,0,0,
Vectis Optical Labatories Ltd,PO30 1BG__000001_PO301BG,OPT,81a High Street,,Newport,Isle Of Wight,,PO30 1BG,Tel: 01983 525272, - ,,,No ratings yet Rate it yourself - /Services/opticians/LeaveReview/DefaultView.aspx?id=PO30 1BG__000001_PO301BG,0,0,
Specsavers,SO15 3NH__000002_SO153NH,OPT,18-20 Shirley High Street,Shirley,Southampton,Hants,,SO15 3NH,Tel: 02380 778818, - ,,,No ratings yet Rate it yourself - /Services/opticians/LeaveReview/DefaultView.aspx?id=SO15 3NH__000002_SO153NH,0,0,
Rutherford Eye Care,OP_5DG_9261__000001_PO301BA,OPT,67 High Street,,Newport,,,PO30 1BA,Tel: 01983 524629, - ,,,No ratings yet Rate it yourself - /Services/opticians/LeaveReview/DefaultView.aspx?id=OP_5DG_9261__000001_PO301BA,0,0,
Scrivens Opticians & Hearing Care,OP_5L1_14121__000001_SO153NG,OPT,40 Shirley High Street,Shirley,,Southampton (Shirley),Hampshire,SO15 3NG,Tel: 023 8077 0804, - ,,,No ratings yet Rate it yourself - /Services/opticians/LeaveReview/DefaultView.aspx?id=OP_5L1_14121__000001_SO153NG,0,0,
Specsavers,OP_5DG_13709__000001_PO301SE,OPT,107 High Street,,Newport,Isle Of Wight,,PO30 1TJ,Tel: 01983 821 280, - ,,,No ratings yet Rate it yourself - /Services/opticians/LeaveReview/DefaultView.aspx?id=OP_5DG_13709__000001_PO301SE,0,0,
Still & Bedford Ltd,OP_5CE_9449__000001_BH92SG,OPT,,922 Wimborne Road,,Bournemouth,Dorset,BH9 2DH,Tel: 01202 529414, - ,,,No ratings yet Rate it yourself - /Services/opticians/LeaveReview/DefaultView.aspx?id=OP_5CE_9449__000001_BH92SG,0,0,yes
Moordown Eyecare,OP_5CE_13760__000001_BH91BN,OPT,,922 Wimborne Road,Moordown,BOURNEMOUTH,Dorset,BH9 2DH,Tel: 01202 530500, - ,,,1 rating Rate it yourself - /Services/opticians/LeaveReview/DefaultView.aspx?id=OP_5CE_13760__000001_BH91BN,,,
Vision Express (UK) Ltd t/a Batemans Opticians,OP_5DG_5164__000002_PO301TP,OPT,120 High Street,,Newport,,,PO30 1TP,Tel: 01983 522177, - ,,,No ratings yet Rate it yourself - /Services/opticians/LeaveReview/DefaultView.aspx?id=OP_5DG_5164__000002_PO301TP,0,0,
Boots Opticians,OPT_PO301TP_1,OPT,,122-126 High Street,,Newport,,PO30 1TP,Tel: 01983 524654, - ,,,No ratings yet Rate it yourself - /Services/opticians/LeaveReview/DefaultView.aspx?id=OPT_PO301TP_1,0,0,
Ralph Neale (Opticians) Ltd,OP_5L1_14110__000001_SO152DF,OPT,73 Bedford Place,Southampton,Hampshire,,,SO15 2DF,Tel: 023 8022 1749, - ,,,No ratings yet Rate it yourself - /Services/opticians/LeaveReview/DefaultView.aspx?id=OP_5L1_14110__000001_SO152DF,0,0,
Eyeland Optical,OP_5DG_4157__000001_PO301SS,OPT,1 High Street,,Newport,,,PO30 1SS,Tel: 01983 529815, - ,,,No ratings yet Rate it yourself - /Services/opticians/LeaveReview/DefaultView.aspx?id=OP_5DG_4157__000001_PO301SS,0,0,
Specsavers Optician,01-25615,OPT,,411 Wimborne Road,,Dorset,,BH9 2AJ,Tel: 01202 635890, - ,,,No ratings yet Rate it yourself - /Services/opticians/LeaveReview/DefaultView.aspx?id=01-25615,0,0,
Scrivens Ltd,OP_5CE_1815__000001_BH92EN,OPT,,373 Wimborne Road,,Winton,Dorset,BH9 2AQ,Tel: 01202 529700, - ,,,No ratings yet Rate it yourself - /Services/opticians/LeaveReview/DefaultView.aspx?id=OP_5CE_1815__000001_BH92EN,0,0,
Kelly Eyecare Ltd,CO-2697__000002_BH92AQ,OPT,369 Wimborne Road,Winton,,BOURNEMOUTH,Dorset,BH9 2AQ,Tel: 01202 510102, - ,,,No ratings yet Rate it yourself - /Services/opticians/LeaveReview/DefaultView.aspx?id=CO-2697__000002_BH92AQ,0,0,
Boots-Bournemouth - Winton Rd,CO-3459__000001_BH92HH,OPT,,355A Wimborne Road,Winton,BOURNEMOUTH,Dorset,BH9 2AD,Tel: 01202 516924, - ,,,2 ratings Rate it yourself - /Services/opticians/LeaveReview/DefaultView.aspx?id=CO-3459__000001_BH92HH,,,
Specsavers Opticians (Bournemouth Visionplus Ltd),OP_5CE_11693__000001_BH11LR,OPT,80 Old Christchurch Road,,Bournemouth,Dorset,,BH1 1LR,Tel: 01202 316111, - ,,,11 ratings Rate it yourself - /Services/opticians/LeaveReview/DefaultView.aspx?id=OP_5CE_11693__000001_BH11LR,,,
Optical Express,OP_12345_BH2 6EZ,OPT,Richmond House,Richmond Hill,,Bournemouth,Hampshire,BH2 6EZ,Tel: 0800 023 2020, - ,,,No ratings yet Rate it yourself - /Services/opticians/LeaveReview/DefaultView.aspx?id=OP_12345_BH2 6EZ,0,0,
Parley Optometrists,OP_5FN_391__000002_BH228EB,OPT,127 New Road,West Parley,,FERNDOWN,Dorset,BH22 8EB,Tel: 01202 575759, - ,,,1 rating Rate it yourself - /Services/opticians/LeaveReview/DefaultView.aspx?id=OP_5FN_391__000002_BH228EB,,,yes
Optical Express,BH11BL_45678,OPT,,Clarendon Business Centre,,Bristol,,BH1 1BL,, - ,,,No ratings yet Rate it yourself - /Services/opticians/LeaveReview/DefaultView.aspx?id=BH11BL_45678,0,0,
Opticial Express,OP_12345_S017 1XN,OPT,36-38 The Avenue,,,Southampton,Hampshire,SO17 1XN,Tel: 0800 023 2020, - ,,,No ratings yet Rate it yourself - /Services/opticians/LeaveReview/DefaultView.aspx?id=OP_12345_S017 1XN,0,0,
Leightons Opticians & Hearing Care,OP_5L1_14320__000001_SO171XS,OPT,,Stag Gates,68 The Avenue,Southampton,Hampshire,SO17 1XS,Tel: 02380 223 185, - ,,,No ratings yet Rate it yourself - /Services/opticians/LeaveReview/DefaultView.aspx?id=OP_5L1_14320__000001_SO171XS,0,0,
Boots-Bournemouth - Commercial Rd,OP_5KV_12701__000002_BH25NL,OPT,18-20 Commercial Road,,Bournemouth,Bournemouth,Dorset,BH2 5NL,Tel: 01202 296687, - ,,,1 rating Rate it yourself - /Services/opticians/LeaveReview/DefaultView.aspx?id=OP_5KV_12701__000002_BH25NL,,,
Vision Express (UK )Ltd,OP_5KV_13763__000001_BH25LP,OPT,46 Commercial Road,,Bournemouth,,,BH2 5LP,Tel: 01202 587524, - ,,,No ratings yet Rate it yourself - /Services/opticians/LeaveReview/DefaultView.aspx?id=OP_5KV_13763__000001_BH25LP,0,0,
Onsite Eyecare Ltd,CT005__000001_BH105AS,OPT,20 Barnes Road,,Bournemouth,Dorset,,BH10 5AS,Tel: 01202 511249, - ,,,No ratings yet Rate it yourself - /Services/opticians/LeaveReview/DefaultView.aspx?id=CT005__000001_BH105AS,0,0,
Malik and Collins Limited,OP_5LX_8235__000001_SO319GQ,OPT,4 Shore Road,Warsash,Southampton,Hampshire,,SO31 9GQ,Tel: 01489 576947, - ,,,No ratings yet Rate it yourself - /Services/opticians/LeaveReview/DefaultView.aspx?id=OP_5LX_8235__000001_SO319GQ,0,0,
Henderson's,OP_5FN_13758__000001_BH229HZ,OPT,54 Victoria Road,,Ferndown,Dorset,,BH22 9HZ,Tel: 01202 871711, - ,,,No ratings yet Rate it yourself - /Services/opticians/LeaveReview/DefaultView.aspx?id=OP_5FN_13758__000001_BH229HZ,0,0,
Underwood Eyecare,OP_5FN_4238__000002_BH229TH,OPT,Underwood Eyecare,7 Pennys Walk,,Ferndown,Dorset,BH22 9TH,Tel: 01202 891955, - ,,,1 rating Rate it yourself - /Services/opticians/LeaveReview/DefaultView.aspx?id=OP_5FN_4238__000002_BH229TH,,,
Knight Eyecare,,OPT,,61 Victoria Road,,Ferndown,Dorset,BH22 9HU,Tel: 01202 891 727, - ,,,N/A - Data not available,,,
Still & Bedford,E0E1C,OPT,,61 Victoria Road,Ferndown,Bournemouth,Dorset,BH22 9HU,Tel: 01202 891727, - ,,,No ratings yet Rate it yourself - /Services/opticians/LeaveReview/DefaultView.aspx?id=E0E1C,0,0,
K C Opticians ,OP_BH107AZ_85049,OPT,,1553 Wimborne Road,Kinson,BOURNEMOUTH,Dorset,BH10 7AZ,Tel: 01202 571601, - ,,,No ratings yet Rate it yourself - /Services/opticians/LeaveReview/DefaultView.aspx?id=OP_BH107AZ_85049,0,0,
Ashleigh Sight Care,OP_5L1_14117__000002_SO172NG,OPT,255 Portswood Road,Portswood,,Southampton,,SO17 2NG,Tel: 023 8055 0431, - ,,,No ratings yet Rate it yourself - /Services/opticians/LeaveReview/DefaultView.aspx?id=OP_5L1_14117__000002_SO172NG,0,0,yes
EyeStyle Centre Opticians Ltd,TP7HJ,OPT,,141-143 Station Road,,Dorset,,BH22 0HT,, - ,,,No ratings yet Rate it yourself - /Services/opticians/LeaveReview/DefaultView.aspx?id=TP7HJ,0,0,
Boots-Southampton - Bitterne Rd,OP_5L1_14104__000002_SO185RR,OPT,391 Bitterne Road,,,Southampton,Hampshire,SO18 5RR,Tel: 0238 044 8443, - ,,,No ratings yet Rate it yourself - /Services/opticians/LeaveReview/DefaultView.aspx?id=OP_5L1_14104__000002_SO185RR,0,0,
Scrivens Ltd,OP_5KV_11124__000002_BH49BB,OPT,,89 Poole Road,,Westbourne,Dorset,BH4 9BB,Tel: 01202 764545, - ,,,No ratings yet Rate it yourself - /Services/opticians/LeaveReview/DefaultView.aspx?id=OP_5KV_11124__000002_BH49BB,0,0,
Scrivens Opticians,OP_5L1_14105__000003_SO185RR,OPT,417a Bitterne Road,Bitterne,,Southhampton,Hampshire,SO18 5EE,Tel: 023 8042 0513, - ,,,No ratings yet Rate it yourself - /Services/opticians/LeaveReview/DefaultView.aspx?id=OP_5L1_14105__000003_SO185RR,0,0,
R T Knight EyecareLtd,OP_5KV_5765__000001_BH49EF,OPT,118 Poole Road,118 Poole Road,Bournemouth,Bournemouth,,BH4 9EF,Tel: 01202 764439, - ,,,No ratings yet Rate it yourself - /Services/opticians/LeaveReview/DefaultView.aspx?id=OP_5KV_5765__000001_BH49EF,0,0,
Boots-Bournemouth - Wallisdown Rd,OP_5CE_13054__000001_BH118PN,OPT,288a Wallisdown Road,Wallisdown,,Bournemouth,Dorset,BH11 8PN,Tel: 01202 515024, - ,,,2 ratings Rate it yourself - /Services/opticians/LeaveReview/DefaultView.aspx?id=OP_5CE_13054__000001_BH118PN,,,
Spesavers - Sainsburys,,OPT,,Alder Park,4 Alder Road,Poole,Dorset,BH12 4BA,Tel: 01202403273, - ,,,N/A - Data not available,,,
Tesco Opticians,SO31 8GN__000002_SO318GN,OPT,Hamble Lane,Bursledon,,Southampton,,SO31 8GN,Tel: 0345 6013479, - ,,,No ratings yet Rate it yourself - /Services/opticians/LeaveReview/DefaultView.aspx?id=SO31 8GN__000002_SO318GN,0,0,
A.J Bass BSc FCOptom,OP_5A1_14086__000001_SP61AX,OPT,36 High Street,,Fordingbridge,Hampshire,,SP6 1AX,Tel: 01425 652663, - ,,,2 ratings Rate it yourself - /Services/opticians/LeaveReview/DefaultView.aspx?id=OP_5A1_14086__000001_SP61AX,,,
EyeStyle Centre Opticians Ltd,OP_5LX_4785__000001_SO316DX,OPT,16 Locks Heath Centre,Locks Heath,,Southampton,Hampshire,SO31 6DX,Tel: 01489 589760, - ,,,No ratings yet Rate it yourself - /Services/opticians/LeaveReview/DefaultView.aspx?id=OP_5LX_4785__000001_SO316DX,0,0,
Specsavers Home Visits,00025__000001_BH217SH,OPT,Unit 4a Arena Business Centre,9 Nimrod Way,Ferndown,Dorset,,BH21 7SH,Tel: 01202 862385, - ,,,9 ratings Rate it yourself - /Services/opticians/LeaveReview/DefaultView.aspx?id=00025__000001_BH217SH,,,
Peacock & Murphy,OP_5FN_5847__000001_BH216DR,OPT,27b Vicarage Road,,Verwood,Dorset,,BH31 6DR,Tel: 01202 825448, - ,,,No ratings yet Rate it yourself - /Services/opticians/LeaveReview/DefaultView.aspx?id=OP_5FN_5847__000001_BH216DR,0,0,
20/20 Vision (Super Optical) Ltd,OP_5LX_14829__000001_SO317GE,OPT,20 Bridge Road,,Park Gate,Hampshire,,SO31 7GE,Tel: 01489 573300, - ,,,No ratings yet Rate it yourself - /Services/opticians/LeaveReview/DefaultView.aspx?id=OP_5LX_14829__000001_SO317GE,0,0,
Rex Wingate & Partners,OP_5LX_732__000001_SO311BB,OPT,60-62 Botley Road,,Park Gate,Hampshire,,SO31 1BB,Tel: 01489 584169, - ,,,No ratings yet Rate it yourself - /Services/opticians/LeaveReview/DefaultView.aspx?id=OP_5LX_732__000001_SO311BB,0,0,
Wingate Rex & Partners,SO3 7BB__000001_SO37BB,OPT,60 Botley Road,Park Gate,Portsmouth,Hants,,SO3 7BB,Tel: 01489 584169, - ,,,No ratings yet Rate it yourself - /Services/opticians/LeaveReview/DefaultView.aspx?id=SO3 7BB__000001_SO37BB,0,0,
Kelly Eyecare (Parkstone) Limited,OP_5A1_14103__000002_SO403BX,OPT,9 Commercial Road,279 Ashley Road,Totton,Parkstone,,BH14 9DS,Tel: 023 8086 5493, - ,,,1 rating Rate it yourself - /Services/opticians/LeaveReview/DefaultView.aspx?id=OP_5A1_14103__000002_SO403BX,,,
Trew Eyecare Limited,OP_5KV_3373__000001_BH149DS,OPT,255 Ashley Road,Parkstone,Poole,Poole,Dorset,BH14 9DS,Tel: 01202 742003, - ,,,No ratings yet Rate it yourself - /Services/opticians/LeaveReview/DefaultView.aspx?id=OP_5KV_3373__000001_BH149DS,0,0,