Organisation Name,NACS Code,Organisation Type,Address1,Address2,Address3,Address4,Address5,PostCode,Telephone Number,Opening time,Value  (Opening time),Banding Classification  (Opening time),NHS.UK users rating,Value  (NHS.UK users rating),Banding Classification  (NHS.UK users rating),Car parking (Is there car parking at this organisation?)
Taylor Biddle Opticians Wombourne,CO-3769,OPT,,34 Windmill Bank,,WOMBOURNE,,WV5 9JD,, - ,,,No ratings yet Rate it yourself - /Services/opticians/LeaveReview/DefaultView.aspx?id=CO-3769,0,0,
Perrigo Opticians,OP_5MN_4235__000001_WV59JB,OPT,"The Willows, Maypole Street",Wombourne,Wolverhampton,,,WV5 9JB,Tel: 01902 893732, - ,,,1 rating Rate it yourself - /Services/opticians/LeaveReview/DefaultView.aspx?id=OP_5MN_4235__000001_WV59JB,,,
NVision Eyecare,01-21451 - 1,OPT,,84 Windmill Lane,Castle Croft,Wolverhampton,,WV3 8HG,Tel: 01902 380 000, - ,,,1 rating Rate it yourself - /Services/opticians/LeaveReview/DefaultView.aspx?id=01-21451 - 1,,,
Perton Eye Centre,OP_5MN_13221__000002_WV67QH,OPT,"Unit 4, anders Square",Unit 4,Wolverhampton,Perton,,WV6 7QH,Tel: 01902 759666, - ,,,No ratings yet Rate it yourself - /Services/opticians/LeaveReview/DefaultView.aspx?id=OP_5MN_13221__000002_WV67QH,0,0,
Vivid Optical Ltd,06266214,OPT,,Faraday Drive,,"Bridgnorth, Shropshire",,WV15 5BA,, - ,,,1 rating Rate it yourself - /Services/opticians/LeaveReview/DefaultView.aspx?id=06266214,,,
Taylor Biddle Opticians,OP_5MV_1765__000002_WV68AF,OPT,39 Bridgnorth Road,Compton,,Wolverhampton,,WV6 8AF,Tel: 01902 750325, - ,,,18 ratings Rate it yourself - /Services/opticians/LeaveReview/DefaultView.aspx?id=OP_5MV_1765__000002_WV68AF,,,
Special Look's Opticians,00292__000002_DY60JJ,OPT,52 Enville Road,,Wall Heath,West Midlands,,DY6 0JT,Tel: 01384 294617, - ,,,No ratings yet Rate it yourself - /Services/opticians/LeaveReview/DefaultView.aspx?id=00292__000002_DY60JJ,0,0,
Miracle Eyes Ltd,OP_5MV_635__000002_WV45QF,OPT,317a Penn Road,Penn,,Wolverhampton,,WV4 5QF,Tel: 01902 621111, - ,,,No ratings yet Rate it yourself - /Services/opticians/LeaveReview/DefaultView.aspx?id=OP_5MV_635__000002_WV45QF,0,0,
Evenett & Bishop Opticians,OP_5M2_10687__000002_WV73JA,OPT,67 High Street,Albrighton,Wolverhampton,,,WV7 3JP,Tel: 01902 372141, - ,,,No ratings yet Rate it yourself - /Services/opticians/LeaveReview/DefaultView.aspx?id=OP_5M2_10687__000002_WV73JA,0,0,
Biddle + Liage Opticians,OP_5M2_790__000001_WV164QN,OPT,,59 High Street,,Bridgnorth,Shropshire,WV16 4DX,Tel: 01746 762895, - ,,,No ratings yet Rate it yourself - /Services/opticians/LeaveReview/DefaultView.aspx?id=OP_5M2_790__000001_WV164QN,0,0,
Trevor Phillips Opticians,OP_5M2_4743__000001_WV164EG,OPT,8 Waterloo Terrace,,Bridgnorth,Shropshire,,WV16 4EG,Tel: 01746 766227, - ,,,No ratings yet Rate it yourself - /Services/opticians/LeaveReview/DefaultView.aspx?id=OP_5M2_4743__000001_WV164EG,0,0,
Bridgnorth Specsavers,OP5M2_3320__000001_WV164DX,OPT,60 High Street,,Bridgnorth,Shropshire,,WV16 4DB,Tel: 01746 713950, - ,,,2 ratings Rate it yourself - /Services/opticians/LeaveReview/DefaultView.aspx?id=OP5M2_3320__000001_WV164DX,,,
Albrighton Eye Clinic,P6X7L,OPT,,"2 Station Road, Albrighton",,Wolverhampton,,WV7 3QG,Tel: 01902 374727, - ,,,1 rating Rate it yourself - /Services/opticians/LeaveReview/DefaultView.aspx?id=P6X7L,,,
Evenett Opticians Ltd,OP_5M2_8312__000001_WV164AW,OPT,3 Listley Street,,Bridgnorth,Shropshire,,WV16 4AW,Tel: 01746 763330, - ,,,No ratings yet Rate it yourself - /Services/opticians/LeaveReview/DefaultView.aspx?id=OP_5M2_8312__000001_WV164AW,0,0,
H. Wyn  Williams Optometrist,OP_5MV_4776__000002_WV37HT,OPT,6 Trysull Road,Bradmore,,Wolverhampton,West Midlands,WV3 7HT,Tel: 01902 620352, - ,,,1 rating Rate it yourself - /Services/opticians/LeaveReview/DefaultView.aspx?id=OP_5MV_4776__000002_WV37HT,,,yes
Samantha Hague Optometry,OP_5MV_596__000001_WV28QT,OPT,10 High Street,Tettenhall,,Wolverhampton,West Midlands,WV6 8QT,Tel: 01902757454, - ,,,10 ratings Rate it yourself - /Services/opticians/LeaveReview/DefaultView.aspx?id=OP_5MV_596__000001_WV28QT,,,no
Penn Eyecare,OP_5MV_512__000001_WV44AD,OPT,Penn Eyecare,252 Penn Road,Penn,Wolverhampton,West Midlands,WV4 4AD,Tel: 01902 342999, - ,,,No ratings yet Rate it yourself - /Services/opticians/LeaveReview/DefaultView.aspx?id=OP_5MV_512__000001_WV44AD,0,0,yes
R A Lawley Ltd,OP_5HT_3004__000001_DY69JA,OPT,3-3a The Cross,Summer Hill,Kingswinford,,,DY6 9JA,Tel: 01384 271 888, - ,,,No ratings yet Rate it yourself - /Services/opticians/LeaveReview/DefaultView.aspx?id=OP_5HT_3004__000001_DY69JA,0,0,
The Eyecare Centre Ltd,OP_5HT_14936__000001_DY68AA,OPT,796 High Street,Kingswinford,West Midlands,,,DY6 8AA,Tel: 01384 292505, - ,,,No ratings yet Rate it yourself - /Services/opticians/LeaveReview/DefaultView.aspx?id=OP_5HT_14936__000001_DY68AA,0,0,
Krystal Vision,OP_5HT_14937__000001_DY69JU,OPT,34 Market Street,Kingswinford,West Midlands,,,DY6 9JU,Tel: 01384 271971, - ,,,No ratings yet Rate it yourself - /Services/opticians/LeaveReview/DefaultView.aspx?id=OP_5HT_14937__000001_DY69JU,0,0,
Pinder & Moore Optometrists,OP_5HT_448__000001_DY69LE,OPT,58 Market Street,Mill House,Kingswinford,West Midlands,,DY6 9LE,Tel: 01384 274426, - ,,,No ratings yet Rate it yourself - /Services/opticians/LeaveReview/DefaultView.aspx?id=OP_5HT_448__000001_DY69LE,0,0,
4 Sight Eyecare Centre,OP_5MN_13987__000002_WV81PE,OPT,88 Wolverhampton Road,Birches Bridge,Codsall,,,WV8 1PE,Tel: 01902 844201, - ,,,No ratings yet Rate it yourself - /Services/opticians/LeaveReview/DefaultView.aspx?id=OP_5MN_13987__000002_WV81PE,0,0,
Flint & Partners,OP_5MN_7633__000001_WV81PT,OPT,15 The Square,Wolverhampton Road,,Codsall,,WV8 1PT,Tel: 01902 846745, - ,,,No ratings yet Rate it yourself - /Services/opticians/LeaveReview/DefaultView.aspx?id=OP_5MN_7633__000001_WV81PT,0,0,
Flint & Partners,OP_5MV_7631__000001_WV39NB,OPT,59 Tettenhall Road,,,Wolverhampton,,WV3 9NB,Tel: 01902 422096, - ,,,No ratings yet Rate it yourself - /Services/opticians/LeaveReview/DefaultView.aspx?id=OP_5MV_7631__000001_WV39NB,0,0,
Budgetspex Ltd,5M2149__000003_DY90NW,OPT,8 Baird House Second Avenue,Pensett Trading Estate,Kingswinford,West Midlands,,DY6 7YA,Tel: 0871 2503601, - ,,,No ratings yet Rate it yourself - /Services/opticians/LeaveReview/DefaultView.aspx?id=5M2149__000003_DY90NW,0,0,
NVision Eyecare,OP_WV60QW_29780,OPT,,The Avion Centre,4 Bargate Drive,Wolverhampton,,WV6 0QW,Tel: 01902 779077, - ,,,2 ratings Rate it yourself - /Services/opticians/LeaveReview/DefaultView.aspx?id=OP_WV60QW_29780,,,
Harris Opticians,OP_5MV_ 751__000001_WV14LF,OPT,44 School Street,Off Darlington Street,,Wolverhampton,,WV1 4LF,Tel: 01902 421820, - ,,,No ratings yet Rate it yourself - /Services/opticians/LeaveReview/DefaultView.aspx?id=OP_5MV_ 751__000001_WV14LF,0,0,
Beacon Opticians Plus +,CO-5239,OPT,Beacon Centre,Wolverhampton Road East,,Wolverhampton,West Midlands,WV4 6AZ,Tel: 01902 886794, - ,,,No ratings yet Rate it yourself - /Services/opticians/LeaveReview/DefaultView.aspx?id=CO-5239,0,0,
The Eyecare Centre Ltd,OP_5HV_13510__000001_DY32UB,OPT,42 Louise Street,Gornal Wood,Dudley,West Midlands,,DY3 2UB,Tel: 01384 256 248, - ,,,No ratings yet Rate it yourself - /Services/opticians/LeaveReview/DefaultView.aspx?id=OP_5HV_13510__000001_DY32UB,0,0,
Khalil Opticians Ltd,OP_5MV_493__000002_WV13NP,OPT,22 Victoria Street,Wolverhampton,,West Midlands,,WV1 3NP,Tel: 01902 771267, - ,,,No ratings yet Rate it yourself - /Services/opticians/LeaveReview/DefaultView.aspx?id=OP_5MV_493__000002_WV13NP,0,0,
Ideal Eyes Optical Ltd,OP_5MV_813__000003_WV13NP,OPT,2 Victoria Street,,,Wolverhampton,,WV1 3NP,Tel: 01902 423030, - ,,,No ratings yet Rate it yourself - /Services/opticians/LeaveReview/DefaultView.aspx?id=OP_5MV_813__000003_WV13NP,0,0,
Specs Direct,OP_5HV_1048__000001_DY31RU,OPT,"3, The Bull Ring",Sedgley,Dudley,,,DY3 1RU,Tel: 01902 676410, - ,,,No ratings yet Rate it yourself - /Services/opticians/LeaveReview/DefaultView.aspx?id=OP_5HV_1048__000001_DY31RU,0,0,
R T Knight Opticians,OP_5HV_8488__000002_DY31SB,OPT,8 Dudley Street,Sedgley,Dudley,,,DY3 1SB,Tel: 01902 883 260, - ,,,2 ratings Rate it yourself - /Services/opticians/LeaveReview/DefaultView.aspx?id=OP_5HV_8488__000002_DY31SB,,,
Vision Express (UK) Ltd,OP_5MV_11313__000001_WV13NJ,OPT,11-12 The Gallery,Mander Centre,,Wolverhampton,,WV1 3NJ,Tel: 01902 716999, - ,,,No ratings yet Rate it yourself - /Services/opticians/LeaveReview/DefaultView.aspx?id=OP_5MV_11313__000001_WV13NJ,0,0,
Marshoptical,OP_5MV_691__000002_WV13HH,OPT,Cleveland Street,,Wolverhampton,,,WV1 3HH,Tel: 01902 420919, - ,,,No ratings yet Rate it yourself - /Services/opticians/LeaveReview/DefaultView.aspx?id=OP_5MV_691__000002_WV13HH,0,0,
Specsavers Opticians,OP_5MV_13061__000001_WV13HG,OPT,58-59 Wulfrun Centre,,,Wolverhampton,,WV1 3HG,Tel: 01902 715 844, - ,,,No ratings yet Rate it yourself - /Services/opticians/LeaveReview/DefaultView.aspx?id=OP_5MV_13061__000001_WV13HG,0,0,
Boots-Wolverhampton - Mander Centre (in Boots UK),OP_5MV_9292__000001_WV13NN,OPT,"Unit 221, 30-34 The Gallery",Mander Centre,,Wolverhampton,West Midlands,WV1 3NN,Tel: 01902 711755, - ,,,No ratings yet Rate it yourself - /Services/opticians/LeaveReview/DefaultView.aspx?id=OP_5MV_9292__000001_WV13NN,0,0,
4 Sight Eye Care Centres Ltd,OP_5MV_249__000001_WV13ET,OPT,14-16 Central Arcade,,,Wolverhampton,,WV1 3ET,Tel: 01902 714559, - ,,,No ratings yet Rate it yourself - /Services/opticians/LeaveReview/DefaultView.aspx?id=OP_5MV_249__000001_WV13ET,0,0,yes
Scrivens Ltd,OP_5MV_3780__000001_WV13NP,OPT,16 Dudley St,,,Wolverhampton,,WV1 3EY,Tel: 01902 424775, - ,,,No ratings yet Rate it yourself - /Services/opticians/LeaveReview/DefaultView.aspx?id=OP_5MV_3780__000001_WV13NP,0,0,
Lichfield Street Opticians,OP_5MV_793__000003_WV11DG,OPT,44 Lichfield Street,,Wolverhampton,West Midlands,,WV1 1DG,Tel: 01902 420348, - ,,,No ratings yet Rate it yourself - /Services/opticians/LeaveReview/DefaultView.aspx?id=OP_5MV_793__000003_WV11DG,0,0,
John Hamer Opticians,OP_5HT_3163__000002_DY85PD,OPT,11 Wordsley Green Shopping Centre,Wordsley Green,Stourbridge,,,DY8 5PD,Tel: 01384 401 201, - ,,,No ratings yet Rate it yourself - /Services/opticians/LeaveReview/DefaultView.aspx?id=OP_5HT_3163__000002_DY85PD,0,0,
R K Flatters,OP_5MV_1492__000001_WV13JW,OPT,35 Queen Street,,,Wolverhampton,,WV1 3JW,Tel: 01902 423359, - ,,,No ratings yet Rate it yourself - /Services/opticians/LeaveReview/DefaultView.aspx?id=OP_5MV_1492__000001_WV13JW,0,0,
Taylor Made Specs,OP_DY32DA_34272,OPT,,"6 The Arcade, Kent Street",,Upper Gornal,,DY3 2DA,Tel: 01902 664783, - ,,,1 rating Rate it yourself - /Services/opticians/LeaveReview/DefaultView.aspx?id=OP_DY32DA_34272,,,
Kinver Opticians,OP_5MN_1681__000001_DY76HE,OPT,51a High Street,Kinver,,Stourbridge,,DY7 6HE,Tel: 01384 872035, - ,,,No ratings yet Rate it yourself - /Services/opticians/LeaveReview/DefaultView.aspx?id=OP_5MN_1681__000001_DY76HE,0,0,
Miracle Eyes Ltd,OP_5MV_853__000001_WV106RT,OPT,Unit 4 Marsh Lane Parade,"Three Tuns, Fordhouses",,Wolverhampton,,WV10 6RT,Tel: 01902 789900, - ,,,No ratings yet Rate it yourself - /Services/opticians/LeaveReview/DefaultView.aspx?id=OP_5MV_853__000001_WV106RT,0,0,
Scrivens Ltd,OP_5MV_585__000001_WV106BA,OPT,5 Three Tuns Parade,Stafford Road,,Fordhouses,West Midlands,WV10 6BA,Tel: 01902 782280, - ,,,No ratings yet Rate it yourself - /Services/opticians/LeaveReview/DefaultView.aspx?id=OP_5MV_585__000001_WV106BA,0,0,
Focus Eye Clinic,OP_WV100QB_34100,OPT,Unit 6 Crossways Shopping Centre,Wolverhampton Road,Heath Town,Wolverhampton,West Midlands,WV10 0QB,Tel: 01902 546820, - ,,,No ratings yet Rate it yourself - /Services/opticians/LeaveReview/DefaultView.aspx?id=OP_WV100QB_34100,0,0,
J & S Bangay,OP_5HT_3598__000001_DY83QG,OPT,60 Bridgnorth Road,Wollaston,,Stourbridge,West Midlands,DY8 3QG,Tel: 01384 396585, - ,,,1 rating Rate it yourself - /Services/opticians/LeaveReview/DefaultView.aspx?id=OP_5HT_3598__000001_DY83QG,,,yes
Miracle Eyes,OP_WV109BA_29921,OPT,,5 Showell Circus,,Wolverhampton,,WV10 9BA,, - ,,,No ratings yet Rate it yourself - /Services/opticians/LeaveReview/DefaultView.aspx?id=OP_WV109BA_29921,0,0,
Bushbury Eyecare,,OPT,,339a Bushbury Lane,,Wolverhampton,,WV10 9UL,, - ,,,N/A - Data not available,,,
4 Sight Eye Care Centres Ltd,OP_5MV_886__000002_WV109QY,OPT,1 Raynor Road,Fallings Park,,Wolverhampton,,WV10 9QY,Tel: 01902 723449, - ,,,No ratings yet Rate it yourself - /Services/opticians/LeaveReview/DefaultView.aspx?id=OP_5MV_886__000002_WV109QY,0,0,
Tim Vanes Dispensing Optician,OP_5MK_4742__000002_TF42EX,OPT,5a Park Street,Shifnal,,Shropshire,,TF11 9BA,Tel: 01952 461387, - ,,,No ratings yet Rate it yourself - /Services/opticians/LeaveReview/DefaultView.aspx?id=OP_5MK_4742__000002_TF42EX,0,0,
Pickford Opticians,OP_5HT_12084__000001_DY53BU,OPT,177 High Street,,Brierley Hill,,,DY5 3BU,Tel: 01384 77326, - ,,,4 ratings Rate it yourself - /Services/opticians/LeaveReview/DefaultView.aspx?id=OP_5HT_12084__000001_DY53BU,,,
J S Edmunds,OP_5HT_7829__000001_DY53AU,OPT,101 High Street,,Brierley Hill,,,DY5 3AU,Tel: 01384 77025, - ,,,No ratings yet Rate it yourself - /Services/opticians/LeaveReview/DefaultView.aspx?id=OP_5HT_7829__000001_DY53AU,0,0,
John Biddle Opticians,OP_5MK_12496__000001_TF75AS,OPT,39 High Street,Madeley,,Telford,Shropshire,TF7 5AS,Tel: 01952 586267, - ,,,No ratings yet Rate it yourself - /Services/opticians/LeaveReview/DefaultView.aspx?id=OP_5MK_12496__000001_TF75AS,0,0,
P W Optics Ltd,TP8NN,OPT,,Unit 2 Market Street,,Stourbridge,West Midlands,DY8 1YD,Tel: 01384 936020, - ,,,No ratings yet Rate it yourself - /Services/opticians/LeaveReview/DefaultView.aspx?id=TP8NN,0,0,yes
Overton Eyecare,OP_5MV_9203__000001_WV108PN,OPT,743-745 Cannock Road,The Scotlands,,Wolverhampton,,WV10 8PN,Tel: 01902 731158, - ,,,1 rating Rate it yourself - /Services/opticians/LeaveReview/DefaultView.aspx?id=OP_5MV_9203__000001_WV108PN,,,
Boots-Brierley Hill - Merry Hill Centre (next to Boots UK),OP_5HT_2764__000001_DY51QX,OPT,Unit 66,Merry Hill Centre,,Brierley Hill,West Midlands,DY5 1QX,Tel: 01384 74817, - ,,,1 rating Rate it yourself - /Services/opticians/LeaveReview/DefaultView.aspx?id=OP_5HT_2764__000001_DY51QX,,,
Boots Opticians and Hearing Care,OP_5HT_242__000002_DY51SY,OPT,The Merry Hill Centre,Brierley Hill,Dudley,West Midlands,,DY5 1QT,Tel: 01384 74817, - ,,,13 ratings Rate it yourself - /Services/opticians/LeaveReview/DefaultView.aspx?id=OP_5HT_242__000002_DY51SY,,,
Optical Express,OP_5HT_1213__000001_DY51SS,OPT,U83,Upper Mall,Merry Hill Shopping Centre,Brierley Hill,West Midlands,DY5 1SS,Tel: 0800 023 2020, - ,,,3 ratings Rate it yourself - /Services/opticians/LeaveReview/DefaultView.aspx?id=OP_5HT_1213__000001_DY51SS,,,
Eyewise Opticians,OP_5HT_4692__000001_DY81YD,OPT,,7 Market Street,Stourbridge,West Midlands,,DY8 1AB,Tel: 01384 395333, - ,,,12 ratings Rate it yourself - /Services/opticians/LeaveReview/DefaultView.aspx?id=OP_5HT_4692__000001_DY81YD,,,
Scrivens Ltd,OP_WV140DR_29783,OPT,,9 Market Way,,Bilston,,WV14 0DR,Tel: 01902 496471, - ,,,No ratings yet Rate it yourself - /Services/opticians/LeaveReview/DefaultView.aspx?id=OP_WV140DR_29783,0,0,
Eye Openers,OP_WV140AX_29781,OPT,,63 Church Street,,Bilston,,WV14 0AX,Tel: 01902 492020, - ,,,No ratings yet Rate it yourself - /Services/opticians/LeaveReview/DefaultView.aspx?id=OP_WV140AX_29781,0,0,
Jacksons Opticians,OP_WV140AX_29782,OPT,,"53a Church Street,",,Bilston,,WV14 0AX,Tel: 01902 491358, - ,,,No ratings yet Rate it yourself - /Services/opticians/LeaveReview/DefaultView.aspx?id=OP_WV140AX_29782,0,0,
Specsavers Opticians,OP_WV140AX_29785,OPT,,84 Church Street,,Bilston,,WV14 0AX,Tel: 01902 407940, - ,,,No ratings yet Rate it yourself - /Services/opticians/LeaveReview/DefaultView.aspx?id=OP_WV140AX_29785,0,0,
Special Look's Opticians,00299__000002_DY98LP,OPT,84a Pedmore Road,Lye,Stourbridge,West Midlands,,DY9 8LP,Tel: 01384 340 101, - ,,,No ratings yet Rate it yourself - /Services/opticians/LeaveReview/DefaultView.aspx?id=00299__000002_DY98LP,0,0,
Boots-Stourbridge,OP_5HT_6791__000001_DY81DT,OPT,119 High Street,,,Stourbridge,West Midlands,DY8 1DT,Tel: 01384 440 594, - ,,,No ratings yet Rate it yourself - /Services/opticians/LeaveReview/DefaultView.aspx?id=OP_5HT_6791__000001_DY81DT,0,0,
VisionCare Direct Opticians,OP_WV140DZ_29770,OPT,,W M Morrison Supermarkets PLC,Black Country Route,"Bilston, Wolverhampton",West Midlands,WV14 0DZ,Tel: 01902 493322, - ,,,1 rating Rate it yourself - /Services/opticians/LeaveReview/DefaultView.aspx?id=OP_WV140DZ_29770,,,yes
Eye Health Clinic,01-23489,OPT,,168 High Street (corner of stafford street),,Dudley,,DY1 1QD,Tel: 01384 936438, - ,,,4 ratings Rate it yourself - /Services/opticians/LeaveReview/DefaultView.aspx?id=01-23489,,,yes
Specsavers Opticians,OP_5HT_7393__000001_DY81DX,OPT,71 High Street,,Stourbridge,,,DY8 1DX,Tel: 01384 440464, - ,,,No ratings yet Rate it yourself - /Services/opticians/LeaveReview/DefaultView.aspx?id=OP_5HT_7393__000001_DY81DX,0,0,
Bonham & Butler Opticians ,OP_5HV_13508__000001_DY11ED,OPT,216 Wolverhampton Street,,Dudley,West Midlands,,DY1 1ED,Tel: 01384 253696, - ,,,No ratings yet Rate it yourself - /Services/opticians/LeaveReview/DefaultView.aspx?id=OP_5HV_13508__000001_DY11ED,0,0,
Vision Express (UK) Ltd,OP_5HT_290__000003_DY51SY,OPT,Units U44-U45,The Merry Hill Centre,Brierley Hill,West Midlands,,DY5 1SY,Tel: 01384 481 616, - ,,,No ratings yet Rate it yourself - /Services/opticians/LeaveReview/DefaultView.aspx?id=OP_5HT_290__000003_DY51SY,0,0,
Docker & Wilson Ltd,OP_5HT_3049__000001_DY81ED,OPT,84 High Street,,Stourbridge,,,DY8 1ED,Tel: 01384 394300, - ,,,No ratings yet Rate it yourself - /Services/opticians/LeaveReview/DefaultView.aspx?id=OP_5HT_3049__000001_DY81ED,0,0,
Dollond & Aitchison,OP_5HV_3000__000002_DY11PD,OPT,219 High Street,Dudley,West Midlands,,,DY1 1PD,Tel: 01384 253859, - ,,,No ratings yet Rate it yourself - /Services/opticians/LeaveReview/DefaultView.aspx?id=OP_5HV_3000__000002_DY11PD,0,0,
A.J. Moore,OP_5HV_13509__000001_DY11LQ,OPT,"264, Castle Street",,Dudley,West Midlands,,DY1 1LQ,Tel: 01384 252903, - ,,,1 rating Rate it yourself - /Services/opticians/LeaveReview/DefaultView.aspx?id=OP_5HV_13509__000001_DY11LQ,,,
Flint & Partners,OP_5MV_2445__000001_WV111SR,OPT,11 Church Street,Wednesfield,,Wolverhampton,,WV11 1SR,Tel: 01902 719 850, - ,,,2 ratings Rate it yourself - /Services/opticians/LeaveReview/DefaultView.aspx?id=OP_5MV_2445__000001_WV111SR,,,
Specsavers Opticians,OP_5HV_8264__000001_DY11LF,OPT,13 Castle Street,,Dudley,,,DY1 1LF,Tel: 01384 214 851, - ,,,No ratings yet Rate it yourself - /Services/opticians/LeaveReview/DefaultView.aspx?id=OP_5HV_8264__000001_DY11LF,0,0,
4 Sight,OP_5HV_5402__000001_DY27BL,OPT,15 Churchill Shopping Centre,,Dudley,,,DY2 7BL,Tel: 01384 242444, - ,,,No ratings yet Rate it yourself - /Services/opticians/LeaveReview/DefaultView.aspx?id=OP_5HV_5402__000001_DY27BL,0,0,
C M Biddle & Co Ltd,OP_5MV_3311__000004_WV111SZ,OPT,20 High Street,Wednesfield,,Wolverhampton,,WV11 1SZ,Tel: 01902 729028, - ,,,No ratings yet Rate it yourself - /Services/opticians/LeaveReview/DefaultView.aspx?id=OP_5MV_3311__000004_WV111SZ,0,0,
Eye Deal Opticians,OP_5MH_13686__000001_DY48LY,OPT,Neptune Health Park,Sedgley Road West,,Tipton,West Midlands,DY4 8LY,Tel: 0121 612 1919, - ,,,1 rating Rate it yourself - /Services/opticians/LeaveReview/DefaultView.aspx?id=OP_5MH_13686__000001_DY48LY,,,
Portland Eye Care Services Ltd,OP_5MV_ 795__000001_WV111TW,OPT,45 Lichfield Road,Wednesfield,,Wolverhampton,,WV11 1TW,Tel: 01902 723898, - ,,,No ratings yet Rate it yourself - /Services/opticians/LeaveReview/DefaultView.aspx?id=OP_5MV_ 795__000001_WV111TW,0,0,
Julian Hill Opticians,OP_5HT_4772__000002_DY81QU,OPT,108 Hagley Road,Oldswinford,Stourbridge,,,DY8 1QU,Tel: 01384 374 232, - ,,,1 rating Rate it yourself - /Services/opticians/LeaveReview/DefaultView.aspx?id=OP_5HT_4772__000002_DY81QU,,,
DUDLEY WOOD OPTICIANS,OPT_DY20BH_1,OPT,,2 Bush Road,,Dudley,,DY2 0BH,Tel: 01384 412 600, - ,,,3 ratings Rate it yourself - /Services/opticians/LeaveReview/DefaultView.aspx?id=OPT_DY20BH_1,,,
David Wright Opticians,OP_5HV_3943__000001_DY29PS,OPT,88 Halesowen Road,Netherton,Dudley,West Midlands,,DY2 9PS,Tel: 01384 238084, - ,,,2 ratings Rate it yourself - /Services/opticians/LeaveReview/DefaultView.aspx?id=OP_5HV_3943__000001_DY29PS,,,
Flint & Partners,OP_5MN_6856__000001_ST199ES,OPT,The Surgery,Sandy Lane,Brewood,,,ST19 9ES,Tel: 0844 4770924, - ,,,No ratings yet Rate it yourself - /Services/opticians/LeaveReview/DefaultView.aspx?id=OP_5MN_6856__000001_ST199ES,0,0,
Robert Hill Opticians,OP_5HT_8972__000001_DY98LB,OPT,39 High Street,Lye,,Stourbridge,West Midlands,DY9 8LF,Tel: 01384 422270, - ,,,3 ratings Rate it yourself - /Services/opticians/LeaveReview/DefaultView.aspx?id=OP_5HT_8972__000001_DY98LB,,,
Sanjeev Singh Sanghera,5MX083,OPT,,39 High Street,Lye,Stourbridge,,DY9 8LF,Tel: 01384 422270, - ,,,No ratings yet Rate it yourself - /Services/opticians/LeaveReview/DefaultView.aspx?id=5MX083,0,0,
Eye Deal Opticians,OP_5MH_8755__000001_DY49JA,OPT,Glebefields Health Centre,St Marks Road,,Tipton,West Midlands,DY4 0UB,Tel: 0121 557 1465, - ,,,No ratings yet Rate it yourself - /Services/opticians/LeaveReview/DefaultView.aspx?id=OP_5MH_8755__000001_DY49JA,0,0,
Vision Care Direct Opticians,5M3-201__000002_WV131TG,OPT,,13 Stafford Street,,Willenhall,,WV13 1TG,Tel: 01902 609244, - ,,,No ratings yet Rate it yourself - /Services/opticians/LeaveReview/DefaultView.aspx?id=5M3-201__000002_WV131TG,0,0,
Supa Specs Ltd,OP_5M3_12438__000001_WV132AA,OPT,12 Market Place,Willenhall,,Wolverhampton,,WV13 2AA,Tel: 01902 630393, - ,,,No ratings yet Rate it yourself - /Services/opticians/LeaveReview/DefaultView.aspx?id=OP_5M3_12438__000001_WV132AA,0,0,
Scrivens Ltd,OP_5M3_1341__000001_WV131PU,OPT,33 Cross Street,,,Willenhall,West Midlands,WV13 1PG,Tel: 01902 605386, - ,,,No ratings yet Rate it yourself - /Services/opticians/LeaveReview/DefaultView.aspx?id=OP_5M3_1341__000001_WV131PU,0,0,
Eye Society,OP_5MH_10164__000002_B645HH,OPT,33 High Street,,Cradley Heath,,,B64 5HL,Tel: 01384 633336, - ,,,No ratings yet Rate it yourself - /Services/opticians/LeaveReview/DefaultView.aspx?id=OP_5MH_10164__000002_B645HH,0,0,
Arnold Opticians,OP_5MH_10243__000001_B645HG,OPT,17-18 High Street,,Cradley Heath,,,B64 5HG,Tel: 01384 561969, - ,,,No ratings yet Rate it yourself - /Services/opticians/LeaveReview/DefaultView.aspx?id=OP_5MH_10243__000001_B645HG,0,0,
R Meredith,OP_5MH_7811__000001_B645HP,OPT,6 High Street,,Cradley Heath,,,B64 5HP,Tel: 01384 566 770, - ,,,No ratings yet Rate it yourself - /Services/opticians/LeaveReview/DefaultView.aspx?id=OP_5MH_7811__000001_B645HP,0,0,
Optical and Hearing Centre,5PK/6400__000001_WV107AU,OPT,Surgery House,2 South Crescent,Featherstone,,,WV10 7AU,Tel: 01902 306925, - ,,,No ratings yet Rate it yourself - /Services/opticians/LeaveReview/DefaultView.aspx?id=5PK/6400__000001_WV107AU,0,0,
Ashmore Park Opticians,OP_5MV_371__000001_WV112JN,OPT,54 Griffiths Drive,Ashmore Park,,Wolverhampton,,WV11 2JW,Tel: 01902 739777, - ,,,4 ratings Rate it yourself - /Services/opticians/LeaveReview/DefaultView.aspx?id=OP_5MV_371__000001_WV112JN,,,
On Call Opticians - Home Visits for an Eye Test,TAMOPTICIAN0001,OPT,WEST MIDLANDS ONLY SERVICE Registered at,61 Trafalgar Road,,Oldbury,West Midlands,B69 1RE,Tel: 01384 234 779, - ,,,77 ratings Rate it yourself - /Services/opticians/LeaveReview/DefaultView.aspx?id=TAMOPTICIAN0001,,,yes
D Wright,OP_5MH_3944__000001_B646HU,OPT,178 Halesowen Road,,Cradley Heath,,,B64 6HU,Tel: 01384 568622, - ,,,No ratings yet Rate it yourself - /Services/opticians/LeaveReview/DefaultView.aspx?id=OP_5MH_3944__000001_B646HU,0,0,