Organisation Name,NACS Code,Organisation Type,Address1,Address2,Address3,Address4,Address5,PostCode,Telephone Number,Opening time,Value  (Opening time),Banding Classification  (Opening time),NHS.UK users rating,Value  (NHS.UK users rating),Banding Classification  (NHS.UK users rating),Car parking (Is there car parking at this organisation?)
Douglas & Tobin,OP_5K8_2993__000001_N193QS,OPT,3 St. Johns Way,,London,,,N19 3QS,Tel: 020 7272 1506, - ,,,No ratings yet Rate it yourself - /Services/opticians/LeaveReview/DefaultView.aspx?id=OP_5K8_2993__000001_N193QS,0,0,
P Leaning Optometrist,OP_5K7_5010__000003_N65JT,OPT,40 Highgate High Street,,,London,,N6 5JG,Tel: 020 8340 6228, - ,,,No ratings yet Rate it yourself - /Services/opticians/LeaveReview/DefaultView.aspx?id=OP_5K7_5010__000003_N65JT,0,0,
Eyevalue Ltd,OP_5K8_2086__000001_N76PZ,OPT,460 Holloway Road,460 Holloway Road,,London,,N7 6HT,Tel: 020 7609 3323, - ,,,No ratings yet Rate it yourself - /Services/opticians/LeaveReview/DefaultView.aspx?id=OP_5K8_2086__000001_N76PZ,0,0,
Holloway Specsavers Opticians,OP_5K8_4977__000002_N76AJ,OPT,11 Seven Sisters Road,Holloway,London,,,N7 6AJ,Tel: 020 7263 6006, - ,,,9 ratings Rate it yourself - /Services/opticians/LeaveReview/DefaultView.aspx?id=OP_5K8_4977__000002_N76AJ,,,
R H Wynne Ltd,OP_5K8_8621__000002_N76AE,OPT,106 Seven Sisters Road,,London,,,N7 6AE,Tel: 020 7607 3040, - ,,,1 rating Rate it yourself - /Services/opticians/LeaveReview/DefaultView.aspx?id=OP_5K8_8621__000002_N76AE,,,
Nicholas K Taylor,OP_5K7_6007__000001_NW52TH,OPT,308 Kentish Town,,London,,,NW5 2TH,Tel: 020 7485 2153, - ,,,No ratings yet Rate it yourself - /Services/opticians/LeaveReview/DefaultView.aspx?id=OP_5K7_6007__000001_NW52TH,0,0,
Style Opticians,OP_5K8_769__000003_N43PX,OPT,135b Stroud Green Road,,London,,,N4 3PX,Tel: 0207 561 1300, - ,,,1 rating Rate it yourself - /Services/opticians/LeaveReview/DefaultView.aspx?id=OP_5K8_769__000003_N43PX,,,
A View Opticians,OP_5C9_9782__000001_N88AA,OPT,6 Crouch End Hill,Hornsey,London,,,N8 8AA,Tel: 020 8340 3447, - ,,,1 rating Rate it yourself - /Services/opticians/LeaveReview/DefaultView.aspx?id=OP_5C9_9782__000001_N88AA,,,
Scrivens Opticians,OP_5K7_7423__000001_NW52JS,OPT,271 Kentish Town Road,271 Kentish Town Road,London,London,,NW5 2JS,Tel: 020 7485 2886, - ,,,46 ratings Rate it yourself - /Services/opticians/LeaveReview/DefaultView.aspx?id=OP_5K7_7423__000001_NW52JS,,,
Betterspecs Opticians,OP_5K7_8885__000002_NW52AE,OPT,210 Kentish Town Road,Camden,London,,,NW5 2AD,Tel: 020 7482 3859, - ,,,4 ratings Rate it yourself - /Services/opticians/LeaveReview/DefaultView.aspx?id=OP_5K7_8885__000002_NW52AE,,,
Specsavers Optcians,COL24435C9__000003_N88DU,OPT,33 The Broadway,Crouch End,London,,,N8 8DU,, - ,,,No ratings yet Rate it yourself - /Services/opticians/LeaveReview/DefaultView.aspx?id=COL24435C9__000003_N88DU,0,0,
David Clulow Opticians,F85A113__000001_N89SU,OPT,40 The Broadway,Crouch End,London,,,N8 9SU,Tel: 020 8340 2325, - ,,,No ratings yet Rate it yourself - /Services/opticians/LeaveReview/DefaultView.aspx?id=F85A113__000001_N89SU,0,0,
Finsbury Eye Centre Opticians Limited,OP_5K8_9233__000001_N42HX,OPT,240e Seven Sisters Road,,London,,,N4 2HX,Tel: 020 7272 3358, - ,,,No ratings yet Rate it yourself - /Services/opticians/LeaveReview/DefaultView.aspx?id=OP_5K8_9233__000001_N42HX,0,0,
C H Lim Ophthalmic Opticians,OP_5C9_398__000001_N88PR,OPT,16 Topsfield Parade,Tottenham Lane,London,,,N8 8PR,Tel: 020 8348 8615, - ,,,8 ratings Rate it yourself - /Services/opticians/LeaveReview/DefaultView.aspx?id=OP_5C9_398__000001_N88PR,,,
Queens Crescent Eye Care,OP_5K7_596__000001_NW54DY,OPT,,58 Queens Crescent,Kentish Town,London,,NW5 4EE,Tel: 020 7485 3389, - ,,,No ratings yet Rate it yourself - /Services/opticians/LeaveReview/DefaultView.aspx?id=OP_5K7_596__000001_NW54DY,0,0,
Real Eyes Opticians,OP_5K8_10057__000002_N78DA,OPT,226 Holloway Road,,London,,,N7 8DA,Tel: 020 7607 8050, - ,,,No ratings yet Rate it yourself - /Services/opticians/LeaveReview/DefaultView.aspx?id=OP_5K8_10057__000002_N78DA,0,0,
Special Eyes Opticians Limited,OP_5K8_840__000002_N42DW,OPT,68 Blackstock Road,,,London,,N4 2DW,Tel: 0207 226 8316, - ,,,No ratings yet Rate it yourself - /Services/opticians/LeaveReview/DefaultView.aspx?id=OP_5K8_840__000002_N42DW,0,0,
Icon the Opticians,OP_5K7_6005__000001_NW32QB,OPT,57 Southend Road,,London,,,NW3 2QB,Tel: 020 7435 5888, - ,,,No ratings yet Rate it yourself - /Services/opticians/LeaveReview/DefaultView.aspx?id=OP_5K7_6005__000001_NW32QB,0,0,
Icon the Opticians (DOM),5LA_OPT_25__000008_NW32QB,OPT,23 Southend Road,,London,,,NW3 2QB,Tel: 0207 435 5888, - ,,,No ratings yet Rate it yourself - /Services/opticians/LeaveReview/DefaultView.aspx?id=5LA_OPT_25__000008_NW32QB,0,0,
Optique 20-20 Optometrists,OP_5K7_7180__000001_NW32AJ,OPT,194 Haverstock Hill,,London,,,NW3 2AJ,Tel: 020 7794 2020, - ,,,1 rating Rate it yourself - /Services/opticians/LeaveReview/DefaultView.aspx?id=OP_5K7_7180__000001_NW32AJ,,,
Eye Place,OP_5K7_8167__000001_NW34QT,OPT,153 Haverstock Hill,153 Haverstock Hill,London,London,,NW3 4QT,Tel: 020 7722 5446, - ,,,No ratings yet Rate it yourself - /Services/opticians/LeaveReview/DefaultView.aspx?id=OP_5K7_8167__000001_NW34QT,0,0,
K. J. Davies Opticians,P6D1Q,OPT,12 Priory Road,12 Priory Road,London,"Hornsey, London",,N8 7RD,Tel: 020 8341 4545, - ,,,No ratings yet Rate it yourself - /Services/opticians/LeaveReview/DefaultView.aspx?id=P6D1Q,0,0,
Fisheye Optometrists Ltd,OP_5K8_793__000001_N78JZ,OPT,75 Holloway Road,,London,,,N7 8JZ,, - ,,,No ratings yet Rate it yourself - /Services/opticians/LeaveReview/DefaultView.aspx?id=OP_5K8_793__000001_N78JZ,0,0,
Perspective Optometrists,OP_5K7_5011__000001_NW34GT,OPT,8 Englands Street,,London,,,NW3 4GT,Tel: 020 7586 5508, - ,,,1 rating Rate it yourself - /Services/opticians/LeaveReview/DefaultView.aspx?id=OP_5K7_5011__000001_NW34GT,,,
Otto Opticians,OP_5K8_10901__000001_N51RA,OPT,41 Holloway Road,Islington,London,Islington,,N7 8JP,Tel: 020 7700 7557, - ,,,No ratings yet Rate it yourself - /Services/opticians/LeaveReview/DefaultView.aspx?id=OP_5K8_10901__000001_N51RA,0,0,
Arthur Morrice,OP_5K7_136__000001_NW31ND,OPT,62 Rosslyn Hill,Hampstead,London,,,NW3 1ND,Tel: 020 7794 4112, - ,,,No ratings yet Rate it yourself - /Services/opticians/LeaveReview/DefaultView.aspx?id=OP_5K7_136__000001_NW31ND,0,0,
GAZZA VISUALEYES LTD,OP_5C3_14454__000001_N42HE,OPT,284 Green Lanes,London,London,,,N4 2HE,Tel: 020 8802 7513, - ,,,No ratings yet Rate it yourself - /Services/opticians/LeaveReview/DefaultView.aspx?id=OP_5C3_14454__000001_N42HE,0,0,
Observatory - The Opticians,OP_5C9_1741__000001_N103RT,OPT,64 Muswell Hill Broadway,Muswell Hill,,London,,N10 3RT,Tel: 020 8444 0143, - ,,,No ratings yet Rate it yourself - /Services/opticians/LeaveReview/DefaultView.aspx?id=OP_5C9_1741__000001_N103RT,0,0,
Specsavers Opticians,OP_5K7_6000__000001_NW50LU,OPT,126 Camden High Street,,,London,,NW1 0LU,Tel: 020 7482 4110, - ,,,No ratings yet Rate it yourself - /Services/opticians/LeaveReview/DefaultView.aspx?id=OP_5K7_6000__000001_NW50LU,0,0,
The Optical Shop,OP_5C1_13670__000001_N41HA,OPT,433 Green Lanes,Haringey,,London,,N4 1HA,Tel: 0208 340 1516, - ,,,No ratings yet Rate it yourself - /Services/opticians/LeaveReview/DefaultView.aspx?id=OP_5C1_13670__000001_N41HA,0,0,
Robert Linsky Optometrists Ltd,OP_5C9_4689__000001_N103HP,OPT,11 Fortis Green Road,Muswell Hill,London,London,,N10 3HP,Tel: 020 8883 6879, - ,,,5 ratings Rate it yourself - /Services/opticians/LeaveReview/DefaultView.aspx?id=OP_5C9_4689__000001_N103HP,,,
Robert Linsky,F4Y3L,OPT,,11 Fortis Green Road,,"Muswell Hill, London",Greater London,N10 3HP,Tel: 0208 8836879, - ,,,No ratings yet Rate it yourself - /Services/opticians/LeaveReview/DefaultView.aspx?id=F4Y3L,0,0,
Chakshu London,TP9AW,OPT,,97 Parkway,,London,,NW1 7PP,Tel: 0203 981 2907, - ,,,No ratings yet Rate it yourself - /Services/opticians/LeaveReview/DefaultView.aspx?id=TP9AW,0,0,
David Clulow,OP_5K7_6461__000001_NW31QX,OPT,73 Hampstead High Street,,London,,,NW3 1QX,Tel: 020 7435 8445, - ,,,No ratings yet Rate it yourself - /Services/opticians/LeaveReview/DefaultView.aspx?id=OP_5K7_6461__000001_NW31QX,0,0,
Vision Express Hampstead,OP_5K7_7003__000001_NW31DL,OPT,54 Heath Street,,London,,,NW3 1DL,Tel: 020 7431 0031, - ,,,No ratings yet Rate it yourself - /Services/opticians/LeaveReview/DefaultView.aspx?id=OP_5K7_7003__000001_NW31DL,0,0,
Specsavers Opticians,C/OL2438-5C9__000003_N101DJ,OPT,404 Muswell Hill Broadway,Muswell Hill,London,,,N10 1DJ,, - ,,,No ratings yet Rate it yourself - /Services/opticians/LeaveReview/DefaultView.aspx?id=C/OL2438-5C9__000003_N101DJ,0,0,
J L Opticians,OP_5K7_4669__000001_NW17JL,OPT,69 Camden High Street,,,London,,NW1 7JL,Tel: 020 7388 5432, - ,,,No ratings yet Rate it yourself - /Services/opticians/LeaveReview/DefaultView.aspx?id=OP_5K7_4669__000001_NW17JL,0,0,
Green Lanes Eyecare Centre,OP_5C9_8166__000001_N41LA,OPT,20 Grand Parade,Green Lanes,London,London,,N4 1LA,Tel: 020 8802 9903, - ,,,2 ratings Rate it yourself - /Services/opticians/LeaveReview/DefaultView.aspx?id=OP_5C9_8166__000001_N41LA,,,
Miltons Eyecare,OP_5K7_12749__000001_NW36TE,OPT,38 Heath Street,,London,,,NW3 6TE,Tel: 020 7794 4477, - ,,,1 rating Rate it yourself - /Services/opticians/LeaveReview/DefaultView.aspx?id=OP_5K7_12749__000001_NW36TE,,,
Dolland and Aitchison,OP_5K7_10607__000002_NW36TE,OPT,26 Heath Street,,Hampstead,London,,NW3 6TE,Tel: 0207 7946101, - ,,,No ratings yet Rate it yourself - /Services/opticians/LeaveReview/DefaultView.aspx?id=OP_5K7_10607__000002_NW36TE,0,0,
Camden Contact Lens Centre,OP_5K7_7046__000002_NW10JH,OPT,32-36 Camden High Street,,London,,,NW1 0JH,Tel: 020 7383 3838, - ,,,No ratings yet Rate it yourself - /Services/opticians/LeaveReview/DefaultView.aspx?id=OP_5K7_7046__000002_NW10JH,0,0,
Boots-London - Muswell Hill,OP_5C9_2574__000001_N101BS,OPT,450 Muswell Hill Broadway,,,London,,N10 1BS,Tel: 0208 883 1216, - ,,,2 ratings Rate it yourself - /Services/opticians/LeaveReview/DefaultView.aspx?id=OP_5C9_2574__000001_N101BS,,,
A View Opticians,OP_5K8__000001_N11RQ,OPT,203 Upper Street,,Islington,London,,N1 1RQ,Tel: 020 7359 6868, - ,,,7 ratings Rate it yourself - /Services/opticians/LeaveReview/DefaultView.aspx?id=OP_5K8__000001_N11RQ,,,
H. R. Breakspear,OP_5C9_1310__000001_N101BX,OPT,343 Muswell Hill Broadway,Muswell Hill,London,,,N10 1BX,Tel: 020 8883 2183, - ,,,2 ratings Rate it yourself - /Services/opticians/LeaveReview/DefaultView.aspx?id=OP_5C9_1310__000001_N101BX,,,
Alexander Opticians,OP_5K7_7005__000001_NW33DR,OPT,14b Elsworthy Terrace,,London,,,NW3 3DR,Tel: 020 7586 6579, - ,,,1 rating Rate it yourself - /Services/opticians/LeaveReview/DefaultView.aspx?id=OP_5K7_7005__000001_NW33DR,,,
Panoptica,OP_5A9_10056__000001_N29PN,OPT,56 High Road,East Finchley,London,,,N2 9PN,Tel: 020 8883 6693, - ,,,No ratings yet Rate it yourself - /Services/opticians/LeaveReview/DefaultView.aspx?id=OP_5A9_10056__000001_N29PN,0,0,
Malcom Coates,OP_5K7_1239__000001_NW35EP,OPT,11 New College Parade,,London,,,NW3 5EP,Tel: 020 7586 3866, - ,,,No ratings yet Rate it yourself - /Services/opticians/LeaveReview/DefaultView.aspx?id=OP_5K7_1239__000001_NW35EP,0,0,
Personal Eyez Ltd,Q7F4K,OPT,,2 Harben Parade,,London,,NW3 6JP,Tel: 020 7722 2991, - ,,,No ratings yet Rate it yourself - /Services/opticians/LeaveReview/DefaultView.aspx?id=Q7F4K,0,0,
Vision Express,OP_5K7_5012__000004_NW36JP,OPT,4 Harbern Parade,,London,,,NW3 6JP,Tel: 020 7449 2693, - ,,,No ratings yet Rate it yourself - /Services/opticians/LeaveReview/DefaultView.aspx?id=OP_5K7_5012__000004_NW36JP,0,0,
Stewart Duncan,OP_5A9_4396__000002_N29ED,OPT,126 High Road,East Finchley,London,London,,N2 9ED,Tel: 020 8883 2020, - ,,,2 ratings Rate it yourself - /Services/opticians/LeaveReview/DefaultView.aspx?id=OP_5A9_4396__000002_N29ED,,,
ASKEW EYEWEAR (TONYA CAVANAGH),10013__000002_N160UL,OPT,195-197 Church Street,Stoke Newington,,London,,N16 0UL,Tel: 020 7249 6333, - ,,,3 ratings Rate it yourself - /Services/opticians/LeaveReview/DefaultView.aspx?id=10013__000002_N160UL,,,
Eyecloud Opticians,TP9EX,OPT,,6 Turnpike Parade,,"Green Lanes, London",,N15 3EA,Tel: 020 8888 2022, - ,,,No ratings yet Rate it yourself - /Services/opticians/LeaveReview/DefaultView.aspx?id=TP9EX,0,0,
Spec Savers Swiss Cottage,SPECSAVERS_NW3_6LB,OPT,,171 Finchley Road,,London,,NW3 6LB,Tel: 02076449990, - ,,,No ratings yet Rate it yourself - /Services/opticians/LeaveReview/DefaultView.aspx?id=SPECSAVERS_NW3_6LB,0,0,
David Hillel,HILLEL123,OPT,,119 High Road,East Finchley,London,,N2 8AG,Tel: 020 8444 2233, - ,,,2 ratings Rate it yourself - /Services/opticians/LeaveReview/DefaultView.aspx?id=HILLEL123,,,
Optique 20:20 ,OP_5K7_6008__000002_NW36LU,OPT,"Unit 1a, The O2 Centre, 255 Finchley Road",,London,,,NW3 6LU,Tel: 020 7431 6902, - ,,,1 rating Rate it yourself - /Services/opticians/LeaveReview/DefaultView.aspx?id=OP_5K7_6008__000002_NW36LU,,,
Essex Opticians,OP_5K8_4888__000002_N12SF,OPT,41 Essex Road,,London,,,N1 2SF,Tel: 020 7359 3816, - ,,,No ratings yet Rate it yourself - /Services/opticians/LeaveReview/DefaultView.aspx?id=OP_5K8_4888__000002_N12SF,0,0,
Insight Opticians,OP_5K8_198__000001_N19EZ,OPT,24 Chapel Market,,London,,,N1 9EZ,Tel: 020 7278 1212, - ,,,No ratings yet Rate it yourself - /Services/opticians/LeaveReview/DefaultView.aspx?id=OP_5K8_198__000001_N19EZ,0,0,
Angel Eye Centre ,OP_5K8_6693__000001_N19EX,OPT,85 Chapel Market,,London,,,N1 9EX,Tel: 020 7278 3535, - ,,,No ratings yet Rate it yourself - /Services/opticians/LeaveReview/DefaultView.aspx?id=OP_5K8_6693__000001_N19EX,0,0,
Eyelevel,OP_5K8_5085__000001_N10PN,OPT,37 Upper Street,,London,,,N1 0PN,Tel: 020 7354 9277, - ,,,No ratings yet Rate it yourself - /Services/opticians/LeaveReview/DefaultView.aspx?id=OP_5K8_5085__000001_N10PN,0,0,
Optique 20:20,OP_5C9_6495__000001_N226YD,OPT,Unit 22,88-96 High Road,Wood Green,London,,N22 6HE,Tel: 020 8889 2020, - ,,,No ratings yet Rate it yourself - /Services/opticians/LeaveReview/DefaultView.aspx?id=OP_5C9_6495__000001_N226YD,0,0,
Specsavers Opticians,OP_5C9_7140__000001_N226HE,OPT,88-96 High Road,Wood Green,London,,,N22 6YD,Tel: 020 8881 5000, - ,,,No ratings yet Rate it yourself - /Services/opticians/LeaveReview/DefaultView.aspx?id=OP_5C9_7140__000001_N226HE,0,0,
Specsavers Islington,OP 5K8 6015__000003_N19ER,OPT,68 Chapel Market,Islington,London,,,N1 9ER,Tel: 020 7841 3030, - ,,,2 ratings Rate it yourself - /Services/opticians/LeaveReview/DefaultView.aspx?id=OP 5K8 6015__000003_N19ER,,,
Boots Opticians Ltd,OP_5C9_5693__000002_N226BA,OPT,137-139 High Road,,Wood Green,London,,N22 6BA,Tel: 0208 8818602, - ,,,1 rating Rate it yourself - /Services/opticians/LeaveReview/DefaultView.aspx?id=OP_5C9_5693__000002_N226BA,,,
David Clulow,OP_5K8_790__000001_N10PQ,OPT,25 Upper Street,,London,,,N1 0PQ,Tel: 020 7704 0010, - ,,,No ratings yet Rate it yourself - /Services/opticians/LeaveReview/DefaultView.aspx?id=OP_5K8_790__000001_N10PQ,0,0,
VISION EXPRESS (UK)LTD,OP 5K8__000002_N10PQ,OPT,23-24 Upper Street,Islington,London,,,N1 0PQ,Tel: 0207 354 0057, - ,,,No ratings yet Rate it yourself - /Services/opticians/LeaveReview/DefaultView.aspx?id=OP 5K8__000002_N10PQ,0,0,
Camden Eye Clinic,OP_5K7_5006__000001_NW11ES,OPT,24 Charlton Street,24 Charlton Street,London,London,,NW1 1JH,Tel: 020 7383 2931, - ,,,1 rating Rate it yourself - /Services/opticians/LeaveReview/DefaultView.aspx?id=OP_5K7_5006__000001_NW11ES,,,
Boots-Wood Green - High Rd,OP_5C9_5302__000001_N226EB,OPT,148 High Road,Wood Green,London,London,,N22 6EB,Tel: 0208 888 3361, - ,,,1 rating Rate it yourself - /Services/opticians/LeaveReview/DefaultView.aspx?id=OP_5C9_5302__000001_N226EB,,,
Stephen H Davis Optometrists,OP_5C3_14479__000002_N160AP,OPT,94 Stoke Newington Church St,,,London,,N16 0AP,Tel: 020 7254 8181, - ,,,4 ratings Rate it yourself - /Services/opticians/LeaveReview/DefaultView.aspx?id=OP_5C3_14479__000002_N160AP,,,
"KAHAN, HENRY",10034__000002_NW119AS,OPT,,25 St Andrews Mews,,London,,N16 5HR,Tel: 020 8455 8883, - ,,,No ratings yet Rate it yourself - /Services/opticians/LeaveReview/DefaultView.aspx?id=10034__000002_NW119AS,0,0,
PRAMUKH EYECARE,OP 5K7__000002_NW14BU,OPT,2 Chester Court,Camden,London,,,NW1 4BU,Tel: 0207 935 9304, - ,,,No ratings yet Rate it yourself - /Services/opticians/LeaveReview/DefaultView.aspx?id=OP 5K7__000002_NW14BU,0,0,
Zac & Adam Eyecare,S6R4H,OPT,,163 Stoke Newington Road,,London,,N16 8PB,, - ,,,No ratings yet Rate it yourself - /Services/opticians/LeaveReview/DefaultView.aspx?id=S6R4H,0,0,
Simon Gavzey,OP_5A9_13594__000001_HA89TP,OPT,Gavzey Opticians,48 The Market Place,,Hampstead Garden Suburb,,NW11 6JP,Tel: 020 8731 9999, - ,,,No ratings yet Rate it yourself - /Services/opticians/LeaveReview/DefaultView.aspx?id=OP_5A9_13594__000001_HA89TP,0,0,
i-Optix Eye Care,GOC-D-13328-0108-NW1 2HN,OPT,,96 Drummond Street,Euston,London,,NW1 2HN,Tel: 020 7388 1122, - ,,,No ratings yet Rate it yourself - /Services/opticians/LeaveReview/DefaultView.aspx?id=GOC-D-13328-0108-NW1 2HN,0,0,yes
RNIB,-60 5LC__000002_WC1H9NE,OPT,105 Judd Street,,,London,,WC1H 9NE,Tel: 020 7391 2368, - ,,,No ratings yet Rate it yourself - /Services/opticians/LeaveReview/DefaultView.aspx?id=-60 5LC__000002_WC1H9NE,0,0,
The Eye Cube,OP_5K7_7002__000002_NW61LJ,OPT,256 West End Lane,,London,,,NW6 1LJ,Tel: 020 7433 1333, - ,,,No ratings yet Rate it yourself - /Services/opticians/LeaveReview/DefaultView.aspx?id=OP_5K7_7002__000002_NW61LJ,0,0,
Safarian & Simon,OP_5LC_13404__000001_NW87NH,OPT,62 St John's Wood High Street,St. John's Wood,,London,Greater London,NW8 7SH,Tel: 0207 722 1917, - ,,,3 ratings Rate it yourself - /Services/opticians/LeaveReview/DefaultView.aspx?id=OP_5LC_13404__000001_NW87NH,,,
EYEWEAR (MR ISLAM),10033__000001_N160PH,OPT,115 Stoke Newington High St,,London,,,N16 0PH,Tel: 020 7249 8647, - ,,,No ratings yet Rate it yourself - /Services/opticians/LeaveReview/DefaultView.aspx?id=10033__000001_N160PH,0,0,
Globe Opticians,OP_5A9_1689__000002_NW117RR,OPT,618 Finchley Road,,Golders Green,,,NW11 7RR,Tel: 0208 458 3035, - ,,,1 rating Rate it yourself - /Services/opticians/LeaveReview/DefaultView.aspx?id=OP_5A9_1689__000002_NW117RR,,,
Insight West Hampstead Opticians,OP_5K7_7494__000001_NW61XN,OPT,247 West End Lane,,London,,,NW6 1XN,Tel: 020 7435 1485, - ,,,No ratings yet Rate it yourself - /Services/opticians/LeaveReview/DefaultView.aspx?id=OP_5K7_7494__000001_NW61XN,0,0,
Schuller Opticians,OP_5LC_9331__000002_NW87NH,OPT,33 St. Johns Wood High Street,,London,,,NW8 7NH,Tel: 020 7722 8242, - ,,,1 rating Rate it yourself - /Services/opticians/LeaveReview/DefaultView.aspx?id=OP_5LC_9331__000002_NW87NH,,,
Angel Eyes Opticians,OP_5K8_9323__000001_EC1V4LD,OPT,395 St. John Street,,London,,,EC1V 4LD,Tel: 020 7837 9418, - ,,,No ratings yet Rate it yourself - /Services/opticians/LeaveReview/DefaultView.aspx?id=OP_5K8_9323__000001_EC1V4LD,0,0,
Drury Porter Eyecare,OP_5K7_3022__000002_WC1N1AE,OPT,70 Brunswick Centre,Bloomsbury,London,Russell Square,,WC1N 1AE,Tel: 020 7837 3276, - ,,,No ratings yet Rate it yourself - /Services/opticians/LeaveReview/DefaultView.aspx?id=OP_5K7_3022__000002_WC1N1AE,0,0,
SPECSAVERS OPTICIANS,OP-5A9-13607__000001_NW118EE,OPT,29 Golders Green Road,Golders Green,London,,,NW11 8EE,Tel: 020 8209 9840, - ,,,No ratings yet Rate it yourself - /Services/opticians/LeaveReview/DefaultView.aspx?id=OP-5A9-13607__000001_NW118EE,0,0,
EYES ONLY OPTICIANS (MR LATORE),10022__000002_E82PB,OPT,87 Kingsland High Street,,London,,,E8 2PB,Tel: 020 7241 6567, - ,,,No ratings yet Rate it yourself - /Services/opticians/LeaveReview/DefaultView.aspx?id=10022__000002_E82PB,0,0,
CHARLES LEADSHAM OPTICIANS (MR J PLASKOW),OP_5C3_14554__000001_N166RA,OPT,202stamford Hill,London,,,,N16 6RA,Tel: 020 8800 3189, - ,,,No ratings yet Rate it yourself - /Services/opticians/LeaveReview/DefaultView.aspx?id=OP_5C3_14554__000001_N166RA,0,0,
Boots-Golders Green,OP_5A9_1698__000002_NW118EL,OPT,55 Golders Green Road,,Golders Green,London,,NW11 8EL,Tel: 0208 455 8418, - ,,,No ratings yet Rate it yourself - /Services/opticians/LeaveReview/DefaultView.aspx?id=OP_5A9_1698__000002_NW118EL,0,0,
Brunswick Visionplus Ltd,OP_5K7_7001__000003_WC1N1AF,OPT,Unit 31 Brunswick Centre,,London,,,WC1N 1AF,Tel: 020 7520 0010, - ,,,No ratings yet Rate it yourself - /Services/opticians/LeaveReview/DefaultView.aspx?id=OP_5K7_7001__000003_WC1N1AF,0,0,
Eyecloud Opticians,TP8F5,OPT,,15 Kingsland High Street,Dalston,London,,E8 2JS,Tel: 020 7923 1852, - ,,,1 rating Rate it yourself - /Services/opticians/LeaveReview/DefaultView.aspx?id=TP8F5,,,
Safarian and Simon Opticians,TP9FW,OPT,,53 Abbey Road,,London,,NW8 0AD,, - ,,,1 rating Rate it yourself - /Services/opticians/LeaveReview/DefaultView.aspx?id=TP9FW,,,
Zacks Eye Clinic,TP5H4,OPT,,30 Warren Street,,London,,W1T 5NF,Tel: 020 7713 7713, - ,,,No ratings yet Rate it yourself - /Services/opticians/LeaveReview/DefaultView.aspx?id=TP5H4,0,0,
Euro Optica,OP_5A9_13678__000001_NW11,OPT,80 Golders Green,Golders Green,London,,,NW11 8LN,Tel: 020 8458 2888, - ,,,No ratings yet Rate it yourself - /Services/opticians/LeaveReview/DefaultView.aspx?id=OP_5A9_13678__000001_NW11,0,0,
SILVERMANS OPTICIANS,OP_5C3_13776__000001_E59AG,OPT,,176 Clapton Common,,London,Greater London,E5 9AG,Tel: 0208 211 7575, - ,,,No ratings yet Rate it yourself - /Services/opticians/LeaveReview/DefaultView.aspx?id=OP_5C3_13776__000001_E59AG,0,0,
SPECSAVERS,OP_5C3_14488__000001_E8,OPT,Unit 18a,Kingsland Shopping Centre,,Dalston,,E8 2LX,Tel: 020 7254 7664, - ,,,2 ratings Rate it yourself - /Services/opticians/LeaveReview/DefaultView.aspx?id=OP_5C3_14488__000001_E8,,,
City University City Sight,OP_5K8_3701__000001_EC1V0HB,OPT,Tait Building,Northampton Square,London,London,,EC1V 0HB,Tel: 020 7040 8338, - ,,,No ratings yet Rate it yourself - /Services/opticians/LeaveReview/DefaultView.aspx?id=OP_5K8_3701__000001_EC1V0HB,0,0,
My Eyes Opticians,OP_5K8_779__000001_EC1R4RA,OPT,68 Exmouth Market,,London,,,EC1R 4QP,Tel: 0207 278 8480, - ,,,No ratings yet Rate it yourself - /Services/opticians/LeaveReview/DefaultView.aspx?id=OP_5K8_779__000001_EC1R4RA,0,0,
OPTIX AT BROADGATE (MR KARBARON),10021__000001_EC2M2WA,OPT,175 Bishops Gate 2 Exchange Arcade,,London,,,EC2M 2WA,Tel: 020 7628 0330, - ,,,No ratings yet Rate it yourself - /Services/opticians/LeaveReview/DefaultView.aspx?id=10021__000001_EC2M2WA,0,0,
M. A. Heylen,OP_5C9_13529__000001_N154HH,OPT,206 Philip Lane,Tottenham,London,,,N15 4HH,Tel: 020 8808 2522, - ,,,No ratings yet Rate it yourself - /Services/opticians/LeaveReview/DefaultView.aspx?id=OP_5C9_13529__000001_N154HH,0,0,
A Ray Eyecare,OP_5C9_5813__000001_N225DD,OPT,514 Lordship Lane,,,London,,N22 5DD,Tel: 020 8888 8715, - ,,,No ratings yet Rate it yourself - /Services/opticians/LeaveReview/DefaultView.aspx?id=OP_5C9_5813__000001_N225DD,0,0,
Orb Optical,OP_W1T4RE_33984,OPT,,12a Tottenham Road,,London,,W1T 4RE,, - ,,,1 rating Rate it yourself - /Services/opticians/LeaveReview/DefaultView.aspx?id=OP_W1T4RE_33984,,,
"AUSTIN, ANTONY OPTICIANS",OP_5C3_14460__000001_N165TR,OPT,74 Oldhill Street,,London,,,N16 6NA,Tel: 020 8211 7228, - ,,,No ratings yet Rate it yourself - /Services/opticians/LeaveReview/DefaultView.aspx?id=OP_5C3_14460__000001_N165TR,0,0,
Globe Opticians,OP_N17QP_30664,OPT,,100 Murray Grove,,London,,N1 7QP,Tel: 020 7253 6769, - ,,,No ratings yet Rate it yourself - /Services/opticians/LeaveReview/DefaultView.aspx?id=OP_N17QP_30664,0,0,
Schuller Opticians,OP_5K7_6010__000001_WC1N3LJ,OPT,44 Lambs Conduit Street,,London,,,WC1N 3LJ,Tel: 020 7404 2002, - ,,,No ratings yet Rate it yourself - /Services/opticians/LeaveReview/DefaultView.aspx?id=OP_5K7_6010__000001_WC1N3LJ,0,0,