Organisation Name,NACS Code,Organisation Type,Address1,Address2,Address3,Address4,Address5,PostCode,Telephone Number,Opening time,Value  (Opening time),Banding Classification  (Opening time),NHS.UK users rating,Value  (NHS.UK users rating),Banding Classification  (NHS.UK users rating),Car parking (Is there car parking at this organisation?)
Scrivens Opticians (Tonbridge),OP_5FF_13081__000001_TN91TE,OPT,8 The Pavilion,High Street,Tonbridge,Kent,,TN9 1TE,Tel: 01732 352565, - ,,,No ratings yet Rate it yourself - /Services/opticians/LeaveReview/DefaultView.aspx?id=OP_5FF_13081__000001_TN91TE,0,0,
Specsavers (Tonbridge),00289__000001_TN91SQ,OPT,15 High Street,,Tonbridge,Kent,,TN9 1SQ,Tel: 01732 370480, - ,,,2 ratings Rate it yourself - /Services/opticians/LeaveReview/DefaultView.aspx?id=00289__000001_TN91SQ,,,
Boots-Tonbridge,OP_5FF_3325__000002_TN91SD,OPT,59 High Street,,,Tonbridge,Kent,TN9 1SD,Tel: 01732 357565, - ,,,No ratings yet Rate it yourself - /Services/opticians/LeaveReview/DefaultView.aspx?id=OP_5FF_3325__000002_TN91SD,0,0,
William J Wilkinson (Tonbridge),OP_5FF_2040__000001_TN91AP,OPT,90 High Street,,Kent,Tonbridge,,TN9 1AP,Tel: 01732 353803, - ,,,1 rating Rate it yourself - /Services/opticians/LeaveReview/DefaultView.aspx?id=OP_5FF_2040__000001_TN91AP,,,
Crayford Optical Centre,OPT_TN91RE_3,OPT,,Home Visits,,Kent,,TN9 1RE,Tel: 01322 557 700, - ,,,2 ratings Rate it yourself - /Services/opticians/LeaveReview/DefaultView.aspx?id=OPT_TN91RE_3,,,
Complete Community Care Kent Ltd,OPT_TN91RE_2,OPT,,Home Visits,,Kent,,TN9 1RE,Tel: 01732 458 424, - ,,,No ratings yet Rate it yourself - /Services/opticians/LeaveReview/DefaultView.aspx?id=OPT_TN91RE_2,0,0,
Bansal Opticians ,OPT_TN91RE_1,OPT,,Home Visits,,Kent and Medway,Kent,TN9 1RE,Tel: 020 8470 1133, - ,,,No ratings yet Rate it yourself - /Services/opticians/LeaveReview/DefaultView.aspx?id=OPT_TN91RE_1,0,0,
Day Lewis Opticians (Southborough),OPT_TN40PN_1,OPT,,100 London Road,,Southborough,,TN4 0PN,Tel: 01892 529626, - ,,,No ratings yet Rate it yourself - /Services/opticians/LeaveReview/DefaultView.aspx?id=OPT_TN40PN_1,0,0,
Eye Concern,DOMICILIARYEYECARE1,OPT,,"134 London Road, Southborough",,Tunbridge Wells,,TN4 0PL,Tel: 01892 517312, - ,,,5 ratings Rate it yourself - /Services/opticians/LeaveReview/DefaultView.aspx?id=DOMICILIARYEYECARE1,,,
Osborne Harle,OP_5FF_397__000003_TN104AE,OPT,1-3 Martin Hardie Way,Tonbridge,,Kent,,TN10 4AE,Tel: 01732 368678, - ,,,9 ratings Rate it yourself - /Services/opticians/LeaveReview/DefaultView.aspx?id=OP_5FF_397__000003_TN104AE,,,yes
Leightons Opticians and Hearing Care,TP4N9,OPT,,2 Goods Station Road,,Tunbridge Wells,Kent,TN1 2BJ,Tel: 01892 539808, - ,,,No ratings yet Rate it yourself - /Services/opticians/LeaveReview/DefaultView.aspx?id=TP4N9,0,0,
Boots-Tunbridge Wells - Calverley Rd (in Boots UK),OP_5FF_11550__000002_TN12TE,OPT,7-11 Calverley Road,,,Tunbridge Wells,Kent,TN1 2TE,Tel: 01892 546063, - ,,,No ratings yet Rate it yourself - /Services/opticians/LeaveReview/DefaultView.aspx?id=OP_5FF_11550__000002_TN12TE,0,0,
Specsavers (Tunbridge Wells),OP_5FF_2826__000001_TN11QR,OPT,119 Mount Pleasant Road,,Kent,Tunbridge Wells,,TN1 1QR,Tel: 01892 533550, - ,,,1 rating Rate it yourself - /Services/opticians/LeaveReview/DefaultView.aspx?id=OP_5FF_2826__000001_TN11QR,,,
Vision Express (Tunbridge Wells),OP_5FF_1__000001_TN12TH,OPT,23 Calverley Road,,Kent,Tunbridge Wells,,TN1 2TH,Tel: 01892 537585, - ,,,3 ratings Rate it yourself - /Services/opticians/LeaveReview/DefaultView.aspx?id=OP_5FF_1__000001_TN12TH,,,
Boots-Tunbridge Wells - Calverley Rd,OP_5FF_12824__000001_TN12UU,OPT,49 Calverley Road,,,Tunbridge Wells,Kent,TN1 2TT,Tel: 01892 525 561, - ,,,No ratings yet Rate it yourself - /Services/opticians/LeaveReview/DefaultView.aspx?id=OP_5FF_12824__000001_TN12UU,0,0,
Edney & Edney Ltd,CO-5383,OPT,,35 Monson Road,,"Tunbridge Wells, Kent ",,TN1 1LS,, - ,,,No ratings yet Rate it yourself - /Services/opticians/LeaveReview/DefaultView.aspx?id=CO-5383,0,0,
Edney & Edney,OPT_TN11LS_1,OPT,,35 Monson Road,,Tunbridge Wells,,TN1 1LS,Tel: 01892 517986, - ,,,No ratings yet Rate it yourself - /Services/opticians/LeaveReview/DefaultView.aspx?id=OPT_TN11LS_1,0,0,
Scrivens Opticians (Tunbridge Wells),OP_5FF_11300__000001_TN11PN,OPT,29 Mount Pleasant,,Kent,Tunbridge Wells,,TN1 1PN,Tel: 01892 527999, - ,,,No ratings yet Rate it yourself - /Services/opticians/LeaveReview/DefaultView.aspx?id=OP_5FF_11300__000001_TN11PN,0,0,
David Clulow,OPT_TN11NX_1,OPT,,32-34 High Street,,Tunbridge Wells,Kent,TN1 1NX,Tel: 01892 512385, - ,,,No ratings yet Rate it yourself - /Services/opticians/LeaveReview/DefaultView.aspx?id=OPT_TN11NX_1,0,0,
Peepers,OP_5FF_9945__000001_TN11XU,OPT,49 High Street,Tunbridge Wells,Kent,,,TN1 1XU,Tel: 01892 534481, - ,,,No ratings yet Rate it yourself - /Services/opticians/LeaveReview/DefaultView.aspx?id=OP_5FF_9945__000001_TN11XU,0,0,
Scrivens Opticians (Sevenoaks),OP_5FF_11111__000001_TN131JF,OPT,73a/73b High Street,,Kent,Sevenoaks,,TN13 1LD,Tel: 01732 454558, - ,,,No ratings yet Rate it yourself - /Services/opticians/LeaveReview/DefaultView.aspx?id=OP_5FF_11111__000001_TN131JF,0,0,
Leslie Warren Optician,OP_5FF_4538__000002_TN131LP,OPT,Leslie Warren Opticians,82 High Street,,Sevenoaks,Kent,TN13 1LP,Tel: 01732 452135, - ,,,1 rating Rate it yourself - /Services/opticians/LeaveReview/DefaultView.aspx?id=OP_5FF_4538__000002_TN131LP,,,
Eyelines,OPT_TN131LP_1,OPT,,88 High Street,,Sevenoaks,,TN13 1LP,Tel: 01732 460317, - ,,,No ratings yet Rate it yourself - /Services/opticians/LeaveReview/DefaultView.aspx?id=OPT_TN131LP_1,0,0,
Specsavers (Sevenoaks),OPT_TN131LE_1,OPT,,93 High Street,,Sevenoaks,,TN13 1LE,Tel: 01732 459588, - ,,,2 ratings Rate it yourself - /Services/opticians/LeaveReview/DefaultView.aspx?id=OPT_TN131LE_1,,,
Boots-Sevenoaks,OP_5FF_223__000001_TN131LU,OPT,110 High Street,,,Sevenoaks,Kent,TN13 1LU,Tel: 01732 465989, - ,,,1 rating Rate it yourself - /Services/opticians/LeaveReview/DefaultView.aspx?id=OP_5FF_223__000001_TN131LU,,,
William J Wilkinson (Sevenoaks),OP_5FF_3280__000001_TN131UX,OPT,143 High Street,,Kent,Sevenoaks,,TN13 1UX,Tel: 01732 453137, - ,,,1 rating Rate it yourself - /Services/opticians/LeaveReview/DefaultView.aspx?id=OP_5FF_3280__000001_TN131UX,,,
Elaine M Yorwarth,00156__000001_TN126DP,OPT,70 Commercial Road,,Paddock Wood,Kent,,TN12 6DP,Tel: 01892 833017, - ,,,No ratings yet Rate it yourself - /Services/opticians/LeaveReview/DefaultView.aspx?id=00156__000001_TN126DP,0,0,
Patrick Duff,OP_5L2_12575__000001_TN126EN,OPT,3 Commercial Road,Paddock Wood,Tonbridge,,,TN12 6EN,Tel: 01892 838608, - ,,,No ratings yet Rate it yourself - /Services/opticians/LeaveReview/DefaultView.aspx?id=OP_5L2_12575__000001_TN126EN,0,0,
Day Lewis Opticians (Edenbridge),OP_5FF_4744__000002_TN85AJ,OPT,56 High Street,,Kent,Edenbridge,,TN8 5AJ,Tel: 01732 862366, - ,,,1 rating Rate it yourself - /Services/opticians/LeaveReview/DefaultView.aspx?id=OP_5FF_4744__000002_TN85AJ,,,
Day Lewis Opticians (Riverhead),OP_5FF_8001__000001_TN132BH,OPT,1 London Road,,Sevenoaks,Riverhead,,TN13 2BH,Tel: 01732 451039, - ,,,No ratings yet Rate it yourself - /Services/opticians/LeaveReview/DefaultView.aspx?id=OP_5FF_8001__000001_TN132BH,0,0,
Borough Green Opticians,OP_5FF_10481__000002_TN158BT,OPT,25 High Street,Borough Green,Sevenoaks,Kent,,TN15 8BT,Tel: 01732 884558, - ,,,1 rating Rate it yourself - /Services/opticians/LeaveReview/DefaultView.aspx?id=OP_5FF_10481__000002_TN158BT,,,
Specsavers Opticians,Q1V1O,OPT,,9A High Street,Crowborough,East Sussex,,TN6 2QA,Tel: 01892 362091, - ,,,No ratings yet Rate it yourself - /Services/opticians/LeaveReview/DefaultView.aspx?id=Q1V1O,0,0,
Vision Express,OP_5LT_9107__000001_TN61DA,OPT,The Broadway,,Crowborough,East Sussex,,TN6 1DA,Tel: 01892 661487, - ,,,No ratings yet Rate it yourself - /Services/opticians/LeaveReview/DefaultView.aspx?id=OP_5LT_9107__000001_TN61DA,0,0,
Arthur Hayes Opticians,OP_5LT_2866__000001_TN61DR,OPT,Campbell House,Croft Road,,Crowborough,,TN6 1DR,Tel: 01892 664826, - ,,,1 rating Rate it yourself - /Services/opticians/LeaveReview/DefaultView.aspx?id=OP_5LT_2866__000001_TN61DR,,,
Westerham Eye Care,TN16 1RF,OPT,,18 High Street,,Westerham,,TN16 1RF,Tel: 01959447611, - ,,,1 rating Rate it yourself - /Services/opticians/LeaveReview/DefaultView.aspx?id=TN16 1RF,,,
Wadhurst Opticians,OP_5LT_12442__000001_TN56AA,OPT,The Old Bakery,High Street,Wadhurst,East Sussex,,TN5 6AA,Tel: 01892 782674, - ,,,No ratings yet Rate it yourself - /Services/opticians/LeaveReview/DefaultView.aspx?id=OP_5LT_12442__000001_TN56AA,0,0,
Kings Hill Opticians,00325__000001_ME194AU,OPT,Liberty Square,,West Malling,Kent,,ME19 4AU,Tel: 01732 875544, - ,,,17 ratings Rate it yourself - /Services/opticians/LeaveReview/DefaultView.aspx?id=00325__000001_ME194AU,,,
West Malling Opticians ,OP_5L2_7653__000001_ME196QR,OPT,32 High Street,,Kent,West Malling,,ME19 6QR,Tel: 01732 841403, - ,,,No ratings yet Rate it yourself - /Services/opticians/LeaveReview/DefaultView.aspx?id=OP_5L2_7653__000001_ME196QR,0,0,
Lawrence Martin Opticians,OP_5KQ_4117__000001_RH76BW,OPT,14 East Grinstead Road,,,Lingfield,Surrey,RH7 6EP,Tel: 01342 833104, - ,,,No ratings yet Rate it yourself - /Services/opticians/LeaveReview/DefaultView.aspx?id=OP_5KQ_4117__000001_RH76BW,0,0,
Portobello Eyecare Ltd,K8A7B,OPT,,"3 Portobello Parade, Fawkham Road",,"West Kingsdown, Kent",,TN15 6JP,, - ,,,1 rating Rate it yourself - /Services/opticians/LeaveReview/DefaultView.aspx?id=K8A7B,,,
Specsavers Opticians,SS001__000002_RH191AB,OPT,74 - 76 London Road,,East Grinstead,West Sussex,,RH19 1AB,Tel: 01342 335360, - ,,,No ratings yet Rate it yourself - /Services/opticians/LeaveReview/DefaultView.aspx?id=SS001__000002_RH191AB,0,0,
Alexander Opticians,OP_5FK_7452__000002_RH191EQ,OPT,97 London Road,,East Grinstead,West Sussex,,RH19 1EQ,Tel: 01342 323115, - ,,,No ratings yet Rate it yourself - /Services/opticians/LeaveReview/DefaultView.aspx?id=OP_5FK_7452__000002_RH191EQ,0,0,
Scrivens Opticians,OP_5FK_12754__000001_RH191EQ,OPT,71 London Road,,,East Grinstead,West Sussex,RH19 1EQ,Tel: 01342 321657, - ,,,No ratings yet Rate it yourself - /Services/opticians/LeaveReview/DefaultView.aspx?id=OP_5FK_12754__000001_RH191EQ,0,0,
Boots-East Grinstead,OP_5FK_9105__000001_RH194DW,OPT,"Unit K, Queenswalk Shopping Centre",,,East Grinstead,Sussex,RH19 4DW,Tel: 01342 300708, - ,,,No ratings yet Rate it yourself - /Services/opticians/LeaveReview/DefaultView.aspx?id=OP_5FK_9105__000001_RH194DW,0,0,
Specsavers Opticians (Oxted),OPT_RH80BD_1,OPT,,25 Station Road East,,Oxted,Surrey,RH8 0BD,Tel: 01883 772288, - ,,,1 rating Rate it yourself - /Services/opticians/LeaveReview/DefaultView.aspx?id=OPT_RH80BD_1,,,
Jonathan Kerr Optometrists,TP454,OPT,80 Station Road East,80 Station Road East,Oxted,Surrey,,RH8 0PG,Tel: 01883 722 808, - ,,,No ratings yet Rate it yourself - /Services/opticians/LeaveReview/DefaultView.aspx?id=TP454,0,0,
Thakar Opticians,OP_5KQ_14541__000001_RH80AX,OPT,,81 Station Road East,,Oxted,Surrey,RH8 0AX,Tel: 01883 714 696, - ,,,No ratings yet Rate it yourself - /Services/opticians/LeaveReview/DefaultView.aspx?id=OP_5KQ_14541__000001_RH80AX,0,0,
Batemans (Opticians) Ltd,OP_5KQ_10850__000001_RH80QE,OPT,,149 Station Road East,,Oxted,Surrey,RH8 0QE,Tel: 01883 715 510, - ,,,No ratings yet Rate it yourself - /Services/opticians/LeaveReview/DefaultView.aspx?id=OP_5KQ_10850__000001_RH80QE,0,0,
Kent Eye Care Ltd,NKCCKNCK,OPT,Kent Eye Care Independent Specialist Optometrists & Opticians,786 London Road,,"Larkfield, Aylesford",Kent,ME20 6BE,Tel: 01732 873378, - ,,,1 rating Rate it yourself - /Services/opticians/LeaveReview/DefaultView.aspx?id=NKCCKNCK,,,no
Specology Limited,OP_TN163BA_29288,OPT,,"Unit 9, 160-166 Main Road",,"Biggin Hill, Kent",,TN16 3BA,Tel: 01959 928001, - ,,,No ratings yet Rate it yourself - /Services/opticians/LeaveReview/DefaultView.aspx?id=OP_TN163BA_29288,0,0,
Day Lewis Opticians,OP_5A7_1378__000001_TN163AY,OPT,116 Main Road,Biggin Hill,Westerham,,,TN16 3AY,Tel: 01959 572535, - ,,,No ratings yet Rate it yourself - /Services/opticians/LeaveReview/DefaultView.aspx?id=OP_5A7_1378__000001_TN163AY,0,0,
Tesco Optician (Lunsford Park),ME206RJ060716,OPT,,Lunsford Park,,Larkfield,,ME20 6RJ,Tel: 0345 601 3479, - ,,,No ratings yet Rate it yourself - /Services/opticians/LeaveReview/DefaultView.aspx?id=ME206RJ060716,0,0,
Specsavers Opticians,OPT_ME207NA_2,OPT,,Sainsburys Supermarket,"Quarry Wood, Mills road",Aylesford,Kent,ME20 7NA,Tel: 01622 797200, - ,,,No ratings yet Rate it yourself - /Services/opticians/LeaveReview/DefaultView.aspx?id=OPT_ME207NA_2,0,0,
Eye 2 Eye,OP_5L2_11435__000002_ME160PU,OPT,Mid Kent Shopping Centre,Castle Road,Allington,Maidstone,Kent,ME16 0PU,Tel: 01622 672563, - ,,,4 ratings Rate it yourself - /Services/opticians/LeaveReview/DefaultView.aspx?id=OP_5L2_11435__000002_ME160PU,,,yes
Buchanan Optometrists,OP_5L2_663__000001_ME65AG,OPT,Buchanan House,56 Malling Road,,Snodland,Kent,ME6 5NB,Tel: 01634 757227, - ,,,20 ratings Rate it yourself - /Services/opticians/LeaveReview/DefaultView.aspx?id=OP_5L2_663__000001_ME65AG,,,yes
The Village Optician,OPT_ME65NJ_1,OPT,,4 Holborough Road,,Snodland,,ME6 5NJ,Tel: 01634 240090, - ,,,No ratings yet Rate it yourself - /Services/opticians/LeaveReview/DefaultView.aspx?id=OPT_ME65NJ_1,0,0,
Peter Jones Opticians,OP_5L2_2643__000001_TN120AY,OPT,5 Church Hill,Staplehurst,Tonbridge,,,TN12 0AX,Tel: 01580 892269, - ,,,No ratings yet Rate it yourself - /Services/opticians/LeaveReview/DefaultView.aspx?id=OP_5L2_2643__000001_TN120AY,0,0,
Tinsons ,OP_5L2_760__000001_ME141TG,OPT,9 Middle Row,,Kent,Maidstone,,ME14 1TG,Tel: 01622 686051, - ,,,No ratings yet Rate it yourself - /Services/opticians/LeaveReview/DefaultView.aspx?id=OP_5L2_760__000001_ME141TG,0,0,
Bayfields Opticians and Audiologists (Maidstone),I9V4Y,OPT,,6 Pudding Lane,,Maidstone,,ME14 1LN,Tel: 01622 758566, - ,,,No ratings yet Rate it yourself - /Services/opticians/LeaveReview/DefaultView.aspx?id=I9V4Y,0,0,
William J Wilkinson (Maidstone),OP_5L2_2043__000001_ME156JJ,OPT,50 Gabriels Hill,,Kent,Maidstone,,ME15 6JJ,Tel: 01622 677424, - ,,,No ratings yet Rate it yourself - /Services/opticians/LeaveReview/DefaultView.aspx?id=OP_5L2_2043__000001_ME156JJ,0,0,
Specsavers (Maidstone),OPT_ME141QS_1,OPT,,21-25 Week Street,,Maidstone,Kent,ME14 1QS,Tel: 01622 663111, - ,,,No ratings yet Rate it yourself - /Services/opticians/LeaveReview/DefaultView.aspx?id=OPT_ME141QS_1,0,0,
Vision Express (Maidstone),OP_5L2_6952__000001_ME156AS,OPT,346-348 Dukes Walk,Chequers Centre,Maidstone,Kent,,ME15 6AS,Tel: 01622 678123, - ,,,No ratings yet Rate it yourself - /Services/opticians/LeaveReview/DefaultView.aspx?id=OP_5L2_6952__000001_ME156AS,0,0,
Boots-Maidstone - King St,OP_5L2_195__000002_ME141BW,OPT,56-62 King Street,,Kent,Maidstone,,ME14 1BW,Tel: 01622 762337, - ,,,No ratings yet Rate it yourself - /Services/opticians/LeaveReview/DefaultView.aspx?id=OP_5L2_195__000002_ME141BW,0,0,
The Hammond Optical Practice,OP_5L2_6686__000001_TN173RB,OPT,,High Street,,Cranbrook,Kent,TN17 3RB,Tel: 01580 715008, - ,,,No ratings yet Rate it yourself - /Services/opticians/LeaveReview/DefaultView.aspx?id=OP_5L2_6686__000001_TN173RB,0,0,
Peter Jones Opticians,OP_5L2_1737__000001_TN173HE,OPT,25 Stone Street,Cranbrook,Kent,,,TN17 3HE,Tel: 01580 712254, - ,,,1 rating Rate it yourself - /Services/opticians/LeaveReview/DefaultView.aspx?id=OP_5L2_1737__000001_TN173HE,,,
Pople & Broad Opticians,OP_5P7_13327__000002_TN218JB,OPT,50 High Street,,Heathfield,East Sussex,,TN21 8JB,Tel: 01435 863232, - ,,,No ratings yet Rate it yourself - /Services/opticians/LeaveReview/DefaultView.aspx?id=OP_5P7_13327__000002_TN218JB,0,0,
Tesco Opticians,5A7:15__000002_BR60NH,OPT,9 Augustus Lane,Orpington,Orpington,Kent,,BR6 0NH,, - ,,,No ratings yet Rate it yourself - /Services/opticians/LeaveReview/DefaultView.aspx?id=5A7:15__000002_BR60NH,0,0,
William J Wilkinson Limited,OP_5A7_470__000001_BR60PD,OPT,277 High Street,,Orpington,,,BR6 0NW,Tel: 01689 820866, - ,,,No ratings yet Rate it yourself - /Services/opticians/LeaveReview/DefaultView.aspx?id=OP_5A7_470__000001_BR60PD,0,0,
Boots-Orpington - High St,OP_5A7_10401__000002_BR60LS,OPT,232 High Street,,,Orpington,Kent,BR6 0LS,Tel: 01689 820 848, - ,,,No ratings yet Rate it yourself - /Services/opticians/LeaveReview/DefaultView.aspx?id=OP_5A7_10401__000002_BR60LS,0,0,
Specsavers Opticians,BR6 0TW__000001_BR60TW,OPT,,175 High Street,,Orpington,Kent,BR6 0LW,Tel: 01689 890 168, - ,,,No ratings yet Rate it yourself - /Services/opticians/LeaveReview/DefaultView.aspx?id=BR6 0TW__000001_BR60TW,0,0,
Boots Opticians ,OP_5A7_6080__000002_BR60JN,OPT,194 High Street,,Orpington,,,BR6 0JN,Tel: 01689 891303, - ,,,No ratings yet Rate it yourself - /Services/opticians/LeaveReview/DefaultView.aspx?id=OP_5A7_6080__000002_BR60JN,0,0,
Lambrou Eye Studio,OP_5A7_5488__000002_BR68NN,OPT,350 Crofton Road,,Orpington,Bromley,,BR6 8NN,Tel: 01689 850 593, - ,,,2 ratings Rate it yourself - /Services/opticians/LeaveReview/DefaultView.aspx?id=OP_5A7_5488__000002_BR68NN,,,
Robert Murrell incorporating Armstrong and North,W4X1M,OPT,,17 Swanley Centre,,Swanley,Kent,BR8 7TG,Tel: 01322 663231, - ,,,No ratings yet Rate it yourself - /Services/opticians/LeaveReview/DefaultView.aspx?id=W4X1M,0,0,
Rowland Opticians,OP_5CM_2066__000002_DA37QA,OPT,,79 Station Road,Kent,Longfield,,DA3 7QA,Tel: 01474 702125, - ,,,No ratings yet Rate it yourself - /Services/opticians/LeaveReview/DefaultView.aspx?id=OP_5CM_2066__000002_DA37QA,0,0,
Specsavers Opticians Swanley,OPT_BR87TQ_1,OPT,,Unit 39 The Shopping Centre,,Swanley,Kent,BR8 7TQ,Tel: 01322 614827, - ,,,1 rating Rate it yourself - /Services/opticians/LeaveReview/DefaultView.aspx?id=OPT_BR87TQ_1,,,
Asda Opticians (Swanley),OPT_BR8 7UN,OPT,,London Road,,Swanley,,BR8 7UN,Tel: 01322 661963, - ,,,3 ratings Rate it yourself - /Services/opticians/LeaveReview/DefaultView.aspx?id=OPT_BR8 7UN,,,
Linda Pope Optician,OPT_TN184EY_1,OPT,,"Venture House, Rye Road",,Hawkhurst,Kent,TN18 4EY,Tel: 01580 753744, - ,,,No ratings yet Rate it yourself - /Services/opticians/LeaveReview/DefaultView.aspx?id=OPT_TN184EY_1,0,0,
Specsavers Opticians,00000831__000003_CR36RT,OPT,,10 Church Walk Shopping Centre,,Caterham,Surrey,CR3 6RT,Tel: 01883 333 830, - ,,,No ratings yet Rate it yourself - /Services/opticians/LeaveReview/DefaultView.aspx?id=00000831__000003_CR36RT,0,0,
Boots-Caterham,CR3 6LB_18273,OPT,,15-17 Station Avenue,,Caterham,Surrey,CR3 6LB,Tel: 01883 337645, - ,,,No ratings yet Rate it yourself - /Services/opticians/LeaveReview/DefaultView.aspx?id=CR3 6LB_18273,0,0,
Boots Opticians (Caterham),OPT_CR36LB_1,OPT,,15-17 Station Avenue,,Caterham,Surrey,CR3 6LB,Tel: 01883 337645, - ,,,2 ratings Rate it yourself - /Services/opticians/LeaveReview/DefaultView.aspx?id=OPT_CR36LB_1,,,
Rawling & Sons (Opticians) Ltd,OP_5KQ_12732__000001_CR36QB,OPT,2-4 Croydon Road,,,Caterham,Surrey,CR3 6QB,Tel: 01883 343370, - ,,,No ratings yet Rate it yourself - /Services/opticians/LeaveReview/DefaultView.aspx?id=OP_5KQ_12732__000001_CR36QB,0,0,
Vision Express (UK) Limited,BR5 3RP__000001_BR53RP,OPT,"Unit 9,",Nugent Shopping Park,Orpington,Kent,,BR5 3RP,Tel: 01689 875737, - ,,,No ratings yet Rate it yourself - /Services/opticians/LeaveReview/DefaultView.aspx?id=BR5 3RP__000001_BR53RP,0,0,
Real Eyes The Eye Clinic,OP_5K9_9387__000002_CR00JB,OPT,26 Central Parade,New Addington,,Croydon,,CR0 0JB,Tel: 01689 842152, - ,,,No ratings yet Rate it yourself - /Services/opticians/LeaveReview/DefaultView.aspx?id=OP_5K9_9387__000002_CR00JB,0,0,
Barracloughs the Opticians,OPT_TN221AP_1,OPT,,53 High Street,,Uckfield,,TN22 1AP,, - ,,,No ratings yet Rate it yourself - /Services/opticians/LeaveReview/DefaultView.aspx?id=OPT_TN221AP_1,0,0,
Specsavers Opticians,OP_5P7_17109__000002_TN221BJ,OPT,100 High Street,,,Uckfield,,TN22 1PX,Tel: 01825 746750, - ,,,No ratings yet Rate it yourself - /Services/opticians/LeaveReview/DefaultView.aspx?id=OP_5P7_17109__000002_TN221BJ,0,0,
Vision Express,OP_5LT_8800__000002_TN221AG,OPT,27 High Street,,Uckfield,,,TN22 1AG,Tel: 01825 767846, - ,,,No ratings yet Rate it yourself - /Services/opticians/LeaveReview/DefaultView.aspx?id=OP_5LT_8800__000002_TN221AG,0,0,
Boots-Petts Wood,BR5 1DE__000001_BR51DE,OPT,12 Chatsworth Parade,,,Petts Wood,Kent,BR5 1DF,Tel: 01689 823 250, - ,,,No ratings yet Rate it yourself - /Services/opticians/LeaveReview/DefaultView.aspx?id=BR5 1DE__000001_BR51DE,0,0,
Steven Harris Opticians,OP_5A7_831__000002_BR51NA,OPT,16 Station Square,Petts Wood,Orpington,Kent,,BR5 1NA,Tel: 01689 831726, - ,,,No ratings yet Rate it yourself - /Services/opticians/LeaveReview/DefaultView.aspx?id=OP_5A7_831__000002_BR51NA,0,0,
Boots-Hayes,BR2 7EH__000001_BR27EH,OPT,2 Station Buildings,Station Approach,Hayes,Kent,,BR2 7EN,Tel: 020 8462 5332, - ,,,No ratings yet Rate it yourself - /Services/opticians/LeaveReview/DefaultView.aspx?id=BR2 7EH__000001_BR27EH,0,0,
Vraitch Vision (Walderslade),OPT_ME59LR_1,OPT,,3-4 Thetford House,,Walderslade,,ME5 9LR,Tel: 01634 682595, - ,,,No ratings yet Rate it yourself - /Services/opticians/LeaveReview/DefaultView.aspx?id=OPT_ME59LR_1,0,0,
Headcorn Eye Centre,OPT_TN279NH_1,OPT,,25 High Street,,Headcorn,Kent,TN27 9NH,Tel: 01622 890044, - ,,,1 rating Rate it yourself - /Services/opticians/LeaveReview/DefaultView.aspx?id=OPT_TN279NH_1,,,
Basil H Bloom Optometrist,OP_5K9_2344__000002_CR28LH,OPT,121 Addington Road,,,South Croydon,,CR2 8LH,Tel: 020 8657 2000, - ,,,No ratings yet Rate it yourself - /Services/opticians/LeaveReview/DefaultView.aspx?id=OP_5K9_2344__000002_CR28LH,0,0,
Baileys Opticians,OP_5K9_7651__000002_CR29LA,OPT,1 Limpsfield Road,Sanderstead,,South Croydon,,CR2 9LA,Tel: 020 8657 3525, - ,,,No ratings yet Rate it yourself - /Services/opticians/LeaveReview/DefaultView.aspx?id=OP_5K9_7651__000002_CR29LA,0,0,
Specsavers Opticians,19223__000002_BR40NH,OPT,15 High Street,,West Wickham,Kent,,BR4 0LP,Tel: 020 8916 8280, - ,,,No ratings yet Rate it yourself - /Services/opticians/LeaveReview/DefaultView.aspx?id=19223__000002_BR40NH,0,0,
Boots-West Wickham,OP_5A7__000002_BR40PX,OPT,115 Station Road,,,West Wickham,Kent,BR4 0PX,Tel: 0208 777 2211, - ,,,1 rating Rate it yourself - /Services/opticians/LeaveReview/DefaultView.aspx?id=OP_5A7__000002_BR40PX,,,
Boots-Horley,OP_5KQ_5319__000002_RH67AY,OPT,,18/20 High Street,,Horley,Surrey,RH6 7AY,Tel: 01293 782 668, - ,,,1 rating Rate it yourself - /Services/opticians/LeaveReview/DefaultView.aspx?id=OP_5KQ_5319__000002_RH67AY,,,
Specsavers Opticians,TP8G1,OPT,,71 Victoria Road,,Horley,Surrey,RH6 7QH,Tel: 01293 783018, - ,,,No ratings yet Rate it yourself - /Services/opticians/LeaveReview/DefaultView.aspx?id=TP8G1,0,0,
J C Setton Opticians,OP_5A7_1927__000001_BR40NH,OPT,58 High Street,,West Wickham,,,BR4 0NH,Tel: 020 8777 1106, - ,,,No ratings yet Rate it yourself - /Services/opticians/LeaveReview/DefaultView.aspx?id=OP_5A7_1927__000001_BR40NH,0,0,
AK Bennett Opticians,OP_5A7_1909__000001_BR40LS,OPT,65 High Street,65 High Street,West Wickham,Bromley,Kent,BR4 0LS,Tel: 020 8777 1337, - ,,,1 rating Rate it yourself - /Services/opticians/LeaveReview/DefaultView.aspx?id=OP_5A7_1909__000001_BR40LS,,,
Eye Matrix Ltd,10007__000001_CR51HE,OPT,DOMICILIARY SERVICE ONLY,,,Old Coulsdon,Surrey,CR5 1HE,Tel: 0800 612 3144, - ,,,No ratings yet Rate it yourself - /Services/opticians/LeaveReview/DefaultView.aspx?id=10007__000001_CR51HE,0,0,
Boots-Bromley - The Glades,OP_5A7_7470__000001_BR11DD,OPT,40 The Glades,,,Bromley,Kent,BR1 2QG,Tel: 0208 460 4944, - ,,,5 ratings Rate it yourself - /Services/opticians/LeaveReview/DefaultView.aspx?id=OP_5A7_7470__000001_BR11DD,,,
Oakmead Opticians,02991__000002_BR75LX,OPT,Sunnyways,Prince Imperial Way,Chislehurst,Kent,,BR7 5LX,, - ,,,1 rating Rate it yourself - /Services/opticians/LeaveReview/DefaultView.aspx?id=02991__000002_BR75LX,,,