Organisation Name,NACS Code,Organisation Type,Address1,Address2,Address3,Address4,Address5,PostCode,Telephone Number,Opening time,Value  (Opening time),Banding Classification  (Opening time),NHS.UK users rating,Value  (NHS.UK users rating),Banding Classification  (NHS.UK users rating),Car parking (Is there car parking at this organisation?)
Foster Opticians,OP_5A9_11007__000001_EN51AD,OPT,7 Western Parade,Great North Road,Barnet,Barnet,,EN5 1AD,Tel: 020 8440 0196, - ,,,No ratings yet Rate it yourself - /Services/opticians/LeaveReview/DefaultView.aspx?id=OP_5A9_11007__000001_EN51AD,0,0,
Vision Care,OP_5A9_2410__000002_EN48RQ,OPT,Visioncare Medical Eye Centre,94 East Barnet Rd,New Barnet,Herts,,EN4 8RQ,Tel: 020 8440 8986, - ,,,No ratings yet Rate it yourself - /Services/opticians/LeaveReview/DefaultView.aspx?id=OP_5A9_2410__000002_EN48RQ,0,0,
DF Optometrists At The Devans,OP_5A9_8256__000001_N209HR,OPT,1355 High Road,,London,Whetstone,,N20 9HR,Tel: 020 8445 3130, - ,,,1 rating Rate it yourself - /Services/opticians/LeaveReview/DefaultView.aspx?id=OP_5A9_8256__000001_N209HR,,,
I Opticians,OP 3293__000003_N209HJ,OPT,1352 High Road,Whetstone,London,,,N20 9HJ,Tel: 020 8446 3311, - ,,,No ratings yet Rate it yourself - /Services/opticians/LeaveReview/DefaultView.aspx?id=OP 3293__000003_N209HJ,0,0,
Boots-Whetstone,N20 9HS_18172,OPT,,1261-1275 High Road,,Whetstone,,N20 9HS,Tel: 0208 4463589, - ,,,5 ratings Rate it yourself - /Services/opticians/LeaveReview/DefaultView.aspx?id=N20 9HS_18172,,,
Gordon Thomas,OP_5A9_13671__000006_N209HS,OPT,1291 High Road,Whetstone,London,,,N20 9HS,Tel: 020 8445 1147, - ,,,No ratings yet Rate it yourself - /Services/opticians/LeaveReview/DefaultView.aspx?id=OP_5A9_13671__000006_N209HS,0,0,
Village Opticians,OP_5A9_13581__000001_EN48PQ,OPT,39 Church Hill Road,East Barnet,Hertfordshire,,,EN4 8SY,Tel: 020 8441 1163, - ,,,No ratings yet Rate it yourself - /Services/opticians/LeaveReview/DefaultView.aspx?id=OP_5A9_13581__000001_EN48PQ,0,0,
Central Park Eyecare,EN55SN190814,OPT,,88A High Street,,London,,EN5 5SN,Tel: 0208 440 9950, - ,,,No ratings yet Rate it yourself - /Services/opticians/LeaveReview/DefaultView.aspx?id=EN55SN190814,0,0,
Visual Eyes - Gary Swerner Opticians,OP_5A9_1688__000001_EN55SN,OPT,92 High Street,Barnet,Hertfordshire,,,EN5 5SN,Tel: 020 8441 1200, - ,,,No ratings yet Rate it yourself - /Services/opticians/LeaveReview/DefaultView.aspx?id=OP_5A9_1688__000001_EN55SN,0,0,
"Charrington, Cross, Liversidge & Partners",OP_5A9_8771__000001_EN48HG,OPT,5 Cat Hill,East Barnet,Hertfordshire,,,EN4 8HG,Tel: 020 8449 2814, - ,,,1 rating Rate it yourself - /Services/opticians/LeaveReview/DefaultView.aspx?id=OP_5A9_8771__000001_EN48HG,,,
Boots-Barnet,OP1691__000006_EN55UR,OPT,77 High Street,,Barnet,Herts,,EN5 5UR,Tel: 020 8275 1689, - ,,,1 rating Rate it yourself - /Services/opticians/LeaveReview/DefaultView.aspx?id=OP1691__000006_EN55UR,,,
Specsavers Opticians,OP_5A9_6986__000001_EN55XQ,OPT,104 High Street,Barnet,Hertfordshire,,,EN5 5XQ,Tel: 020 8364 8881, - ,,,No ratings yet Rate it yourself - /Services/opticians/LeaveReview/DefaultView.aspx?id=OP_5A9_6986__000001_EN55XQ,0,0,
Barnet Opticians,OP_5A9_4668__000002_EN55XP,OPT,172 High Street,,Barnet,,,EN5 5XP,Tel: 020 8440 0258, - ,,,No ratings yet Rate it yourself - /Services/opticians/LeaveReview/DefaultView.aspx?id=OP_5A9_4668__000002_EN55XP,0,0,
Vision Express Barnet,OP1690__000001_EN55UZ,OPT,103 - 105 High Street,,Barnet,Herts,,EN5 5UZ,Tel: 020 8440 6361, - ,,,No ratings yet Rate it yourself - /Services/opticians/LeaveReview/DefaultView.aspx?id=OP1690__000001_EN55UZ,0,0,
Specs Direct,OP_5A9_7932__000002_EN55SA,OPT,129 High Street,High Barnet,Barnet,Herts,Hertfordshire,EN5 5UZ,Tel: 020 8449 1993, - ,,,No ratings yet Rate it yourself - /Services/opticians/LeaveReview/DefaultView.aspx?id=OP_5A9_7932__000002_EN55SA,0,0,
Avista Eyecare,291220160909,OPT,,117 Cockfosters Road,,Barnet,,EN4 0DA,, - ,,,1 rating Rate it yourself - /Services/opticians/LeaveReview/DefaultView.aspx?id=291220160909,,,
Dollond & Aitchison,OP_5C1_13551__000001_EN40DP,OPT,110 Cockfosters Road,,,Barnet,Hertfordshire,EN4 0DP,Tel: 0208 275 0800, - ,,,No ratings yet Rate it yourself - /Services/opticians/LeaveReview/DefaultView.aspx?id=OP_5C1_13551__000001_EN40DP,0,0,
Boots-Cockfosters,OP_EN40DP_29640,OPT,110 Cockfosters Road,,,Barnet,Hertfordshire,EN4 0DP,Tel: 02082750800, - ,,,No ratings yet Rate it yourself - /Services/opticians/LeaveReview/DefaultView.aspx?id=OP_EN40DP_29640,0,0,
Specsavers Opticians,5A9_OPT01__000002_N129QU,OPT,796 High Road,North Finchley,London,,,N12 9QU,Tel: 020 8492 9750, - ,,,2 ratings Rate it yourself - /Services/opticians/LeaveReview/DefaultView.aspx?id=5A9_OPT01__000002_N129QU,,,
Scrivens Opticians,OP_5A9_7641__000002_N128PR,OPT,752 High Road,North Finchley,London,London,,N12 9QG,Tel: 020 8445 5881, - ,,,No ratings yet Rate it yourself - /Services/opticians/LeaveReview/DefaultView.aspx?id=OP_5A9_7641__000002_N128PR,0,0,
Boots-North Finchley,OP_5A9_7229__000001_N129QD,OPT,734 High Road,,North Finchley,London,,N12 9QD,Tel: 0208 343 7721, - ,,,No ratings yet Rate it yourself - /Services/opticians/LeaveReview/DefaultView.aspx?id=OP_5A9_7229__000001_N129QD,0,0,
Socialeyes Optics Ltd,OP_5A9_13604__000001_N120EL,OPT,4 Nether Street,North Finchley,London,,,N12 0EL,Tel: 020 8445 9661, - ,,,No ratings yet Rate it yourself - /Services/opticians/LeaveReview/DefaultView.aspx?id=OP_5A9_13604__000001_N120EL,0,0,
Steven  P Salik Opticians,OP_5C1_13553__000001_EN40HX,OPT,1a Duchy Road    ,Hadley Wood,Hertfordshire ,,,EN4 0HX,Tel: 020 8440 5413, - ,,,No ratings yet Rate it yourself - /Services/opticians/LeaveReview/DefaultView.aspx?id=OP_5C1_13553__000001_EN40HX,0,0,
Optical Warehouse,OP_5C1_13668__000003_N145PH,OPT,68 Chase Side,Southgate,London,,,N14 5PH,Tel: 020 8882 2298, - ,,,No ratings yet Rate it yourself - /Services/opticians/LeaveReview/DefaultView.aspx?id=OP_5C1_13668__000003_N145PH,0,0,
Scrivens Opticians,OP_5C1_2978__000002_N145PH,OPT,104 Chase Side,Southgate,London,London,,N14 5PH,Tel: 020 8882 6381, - ,,,1 rating Rate it yourself - /Services/opticians/LeaveReview/DefaultView.aspx?id=OP_5C1_2978__000002_N145PH,,,
M Wallace Opticians,OP_5C1_5648__000002_N144XA,OPT,191 Bramley Road,Oakwood,London,,,N14 4XA,Tel: 020 8367 3538, - ,,,No ratings yet Rate it yourself - /Services/opticians/LeaveReview/DefaultView.aspx?id=OP_5C1_5648__000002_N144XA,0,0,
Optitech,OP_5C1_13550__000001_N145PA,OPT,,28 Chase Side,Southgate,London,,N14 5PA,Tel: 020 8886 7266, - ,,,8 ratings Rate it yourself - /Services/opticians/LeaveReview/DefaultView.aspx?id=OP_5C1_13550__000001_N145PA,,,
Krishna Vision,OP_5A9_13599__000001_N113EG,OPT,53 Friern Barnet Road,New Southgate,London,,,N11 3EG,Tel: 020 8368 0924, - ,,,No ratings yet Rate it yourself - /Services/opticians/LeaveReview/DefaultView.aspx?id=OP_5A9_13599__000001_N113EG,0,0,
Kingsley Opticians,OP_5A9_5525__000003_N31XP,OPT,71 Ballards Lane,Finchley,,London,,N3 1XT,Tel: 020 8346 9636, - ,,,No ratings yet Rate it yourself - /Services/opticians/LeaveReview/DefaultView.aspx?id=OP_5A9_5525__000003_N31XP,0,0,
Finchley Eyecare,OP_5A9_6337__000001_N32BU,OPT,90 Ballards Lane,Finchley,London,,,N3 2DL,Tel: 020 8343 0780, - ,,,No ratings yet Rate it yourself - /Services/opticians/LeaveReview/DefaultView.aspx?id=OP_5A9_6337__000001_N32BU,0,0,
Clive H. Rosen,OP_5C1_13552__000001_N147AL,OPT,152 Morton Way,Southgate,London,,,N14 7AL,Tel: 020 8886 9331, - ,,,No ratings yet Rate it yourself - /Services/opticians/LeaveReview/DefaultView.aspx?id=OP_5C1_13552__000001_N147AL,0,0,
Tesco Opticians,OP-5A9-13605__000001_N120SH,OPT,North Circular Road,North Finchley,,London,,N12 0SH,Tel: 0345 677 9171, - ,,,No ratings yet Rate it yourself - /Services/opticians/LeaveReview/DefaultView.aspx?id=OP-5A9-13605__000001_N120SH,0,0,
Olivier Opticians,OP_5C1_2658__000001_N111AA,OPT,355 Bowes Road,New Southgate,London,,,N11 1AA,Tel: 020 8368 5648, - ,,,No ratings yet Rate it yourself - /Services/opticians/LeaveReview/DefaultView.aspx?id=OP_5C1_2658__000001_N111AA,0,0,
Optikal,OP_5A9_689__000001_N32LJ,OPT,352 Regents Park Road,,London,,,N3 2LJ,Tel: 020 8371 0023, - ,,,No ratings yet Rate it yourself - /Services/opticians/LeaveReview/DefaultView.aspx?id=OP_5A9_689__000001_N32LJ,0,0,
Central Vision Optics Limited,OP-5A9-13606__000001_N31DP,OPT,327 Regents Park Road,Finchley,,London,,N3 1DP,Tel: 020 8343 1122, - ,,,No ratings yet Rate it yourself - /Services/opticians/LeaveReview/DefaultView.aspx?id=OP-5A9-13606__000001_N31DP,0,0,
Cannon Hill Clinic,OP_5A9_13673__000003_N147HD,OPT,16 Cannon Hill,Southgate,London,,,N14 7HD,Tel: 020 8882 2131, - ,,,1 rating Rate it yourself - /Services/opticians/LeaveReview/DefaultView.aspx?id=OP_5A9_13673__000003_N147HD,,,
Scrivens Opticians,OP_5A9_12214__000002_NW73DA,OPT,47 The Broadway,Mill Hill,London,London,,NW7 3DA,Tel: 020 8906 0626, - ,,,No ratings yet Rate it yourself - /Services/opticians/LeaveReview/DefaultView.aspx?id=OP_5A9_12214__000002_NW73DA,0,0,
Boots-Mill Hill,OP_5A9_7236__000001_NW73LL,OPT,14 The Broadway,,Mill Hill,London,,NW7 3LL,Tel: 0208 201 1817, - ,,,No ratings yet Rate it yourself - /Services/opticians/LeaveReview/DefaultView.aspx?id=OP_5A9_7236__000001_NW73LL,0,0,
A. A. Baker Optometrists,OP_5C1_13559__000001_N112JA,OPT,157 Bowes Road,New Southgate,,London,,N11 2JA,Tel: 020 8889 1081, - ,,,1 rating Rate it yourself - /Services/opticians/LeaveReview/DefaultView.aspx?id=OP_5C1_13559__000001_N112JA,,,
Judith Stechler,OP_5A9_13614__000001_N33DS,OPT,13 Chessington Avenue,Finchley,London,,,N3 3DS,Tel: 020 8346 5600, - ,,,No ratings yet Rate it yourself - /Services/opticians/LeaveReview/DefaultView.aspx?id=OP_5A9_13614__000001_N33DS,0,0,
Eye Deal Eyes Opticians,OP_5CP_12057__000001_EN65AP,OPT,2 Kemble Parade,High Street,Potters Bar,,,EN6 5AP,Tel: 01707 660808, - ,,,No ratings yet Rate it yourself - /Services/opticians/LeaveReview/DefaultView.aspx?id=OP_5CP_12057__000001_EN65AP,0,0,
David Hillel,HILLEL123,OPT,,119 High Road,East Finchley,London,,N2 8AG,Tel: 020 8444 2233, - ,,,2 ratings Rate it yourself - /Services/opticians/LeaveReview/DefaultView.aspx?id=HILLEL123,,,
Stewart Duncan,OP_5A9_4396__000002_N29ED,OPT,126 High Road,East Finchley,London,London,,N2 9ED,Tel: 020 8883 2020, - ,,,2 ratings Rate it yourself - /Services/opticians/LeaveReview/DefaultView.aspx?id=OP_5A9_4396__000002_N29ED,,,
Tesco Opticians,WD6 1JG,OPT,,Shenley Road,,Borehamwood,,WD6 1JG,Tel: 0345 601 3479, - ,,,No ratings yet Rate it yourself - /Services/opticians/LeaveReview/DefaultView.aspx?id=WD6 1JG,0,0,
Harley Bain Opticians Ltd,OP_5C1_13667__000001_N134TY,OPT,331 Green Lanes,Palmers Green,London,,,N13 4TY,Tel: 020 8882 6266, - ,,,No ratings yet Rate it yourself - /Services/opticians/LeaveReview/DefaultView.aspx?id=OP_5C1_13667__000001_N134TY,0,0,
Specsavers,F85A0604__000001_N134JG,OPT,359 Green Lanes,Palmers Green,,London,,N13 4JG,Tel: 020 8920 3150, - ,,,No ratings yet Rate it yourself - /Services/opticians/LeaveReview/DefaultView.aspx?id=F85A0604__000001_N134JG,0,0,
Eye Care Centre,OP_5CP_10176__000002_EN62HW,OPT,46 The Broadway,Darkes Lane,Potters Bar,,,EN6 2HW,Tel: 01707 650064, - ,,,No ratings yet Rate it yourself - /Services/opticians/LeaveReview/DefaultView.aspx?id=OP_5CP_10176__000002_EN62HW,0,0,
Scrivens Opticians,OP_5C1_4544__000001_N135TW,OPT,,328 - 330 Green Lanes,Palmers Green,London,,N13 5TW,Tel: 020 8886 9092, - ,,,No ratings yet Rate it yourself - /Services/opticians/LeaveReview/DefaultView.aspx?id=OP_5C1_4544__000001_N135TW,0,0,
Panoptica,OP_5A9_10056__000001_N29PN,OPT,56 High Road,East Finchley,London,,,N2 9PN,Tel: 020 8883 6693, - ,,,No ratings yet Rate it yourself - /Services/opticians/LeaveReview/DefaultView.aspx?id=OP_5A9_10056__000001_N29PN,0,0,
H. R. Breakspear,OP_5C9_1310__000001_N101BX,OPT,343 Muswell Hill Broadway,Muswell Hill,London,,,N10 1BX,Tel: 020 8883 2183, - ,,,2 ratings Rate it yourself - /Services/opticians/LeaveReview/DefaultView.aspx?id=OP_5C9_1310__000001_N101BX,,,
Boots-Borehamwood,OP_5CP_9725__000001_WD61AW,OPT,181 Shenley Road,,,Borehamwood,Hertfordshire,WD6 1AW,Tel: 0208 953 3120, - ,,,1 rating Rate it yourself - /Services/opticians/LeaveReview/DefaultView.aspx?id=OP_5CP_9725__000001_WD61AW,,,
Boots-London - Muswell Hill,OP_5C9_2574__000001_N101BS,OPT,450 Muswell Hill Broadway,,,London,,N10 1BS,Tel: 0208 883 1216, - ,,,2 ratings Rate it yourself - /Services/opticians/LeaveReview/DefaultView.aspx?id=OP_5C9_2574__000001_N101BS,,,
Davidson Opticians,OP_5CP_12574__000001_EN61AE,OPT,106 Darkes Lane,,Potters Bar,,,EN6 1AE,Tel: 01707 642255, - ,,,No ratings yet Rate it yourself - /Services/opticians/LeaveReview/DefaultView.aspx?id=OP_5CP_12574__000001_EN61AE,0,0,
Alexander Kobrin Optometrists ,OP_5CP_10088__000001_EN61BW,OPT,177 Darkes Lane,,Potters Bar,,,EN6 1BW,Tel: 01707 652322, - ,,,No ratings yet Rate it yourself - /Services/opticians/LeaveReview/DefaultView.aspx?id=OP_5CP_10088__000001_EN61BW,0,0,
Simon Gavzey,OP_5A9_13594__000001_HA89TP,OPT,Gavzey Opticians,48 The Market Place,,Hampstead Garden Suburb,,NW11 6JP,Tel: 020 8731 9999, - ,,,No ratings yet Rate it yourself - /Services/opticians/LeaveReview/DefaultView.aspx?id=OP_5A9_13594__000001_HA89TP,0,0,
Insight Opticians,OP_5CP_2153__000002_WD61AH,OPT,167 Shenley Road,Borehamwood,Hertfordshire,,,WD6 1AH,Tel: 020 8207 1074, - ,,,1 rating Rate it yourself - /Services/opticians/LeaveReview/DefaultView.aspx?id=OP_5CP_2153__000002_WD61AH,,,
Ethics Eye Care Ltd,OP_5C1_3409__000002_N134TD,OPT,93 Green Lanes,Palmers Green,London,,,N13 4TD,Tel: 020 8889 1410, - ,,,1 rating Rate it yourself - /Services/opticians/LeaveReview/DefaultView.aspx?id=OP_5C1_3409__000002_N134TD,,,
Specsavers Opticians,C/OL2438-5C9__000003_N101DJ,OPT,404 Muswell Hill Broadway,Muswell Hill,London,,,N10 1DJ,, - ,,,No ratings yet Rate it yourself - /Services/opticians/LeaveReview/DefaultView.aspx?id=C/OL2438-5C9__000003_N101DJ,0,0,
Boots-Potters Bar,OP_5GG_10701__000001_AL97QT,OPT,144-146 Darkes Lane,,,Potters Bar,Hertfordshire,EN6 1AF,Tel: 01707 664321, - ,,,No ratings yet Rate it yourself - /Services/opticians/LeaveReview/DefaultView.aspx?id=OP_5GG_10701__000001_AL97QT,0,0,
Robert Linsky,F4Y3L,OPT,,11 Fortis Green Road,,"Muswell Hill, London",Greater London,N10 3HP,Tel: 0208 8836879, - ,,,No ratings yet Rate it yourself - /Services/opticians/LeaveReview/DefaultView.aspx?id=F4Y3L,0,0,
Robert Linsky Optometrists Ltd,OP_5C9_4689__000001_N103HP,OPT,11 Fortis Green Road,Muswell Hill,London,London,,N10 3HP,Tel: 020 8883 6879, - ,,,5 ratings Rate it yourself - /Services/opticians/LeaveReview/DefaultView.aspx?id=OP_5C9_4689__000001_N103HP,,,
S. N. Trivedi,OP_5C9_8880__000001_N224JD,OPT,Cleveden House,455 High Road,London,,,N22 8JD,Tel: 020 8889 0818, - ,,,No ratings yet Rate it yourself - /Services/opticians/LeaveReview/DefaultView.aspx?id=OP_5C9_8880__000001_N224JD,0,0,
Melissa Conway Ltd,OP_5A9_1485__000002_NW110AA,OPT,1193 Finchley Road,,London,,,NW11 0AA,Tel: 020 8201 9292, - ,,,1 rating Rate it yourself - /Services/opticians/LeaveReview/DefaultView.aspx?id=OP_5A9_1485__000002_NW110AA,,,
Observatory - The Opticians,OP_5C9_1741__000001_N103RT,OPT,64 Muswell Hill Broadway,Muswell Hill,,London,,N10 3RT,Tel: 020 8444 0143, - ,,,No ratings yet Rate it yourself - /Services/opticians/LeaveReview/DefaultView.aspx?id=OP_5C9_1741__000001_N103RT,0,0,
R. R. Weiniger,OP_5A9_13670__000001_NW110JB,OPT,69 Cranbourne Gardens,London,,,,NW11 0JB,Tel: 020 8455 1893, - ,,,No ratings yet Rate it yourself - /Services/opticians/LeaveReview/DefaultView.aspx?id=OP_5A9_13670__000001_NW110JB,0,0,
Anthony Weyman,OP_5C1_13549__000001_EN27AF,OPT,71 Windmill Hill,Enfield,,London,Greater London,EN2 7AF,Tel: 020 8363 0939, - ,,,No ratings yet Rate it yourself - /Services/opticians/LeaveReview/DefaultView.aspx?id=OP_5C1_13549__000001_EN27AF,0,0,
Hendon Opticians & Contact Lens Centre,0206141422,OPT,"Hendon Opticians, Hendon",127 Brent Street,,Hendon,,NW4 2DX,Tel: 02082025555, - ,,,3 ratings Rate it yourself - /Services/opticians/LeaveReview/DefaultView.aspx?id=0206141422,,,
EYELEVEL OPTOMETRISTS,OP 1689__000002_NW110QS,OPT,24 Temple Fortune Parade,Finchley Road,London,,,NW11 0QS,Tel: 020 8209 1231, - ,,,1 rating Rate it yourself - /Services/opticians/LeaveReview/DefaultView.aspx?id=OP 1689__000002_NW110QS,,,
Kusoom Vadgama,OP_5A9_13668__000001_NW116XL,OPT,808 Finchley Road,Temple Fortune,London,,,NW11 6XL,Tel: 020 8458 3802, - ,,,No ratings yet Rate it yourself - /Services/opticians/LeaveReview/DefaultView.aspx?id=OP_5A9_13668__000001_NW116XL,0,0,
Home Opti-Care Ltd,OP_5PX_0000__000001_NW42QH,OPT,64 Danescroft,Brent Street,Hendon,London,,NW4 2QH,Tel: 0208 202 1364, - ,,,No ratings yet Rate it yourself - /Services/opticians/LeaveReview/DefaultView.aspx?id=OP_5PX_0000__000001_NW42QH,0,0,
Susan Leighter,OP_5A9_13664__000001_HA88JE,OPT,41 Fairview Way,Edgware,Middlesex,,,HA8 8JE,Tel: 020 8958 2211, - ,,,No ratings yet Rate it yourself - /Services/opticians/LeaveReview/DefaultView.aspx?id=OP_5A9_13664__000001_HA88JE,0,0,
Vision Express (uk) Ltd,VISION EXPRESS (UK) LTD_HA8 7BD,OPT,,"Unit 6b, Broadwalk Shopping Centre",,"Edgware, Middlesex,",,HA8 7BD,, - ,,,No ratings yet Rate it yourself - /Services/opticians/LeaveReview/DefaultView.aspx?id=VISION EXPRESS (UK) LTD_HA8 7BD,0,0,
Specsavers Opticians,OP_5A9_13676__000004_HA87BD,OPT,3 Broadwalk Shopping Centre,Station Road,Edgware,,,HA8 7BD,Tel: 020 8952 2262, - ,,,No ratings yet Rate it yourself - /Services/opticians/LeaveReview/DefaultView.aspx?id=OP_5A9_13676__000004_HA87BD,0,0,
 Gordon Thomas Good Looking Optics,OP_5C1_11296__000001_EN26AJ,OPT,43 Church Street,Enfield,,Middx,,EN2 6AJ,Tel: 020 83644444, - ,,,No ratings yet Rate it yourself - /Services/opticians/LeaveReview/DefaultView.aspx?id=OP_5C1_11296__000001_EN26AJ,0,0,
Home Eyecare Limited,OP_EN191PH_34835,OPT,Falcon House,40 Green Lane,,Edgware,Middlesex,HA8 7PT,Tel: 0208 5906666, - ,,,No ratings yet Rate it yourself - /Services/opticians/LeaveReview/DefaultView.aspx?id=OP_EN191PH_34835,0,0,
Vaid Optometrists,OP_5A9_10905__000001_HA87AA,OPT,132 Station Road,Edgware,Middlesex,,,HA8 7AA,Tel: 020 8381 2641, - ,,,No ratings yet Rate it yourself - /Services/opticians/LeaveReview/DefaultView.aspx?id=OP_5A9_10905__000001_HA87AA,0,0,
Specsavers Opticians,OP_5C1_3935__000001_EN26AF,OPT,25 Church Street,Enfield,London,Middx,,EN2 6AF,Tel: 020 8366 1030, - ,,,No ratings yet Rate it yourself - /Services/opticians/LeaveReview/DefaultView.aspx?id=OP_5C1_3935__000001_EN26AF,0,0,
Scrivens Opticians,OP_5C1_6830__000001_EN26BA,OPT,,33. Palace Garden Shopping Centre,Enfield,Middlesex,,EN2 6SN,Tel: 020 8367 0500, - ,,,No ratings yet Rate it yourself - /Services/opticians/LeaveReview/DefaultView.aspx?id=OP_5C1_6830__000001_EN26BA,0,0,
Vision Express (UK) Ltd,OP_5C1_9971__000001_EN26AB,OPT,,28 Palace Gardens Centre,,Enfield,,EN2 6SN,Tel: 020 8363 6225, - ,,,No ratings yet Rate it yourself - /Services/opticians/LeaveReview/DefaultView.aspx?id=OP_5C1_9971__000001_EN26AB,0,0,
Central Opticians,OP_5A9_13606__000001_NW43UT,OPT,11 Vivian Avenue,Hendon,,London,,NW4 3UT,Tel: 0208 202 5165, - ,,,No ratings yet Rate it yourself - /Services/opticians/LeaveReview/DefaultView.aspx?id=OP_5A9_13606__000001_NW43UT,0,0,
A.I. Jones Ltd,OP_5A9_13578__000001_HA80BB,OPT,132 Burnt Oak Broadway,,,Edgware,Middlesex,HA8 0BB,Tel: 020 8952 1102, - ,,,1 rating Rate it yourself - /Services/opticians/LeaveReview/DefaultView.aspx?id=OP_5A9_13578__000001_HA80BB,,,
Simon Hoff,OP_5A9_13613__000001_NW119NN,OPT,18 Russell Parade,Golders Green Road,London,,,NW11 9NN,Tel: 020 8458 9992, - ,,,No ratings yet Rate it yourself - /Services/opticians/LeaveReview/DefaultView.aspx?id=OP_5A9_13613__000001_NW119NN,0,0,
Oak Optometrists,OP_5K6_14957__000002_HA85EP,OPT,61 Burnt Oak Broadway,Edgware,Middlesex,,,HA8 5EP,Tel: 020 8951 4004, - ,,,No ratings yet Rate it yourself - /Services/opticians/LeaveReview/DefaultView.aspx?id=OP_5K6_14957__000002_HA85EP,0,0,
Boots-Colindale,OP_5A9_13592__000001_NW96LE,OPT,The Hyde,Edgware Road,,Colindale,,NW9 5EB,Tel: 0208 205 9280, - ,,,2 ratings Rate it yourself - /Services/opticians/LeaveReview/DefaultView.aspx?id=OP_5A9_13592__000001_NW96LE,,,
Boots-Enfield,OP_5C1_13666__000003_EN26EB,OPT,18 London Road,,Enfield,London,,EN2 6EB,Tel: 0208 367 1066, - ,,,No ratings yet Rate it yourself - /Services/opticians/LeaveReview/DefaultView.aspx?id=OP_5C1_13666__000003_EN26EB,0,0,
Boots Opticians Ltd,OP_5C9_5693__000002_N226BA,OPT,137-139 High Road,,Wood Green,London,,N22 6BA,Tel: 0208 8818602, - ,,,1 rating Rate it yourself - /Services/opticians/LeaveReview/DefaultView.aspx?id=OP_5C9_5693__000002_N226BA,,,
Asda Opticians,OPT_NW9 0AS,OPT,,EDGEWARE ROAD,COLINDALE,HARROW,,NW9 0AS,Tel: 0208 358 2513, - ,,,No ratings yet Rate it yourself - /Services/opticians/LeaveReview/DefaultView.aspx?id=OPT_NW9 0AS,0,0,
Boots-Wood Green - High Rd,OP_5C9_5302__000001_N226EB,OPT,148 High Road,Wood Green,London,London,,N22 6EB,Tel: 0208 888 3361, - ,,,1 rating Rate it yourself - /Services/opticians/LeaveReview/DefaultView.aspx?id=OP_5C9_5302__000001_N226EB,,,
K. J. Davies Opticians,P6D1Q,OPT,12 Priory Road,12 Priory Road,London,"Hornsey, London",,N8 7RD,Tel: 020 8341 4545, - ,,,No ratings yet Rate it yourself - /Services/opticians/LeaveReview/DefaultView.aspx?id=P6D1Q,0,0,
Specsavers Opticians,OP_5C9_7140__000001_N226HE,OPT,88-96 High Road,Wood Green,London,,,N22 6YD,Tel: 020 8881 5000, - ,,,No ratings yet Rate it yourself - /Services/opticians/LeaveReview/DefaultView.aspx?id=OP_5C9_7140__000001_N226HE,0,0,
Optique 20:20,OP_5C9_6495__000001_N226YD,OPT,Unit 22,88-96 High Road,Wood Green,London,,N22 6HE,Tel: 020 8889 2020, - ,,,No ratings yet Rate it yourself - /Services/opticians/LeaveReview/DefaultView.aspx?id=OP_5C9_6495__000001_N226YD,0,0,
Euro Optica,OP_5A9_13678__000001_NW11,OPT,80 Golders Green,Golders Green,London,,,NW11 8LN,Tel: 020 8458 2888, - ,,,No ratings yet Rate it yourself - /Services/opticians/LeaveReview/DefaultView.aspx?id=OP_5A9_13678__000001_NW11,0,0,
Boots-Brent Cross,OP_5A9_6916__000003_NW43FB,OPT,Brent Cross Centre,,,Brent Cross,,NW4 3FB,Tel: 020 8202 7530, - ,,,2 ratings Rate it yourself - /Services/opticians/LeaveReview/DefaultView.aspx?id=OP_5A9_6916__000003_NW43FB,,,
Vision Express Ltd,OP_5A9_13669__000002_NW43FB,OPT,Brent Cross Shopping Centre,Prince Charles Drive,Hendon,,,NW4 3FB,Tel: 020 8202 6715, - ,,,No ratings yet Rate it yourself - /Services/opticians/LeaveReview/DefaultView.aspx?id=OP_5A9_13669__000002_NW43FB,0,0,
Ben Mirkin Ltd,OP_5A9_3502__000001_NW43FG,OPT,Unit V2 Brent Cross Shopping Centre,Prince Charles Drive,London,,,NW4 3FG,Tel: 020 8202 3771, - ,,,No ratings yet Rate it yourself - /Services/opticians/LeaveReview/DefaultView.aspx?id=OP_5A9_3502__000001_NW43FG,0,0,
Boots-Golders Green,OP_5A9_1698__000002_NW118EL,OPT,55 Golders Green Road,,Golders Green,London,,NW11 8EL,Tel: 0208 455 8418, - ,,,No ratings yet Rate it yourself - /Services/opticians/LeaveReview/DefaultView.aspx?id=OP_5A9_1698__000002_NW118EL,0,0,
SPECSAVERS OPTICIANS,OP-5A9-13607__000001_NW118EE,OPT,29 Golders Green Road,Golders Green,London,,,NW11 8EE,Tel: 020 8209 9840, - ,,,No ratings yet Rate it yourself - /Services/opticians/LeaveReview/DefaultView.aspx?id=OP-5A9-13607__000001_NW118EE,0,0,
Globe Opticians,OP_5A9_1689__000002_NW117RR,OPT,618 Finchley Road,,Golders Green,,,NW11 7RR,Tel: 0208 458 3035, - ,,,1 rating Rate it yourself - /Services/opticians/LeaveReview/DefaultView.aspx?id=OP_5A9_1689__000002_NW117RR,,,
A Ray Eyecare,OP_5C9_5813__000001_N225DD,OPT,514 Lordship Lane,,,London,,N22 5DD,Tel: 020 8888 8715, - ,,,No ratings yet Rate it yourself - /Services/opticians/LeaveReview/DefaultView.aspx?id=OP_5C9_5813__000001_N225DD,0,0,