Organisation Name,NACS Code,Organisation Type,Address1,Address2,Address3,Address4,Address5,PostCode,Telephone Number,Opening time,Value  (Opening time),Banding Classification  (Opening time),NHS.UK users rating,Value  (NHS.UK users rating),Banding Classification  (NHS.UK users rating),Car parking (Is there car parking at this organisation?)
Boots-Greenford,UB6 0UW_19217,OPT,,1000 Greenford Road,,Greenford,Middlesex,UB6 0UW,Tel: 0208 575 2152, - ,,,No ratings yet Rate it yourself - /Services/opticians/LeaveReview/DefaultView.aspx?id=UB6 0UW_19217,0,0,
Specsavers Opticians,OP_5HX_14720__000001_UB69PU,OPT,20 The Broadway,Greenford,Middlesex,,,UB6 9PU,Tel: 020 8832 8940, - ,,,No ratings yet Rate it yourself - /Services/opticians/LeaveReview/DefaultView.aspx?id=OP_5HX_14720__000001_UB69PU,0,0,
Boots-Greenford,OP_5HX_665__000002_UB69PN,OPT,35 The Broadway,,,Greenford,Middlesex,UB6 9PN,Tel: 0208 578 1234, - ,,,No ratings yet Rate it yourself - /Services/opticians/LeaveReview/DefaultView.aspx?id=OP_5HX_665__000002_UB69PN,0,0,
Medical Eye Centre,OP_5HX_2081__000001_UB69QD,OPT,9 Ruislip Road,Greenford,Middlesex,,,UB6 9QD,Tel: 020 8578 3721, - ,,,No ratings yet Rate it yourself - /Services/opticians/LeaveReview/DefaultView.aspx?id=OP_5HX_2081__000001_UB69QD,0,0,
OLDFIELDS OPTICIANS,01-20756_UB54RR_0714,OPT,OLDFIELDS OPTICIANS,27A OLDFIELDS CIRCUS,,NORTHOLT,,UB5 4RR,Tel: 02084224466, - ,,,No ratings yet Rate it yourself - /Services/opticians/LeaveReview/DefaultView.aspx?id=01-20756_UB54RR_0714,0,0,yes
Vision Eyecare,OP_5HX_14390__000002_UB67BN,OPT,94 Bilton Road,Perivale,Greenford,,,UB6 7BN,Tel: 020 8998 2121, - ,,,4 ratings Rate it yourself - /Services/opticians/LeaveReview/DefaultView.aspx?id=OP_5HX_14390__000002_UB67BN,,,
Mandeville Opticians,140920161008,OPT,,6 Mandeville Road,,Northolt,Middlesex,UB5 5BJ,Tel: 020 8841 2626, - ,,,No ratings yet Rate it yourself - /Services/opticians/LeaveReview/DefaultView.aspx?id=140920161008,0,0,
Parker & Hammond Opticians ,OP_5K6_9349__000001_HA28EE,OPT,302 Northolt Road,,South Harrow,,,HA2 8EE,Tel: 020 8422 1269, - ,,,No ratings yet Rate it yourself - /Services/opticians/LeaveReview/DefaultView.aspx?id=OP_5K6_9349__000001_HA28EE,0,0,
Specsavers (South Harrow Visionplus Ltd),OP5K6__000002_HA28EE,OPT,308 Northolt Road,South Harrow,Harrow,Middlesex,,HA2 8EE,Tel: 020 8869 0301, - ,,,3 ratings Rate it yourself - /Services/opticians/LeaveReview/DefaultView.aspx?id=OP5K6__000002_HA28EE,,,
Hanwell Eyecare Centre,OP_5HX_14066__000002_W71DR,OPT,20 Church Road,Hanwell,London,,,W7 1DR,Tel: 020 8840 8595, - ,,,No ratings yet Rate it yourself - /Services/opticians/LeaveReview/DefaultView.aspx?id=OP_5HX_14066__000002_W71DR,0,0,
Family Eyecare Ltd,OP_5K6_627__000002_HA28DU,OPT,246 Northolt Road,,Harrow,,,HA2 8DU,Tel: 020 8423 5818, - ,,,1 rating Rate it yourself - /Services/opticians/LeaveReview/DefaultView.aspx?id=OP_5K6_627__000002_HA28DU,,,
Opticall Limited,OP_W52QP_46953,OPT,,7 Acantha Court,15A Montpelier Road,Ealing,,W5 2QP,Tel: 0208 9984228, - ,,,No ratings yet Rate it yourself - /Services/opticians/LeaveReview/DefaultView.aspx?id=OP_W52QP_46953,0,0,
Eyecraft Optometrist Ltd,OP_5K5_213__000001_HA04TL,OPT,26 Ealing Road,,Wembley,,,HA0 4TL,Tel: 020 8902 9908, - ,,,No ratings yet Rate it yourself - /Services/opticians/LeaveReview/DefaultView.aspx?id=OP_5K5_213__000001_HA04TL,0,0,
Keena Rakkado,OP_5HX_1621__000002_W130SR,OPT,18 The Broadway,West Ealing,,London,Greater London,W13 0SR,Tel: 020 8567 2320, - ,,,2 ratings Rate it yourself - /Services/opticians/LeaveReview/DefaultView.aspx?id=OP_5HX_1621__000002_W130SR,,,
Keena Rakkado,OP_SL39EA_34404,OPT,,18 The Broadway,,West Ealing,,W13 0SR,Tel: 0208 567 2320, - ,,,No ratings yet Rate it yourself - /Services/opticians/LeaveReview/DefaultView.aspx?id=OP_SL39EA_34404,0,0,
Specsavers Opticians,OP_5HX_3353__000001_W139BP,OPT,81 The Broadway,West Ealing,London,,,W13 9BP,Tel: 020 8840 8744, - ,,,No ratings yet Rate it yourself - /Services/opticians/LeaveReview/DefaultView.aspx?id=OP_5HX_3353__000001_W139BP,0,0,
K H Kennell,OP_5HX_13899__000001_NW107HR,OPT,8 Norbreck Parade,,London,,,NW10 7HR,Tel: 020 8997 7170, - ,,,No ratings yet Rate it yourself - /Services/opticians/LeaveReview/DefaultView.aspx?id=OP_5HX_13899__000001_NW107HR,0,0,
Specsavers Opticians (Wembley Visionplus Ltd T/A),OP_5K5_1786__000002_HA97BH,OPT,476 High Road,Wembley,Middlesex,,,HA9 7AS,Tel: 020 8900 1433, - ,,,2 ratings Rate it yourself - /Services/opticians/LeaveReview/DefaultView.aspx?id=OP_5K5_1786__000002_HA97BH,,,
Realeyes The Eye Clinic,01-1853,OPT,,"Unit 7, Wembley Central Square",,Wembley,,HA9 7AJ,Tel: 020 3909 9181, - ,,,No ratings yet Rate it yourself - /Services/opticians/LeaveReview/DefaultView.aspx?id=01-1853,0,0,
Mansons Eyecare,OP_5AT_11107__000001_UB49NS,OPT,"14 Jollys Lane, Willow District Centre",Yeading,Hayes,Middlesex,,UB4 9NS,Tel: 0208 845 5757, - ,,,1 rating Rate it yourself - /Services/opticians/LeaveReview/DefaultView.aspx?id=OP_5AT_11107__000001_UB49NS,,,
Boots-Wembley,OP_5K5_3809__000001_HA97AG,OPT,449 High Road,,,Wembley,Middlesex,HA9 7AF,Tel: 0208 9022721, - ,,,1 rating Rate it yourself - /Services/opticians/LeaveReview/DefaultView.aspx?id=OP_5K5_3809__000001_HA97AG,,,
Specsavers Opticians,OP_5HX_509__000001_W52XA,OPT,6 New Broadway,Ealing,London,,,W5 2XA,Tel: 020 8840 2977, - ,,,No ratings yet Rate it yourself - /Services/opticians/LeaveReview/DefaultView.aspx?id=OP_5HX_509__000001_W52XA,0,0,
Betterspecs Wembley Ltd,OP_5K5_14718__000001_HA97AY,OPT,475 - 477 High Road,Wembley,Middlesex,,,HA9 7AY,Tel: 020 8900 0677, - ,,,No ratings yet Rate it yourself - /Services/opticians/LeaveReview/DefaultView.aspx?id=OP_5K5_14718__000001_HA97AY,0,0,
Boots-Ealing,OP_5HX_4747__000002_W55AW,OPT,1A New Broadway,,Ealing,London,,W5 5AW,Tel: 0208 567 1235, - ,,,No ratings yet Rate it yourself - /Services/opticians/LeaveReview/DefaultView.aspx?id=OP_5HX_4747__000002_W55AW,0,0,
The Eye Zone,L2D5V,OPT,25 New Broadway,Ealing,London,London,,W5 5AW,Tel: 020 8567 2020, - ,,,No ratings yet Rate it yourself - /Services/opticians/LeaveReview/DefaultView.aspx?id=L2D5V,0,0,
Dollond & Aitchison,OP_5HX_1875__000003_W55AW,OPT,1a New Broadway,Ealing,London,,,W5 5AW,Tel: 020 8567 1235, - ,,,No ratings yet Rate it yourself - /Services/opticians/LeaveReview/DefaultView.aspx?id=OP_5HX_1875__000003_W55AW,0,0,
M&S Opticians,,OPT,,69-79 The Broadway,,"Ealing, London",,W5 5JW,Tel: 0208 0169602, - ,,,N/A - Data not available,,,
Paul Simon Opticians,OP_5K5_5997__000001_HA96AA,OPT,383 High Road,,Wembley,,,HA9 6AA,Tel: 020 8902 0271, - ,,,No ratings yet Rate it yourself - /Services/opticians/LeaveReview/DefaultView.aspx?id=OP_5K5_5997__000001_HA96AA,0,0,
David Clulow,OP_5HX_6485__000004_W55JY,OPT,47 Ealing Broadway Centre,The Broadway,Ealing,,,W5 5JY,Tel: 020 8579 7274, - ,,,No ratings yet Rate it yourself - /Services/opticians/LeaveReview/DefaultView.aspx?id=OP_5HX_6485__000004_W55JY,0,0,
Vision Express,OP_5HX_11734__000003_W55JY,OPT,82 Ealing Broadway Centre,The Broadway,Ealing,London,,W5 5JY,Tel: 020 8840 1880, - ,,,No ratings yet Rate it yourself - /Services/opticians/LeaveReview/DefaultView.aspx?id=OP_5HX_11734__000003_W55JY,0,0,
Optical World,OP_5HX_11991__000001_UB11JR,OPT,11 The Broadway,Southall,Middlesex,,,UB1 1JR,Tel: 020 8893 5759, - ,,,No ratings yet Rate it yourself - /Services/opticians/LeaveReview/DefaultView.aspx?id=OP_5HX_11991__000001_UB11JR,0,0,
Ultimate Eye Care,OP_5HX_1706__000002_UB11JY,OPT,,49 The Broadway,,Southall,,UB1 1JY,Tel: 020 8574 4158, - ,,,No ratings yet Rate it yourself - /Services/opticians/LeaveReview/DefaultView.aspx?id=OP_5HX_1706__000002_UB11JY,0,0,
Hynes Opticians,OP_5HX_12797__000001_W139RT,OPT,120 Northfield Avenue,Ealing,,london,,W13 9RT,Tel: 020 8579 3241, - ,,,2 ratings Rate it yourself - /Services/opticians/LeaveReview/DefaultView.aspx?id=OP_5HX_12797__000001_W139RT,,,
West London Home Eyecare Ltd,GOC-01-13193-01/08-W5 4JB,OPT,,18 Gloucester Road Ealing,,Ealing,Greater London,W5 4JB,Tel: 02085678707, - ,,,No ratings yet Rate it yourself - /Services/opticians/LeaveReview/DefaultView.aspx?id=GOC-01-13193-01/08-W5 4JB,0,0,
New Vision,OP_5K6_4098__000001_HA29SE,OPT,431 Alexandra Avenue,,Harrow,,,HA2 9SE,Tel: 0208 429 3641, - ,,,6 ratings Rate it yourself - /Services/opticians/LeaveReview/DefaultView.aspx?id=OP_5K6_4098__000001_HA29SE,,,
EYES ON THE COMMON,CO-5352,OPT,EYES ON THE COMMON,"4 Station Parade, Uxbridge Road",Ealing Common,London,Middlesex,W5 3LD,Tel: 020 3538 5977, - ,,,6 ratings Rate it yourself - /Services/opticians/LeaveReview/DefaultView.aspx?id=CO-5352,,,
Barnett Opticians,OP_5K6_14961__000001_HA55EN,OPT,367 Rayners Lane,,,Pinner,Middlesex,HA5 5EN,Tel: 020 8868 3003, - ,,,No ratings yet Rate it yourself - /Services/opticians/LeaveReview/DefaultView.aspx?id=OP_5K6_14961__000001_HA55EN,0,0,
Vision Express (Harrrow),OP_5K6_11425__000003_HA11HS,OPT,Unit 6 St.George's Shopping Centre,St Anns Road,Harrow,,,HA1 1HS,Tel: 020 8427 3311, - ,,,1 rating Rate it yourself - /Services/opticians/LeaveReview/DefaultView.aspx?id=OP_5K6_11425__000003_HA11HS,,,
Boots-Harrow - St Anns Rd,OP_5K6_1130__000001_HA11LA,OPT,30 St Anns Road,,,Harrow,Middlesex,HA1 1LA,Tel: 0208 427 4113, - ,,,2 ratings Rate it yourself - /Services/opticians/LeaveReview/DefaultView.aspx?id=OP_5K6_1130__000001_HA11LA,,,
Boots Opticians,OP_5K6_12060__000002_HA11HS,OPT,30 St. Anns Road,,,Harrow,,HA1 1LA,Tel: 0208 427 4113, - ,,,98 ratings Rate it yourself - /Services/opticians/LeaveReview/DefaultView.aspx?id=OP_5K6_12060__000002_HA11HS,,,
St Ann's Optical Centre,OP_5K6_10180__000001_HA11LE,OPT,58 Greenhill Way,Harrow,Middlesex,,,HA1 1LE,Tel: 020 8863 5575, - ,,,1 rating Rate it yourself - /Services/opticians/LeaveReview/DefaultView.aspx?id=OP_5K6_10180__000001_HA11LE,,,
Specsavers Opticians (Harrow Visionplus Ltd),OP_5K6_13138__000002_HA12TA,OPT,289 Station Road,,Harrow,,,HA1 2TA,Tel: 020 8424 0244, - ,,,5 ratings Rate it yourself - /Services/opticians/LeaveReview/DefaultView.aspx?id=OP_5K6_13138__000002_HA12TA,,,
Opticalise Ophthalmic Opticians,00001__000003_HA30PS,OPT,241 - 243 Preston Road,Harrow,Middlesex,,,HA3 0PS,Tel: 020 8908 4888, - ,,,No ratings yet Rate it yourself - /Services/opticians/LeaveReview/DefaultView.aspx?id=00001__000003_HA30PS,0,0,
Asda Opticians,OP_5HX_14719__000002_NW107LW,OPT,2-20 Western Road,Park Royal Industrial Estate,,London,,NW10 7LW,Tel: 020 8951 9112, - ,,,No ratings yet Rate it yourself - /Services/opticians/LeaveReview/DefaultView.aspx?id=OP_5HX_14719__000002_NW107LW,0,0,
John  Wexler,OP_5HX_13862__000001_W54QP,OPT,151 South Ealing Road,Ealing,London,,,W5 4QP,Tel: 020 8567 7902, - ,,,No ratings yet Rate it yourself - /Services/opticians/LeaveReview/DefaultView.aspx?id=OP_5HX_13862__000001_W54QP,0,0,
King Opticians,OP_5HX___000002_UB24DG,OPT,31-33 King Street,,Southall,Middx,,UB2 4DG,Tel: 0208 574 6927, - ,,,7 ratings Rate it yourself - /Services/opticians/LeaveReview/DefaultView.aspx?id=OP_5HX___000002_UB24DG,,,
Brush & Fowler Opticians,OP_5K6_3376__000001_HA12JN,OPT,3 Manor Parade,Sheepcote Road,Harrow,,,HA1 2JN,Tel: 0208 427 0279, - ,,,No ratings yet Rate it yourself - /Services/opticians/LeaveReview/DefaultView.aspx?id=OP_5K6_3376__000001_HA12JN,0,0,
Specsavers - Hayes Sainsburys,A9U5G,OPT,Sainsburys,Lombardy Retail Park,Coldharbour Lane,Hayes,,UB3 3EX,Tel: 0208 756 4989, - ,,,1 rating Rate it yourself - /Services/opticians/LeaveReview/DefaultView.aspx?id=A9U5G,,,
Specsavers Opticians,A9U5G,OPT,,Sainsbury's Lombardy Retail Park,Coldharbour Lane,Hayes,,UB3 3EX,Tel: 02087564989, - ,,,No ratings yet Rate it yourself - /Services/opticians/LeaveReview/DefaultView.aspx?id=A9U5G,0,0,
Cravitz Opticians,OP_5K5_11249__000001_HA30AZ,OPT,119 Kenton Road,Kenton,Harrow,,,HA3 0AZ,Tel: 020 8907 7860, - ,,,2 ratings Rate it yourself - /Services/opticians/LeaveReview/DefaultView.aspx?id=OP_5K5_11249__000001_HA30AZ,,,
Costco Wholesale UK Limited,O7A7A,OPT,,30 Second Way,,Wembley,,HA9 0YJ,, - ,,,No ratings yet Rate it yourself - /Services/opticians/LeaveReview/DefaultView.aspx?id=O7A7A,0,0,
Costco Wholesale UK Limited,O7A7A,OPT,,30 Second Way,,Wembley,,HA9 0YJ,, - ,,,No ratings yet Rate it yourself - /Services/opticians/LeaveReview/DefaultView.aspx?id=O7A7A,0,0,
icare optician T/a myicare,OP_5LC_610__000001_HA30RN,OPT,23 Trevelyan Cresent,Kenton,,Harrow,Middlesex,HA3 0RN,Tel: 0208 907 7787, - ,,,No ratings yet Rate it yourself - /Services/opticians/LeaveReview/DefaultView.aspx?id=OP_5LC_610__000001_HA30RN,0,0,
S L Choi,OP_5HX_13900__000001_W54NJ,OPT,164 Popes Lane,Ealing,London,,,W5 4NJ,Tel: 020 8840 2328, - ,,,No ratings yet Rate it yourself - /Services/opticians/LeaveReview/DefaultView.aspx?id=OP_5HX_13900__000001_W54NJ,0,0,
Optipharm Opticians,TP9K5,OPT,,29 Bridge Road,Wembley Park,Middlesex,,HA9 9AB,Tel: 020 8904 7488, - ,,,No ratings yet Rate it yourself - /Services/opticians/LeaveReview/DefaultView.aspx?id=TP9K5,0,0,
Asda Optician,OPT_HA9 9EX,OPT,,FORTY ROAD,,WEMBLEY,,HA9 9EX,Tel: 0208 7826320, - ,,,No ratings yet Rate it yourself - /Services/opticians/LeaveReview/DefaultView.aspx?id=OPT_HA9 9EX,0,0,
Homehealth Opticians Ltd,HOMEHEALTHOPTICIANSLTD1,OPT,,"1a Acton Hill Mews, 310-328 Uxbridge Road",,Acton,,W3 9QN,Tel: 0800 783 7409, - ,,,No ratings yet Rate it yourself - /Services/opticians/LeaveReview/DefaultView.aspx?id=HOMEHEALTHOPTICIANSLTD1,0,0,
Rai Optometrists Ltd,OP_5K6_6218__000002_HA27SY,OPT,8 Broadway Parade,Pinner Road,Harrow,,,HA2 7SY,Tel: 020 8427 9202, - ,,,No ratings yet Rate it yourself - /Services/opticians/LeaveReview/DefaultView.aspx?id=OP_5K6_6218__000002_HA27SY,0,0,
Hayes Eye Clinic,OP_5AT_9391__000002_UB40RS,OPT,814a Uxbridge Road,,Middlesex,Hayes,,UB4 0RS,Tel: 020 8561 1625, - ,,,13 ratings Rate it yourself - /Services/opticians/LeaveReview/DefaultView.aspx?id=OP_5AT_9391__000002_UB40RS,,,
My Specs Direct,555000__000001_NW106LA,OPT,25a Gorst Road,,London,,,NW10 6LA,Tel: 020 8453 1163, - ,,,No ratings yet Rate it yourself - /Services/opticians/LeaveReview/DefaultView.aspx?id=555000__000001_NW106LA,0,0,
Hillier Opticians ,OP_5K6_7317__000001_HA26ED,OPT,19 Broadwalk,Pinner Road,Harrow,,,HA2 6ED,Tel: 020 8863 1541, - ,,,No ratings yet Rate it yourself - /Services/opticians/LeaveReview/DefaultView.aspx?id=OP_5K6_7317__000001_HA26ED,0,0,
Tesco Opticians,OLCO-19985HY__000002_TW75NZ,OPT,Osterley Park,Syon Lane,Isleworth,Middlesex,,TW7 5NZ,Tel: 0345 6013479, - ,,,No ratings yet Rate it yourself - /Services/opticians/LeaveReview/DefaultView.aspx?id=OLCO-19985HY__000002_TW75NZ,0,0,
Robert J Lynch Opticians ,OP_5HX_8658__000001_W36QS,OPT,10 Market Place,Acton,,London,,W3 6QS,Tel: 020 8992 2440, - ,,,No ratings yet Rate it yourself - /Services/opticians/LeaveReview/DefaultView.aspx?id=OP_5HX_8658__000001_W36QS,0,0,
Crispe Opticians,OP_5AT_12413__000002_HA51QZ,OPT,207 Field End Road,Eastcote,Pinner,Middlesex,,HA5 1QZ,Tel: 020 8866 3998, - ,,,No ratings yet Rate it yourself - /Services/opticians/LeaveReview/DefaultView.aspx?id=OP_5AT_12413__000002_HA51QZ,0,0,
Mr R K Shah,01-13945,OPT,,58 Southfield Park,,Harrow,,HA2 6HE,Tel: 07956172861, - ,,,No ratings yet Rate it yourself - /Services/opticians/LeaveReview/DefaultView.aspx?id=01-13945,0,0,
Acton Specsavers,TP870,OPT,,150 High Street,,Acton,,W3 6QZ,, - ,,,1 rating Rate it yourself - /Services/opticians/LeaveReview/DefaultView.aspx?id=TP870,,,
Eye Emporium Opticians,CO-4997,OPT,,168 Acton High Street,,London,,W3 6QZ,Tel: 02087520410, - ,,,No ratings yet Rate it yourself - /Services/opticians/LeaveReview/DefaultView.aspx?id=CO-4997,0,0,
The Vision Clinic,R9J0E,OPT,,327 Kenton Road,,"Kenton, Harrow",,HA3 0XS,Tel: 020 8907 5270, - ,,,No ratings yet Rate it yourself - /Services/opticians/LeaveReview/DefaultView.aspx?id=R9J0E,0,0,
DomEyeCare Ltd,1609141104,OPT,,70 Lowlands Road,,Pinner,,HA5 1TU,Tel: 0208 868 8475, - ,,,No ratings yet Rate it yourself - /Services/opticians/LeaveReview/DefaultView.aspx?id=1609141104,0,0,
Leith Opticians,OP_5AT_4339__000002_HA51QR,OPT,175 Field End Road,Eastcote,Pinner,Middlesex,,HA5 1QR,Tel: 020 8868 2277, - ,,,No ratings yet Rate it yourself - /Services/opticians/LeaveReview/DefaultView.aspx?id=OP_5AT_4339__000002_HA51QR,0,0,
Acton Eye Centre,OP_5HX_12684__000002_W36QX,OPT,122 High Street,Acton,London,,,W3 6QX,Tel: 020 8993 4654, - ,,,No ratings yet Rate it yourself - /Services/opticians/LeaveReview/DefaultView.aspx?id=OP_5HX_12684__000002_W36QX,0,0,
First Contact Opticians,OP_5AT_3927__000001_HA51RJ,OPT,126 Field End Road,Eastcote,Pinner,Middlesex,,HA5 1RJ,Tel: 020 8866 4911, - ,,,1 rating Rate it yourself - /Services/opticians/LeaveReview/DefaultView.aspx?id=OP_5AT_3927__000001_HA51RJ,,,
Osterley Opticians,00015HY__000001_TW74QE,OPT,156 Thornbury Road,Osterley Village,Osterley,Isleworth,,TW7 4QE,Tel: 0208 5606098, - ,,,1 rating Rate it yourself - /Services/opticians/LeaveReview/DefaultView.aspx?id=00015HY__000001_TW74QE,,,
TESCO OPTICIANS,5K5/ 3036__000002_NW100TL,OPT,TESCO WEMBLEY BRENT PARK,GREAT CENTRAL WAY,,LONDON,,NW10 0TL,Tel: 0345 601 3479, - ,,,No ratings yet Rate it yourself - /Services/opticians/LeaveReview/DefaultView.aspx?id=5K5/ 3036__000002_NW100TL,0,0,
Tesco Opticians,OLCO-19985HX__000002_UB25LN,OPT,Bulls Bridge Industrial Estate,Hayes Road,,Southall,,UB2 5LN,Tel: 0345 601 3479, - ,,,No ratings yet Rate it yourself - /Services/opticians/LeaveReview/DefaultView.aspx?id=OLCO-19985HX__000002_UB25LN,0,0,
Crockford Mills,OP_5AT_2104__000001_UB32HW,OPT,9 East Avenue,,Hayes,,,UB3 2HW,Tel: 0208 573 0822, - ,,,2 ratings Rate it yourself - /Services/opticians/LeaveReview/DefaultView.aspx?id=OP_5AT_2104__000001_UB32HW,,,
Visioncare Eye -Clinic ,OP_5K6_543__000002_HA37AF,OPT,Visioncare Medical Eye Centre,62-64 High Street,Wealdstone,Harrow,Middlesex,HA3 7AF,Tel: 020 8863 5333, - ,,,No ratings yet Rate it yourself - /Services/opticians/LeaveReview/DefaultView.aspx?id=OP_5K6_543__000002_HA37AF,0,0,
Specsavers Opticians (Harlesden Visionplus),5K5_NW10 4LT,OPT,,"Bank Buildings, Unit 8, High Street ",,Harlesden,,NW10 4LT,, - ,,,No ratings yet Rate it yourself - /Services/opticians/LeaveReview/DefaultView.aspx?id=5K5_NW10 4LT,0,0,
Vision Direct Opticians,OP_5K5_1673__000001_NW108TS,OPT,6 Acton Lane,Harlesden,London,,,NW10 8TS,Tel: 020 8965 6707, - ,,,No ratings yet Rate it yourself - /Services/opticians/LeaveReview/DefaultView.aspx?id=OP_5K5_1673__000001_NW108TS,0,0,
B A Williams Chemists & Opticians,OP_5HY_13897__000002_TW80JW,OPT,14-15 Albany Parade,High Street,Brentford,,,TW8 0JW,Tel: 020 8560 3834, - ,,,No ratings yet Rate it yourself - /Services/opticians/LeaveReview/DefaultView.aspx?id=OP_5HY_13897__000002_TW80JW,0,0,
Classic Eyes Brentford,OLCO-29195HY__000001_TW88JZ,OPT,Unit 7 Brentford Lock,159-188 High Street,Brentford,Middlesex,,TW8 8AQ,Tel: 020 8568 7778, - ,,,No ratings yet Rate it yourself - /Services/opticians/LeaveReview/DefaultView.aspx?id=OLCO-29195HY__000001_TW88JZ,0,0,
Visionsavers Opticians,OP_5K6_14943__000001_HA35DQ,OPT,53 High Street,Wealdstone,Harrow,,,HA3 5DQ,Tel: 020 8861 6006, - ,,,No ratings yet Rate it yourself - /Services/opticians/LeaveReview/DefaultView.aspx?id=OP_5K6_14943__000001_HA35DQ,0,0,
Specsavers Opticians,OP 5AT 6653__000001_UB32AB,OPT,"Unit 01, 5-19 Botwell Lane",,Hayes,Middlesex,,UB3 2AB,Tel: 0208 756 4980, - ,,,No ratings yet Rate it yourself - /Services/opticians/LeaveReview/DefaultView.aspx?id=OP 5AT 6653__000001_UB32AB,0,0,
Mr S Stewart Duncan,OP_5HY_4818__000002_TW88AH,OPT,213 High Street,Brentford,Middlesex,,,TW8 8AH,Tel: 020 8568 4139, - ,,,No ratings yet Rate it yourself - /Services/opticians/LeaveReview/DefaultView.aspx?id=OP_5HY_4818__000002_TW88AH,0,0,
Boots Opticians,31/08/20171140,OPT,,49 Station Road,,Middlesex,,UB3 4BE,, - ,,,No ratings yet Rate it yourself - /Services/opticians/LeaveReview/DefaultView.aspx?id=31/08/20171140,0,0,
S H Harrold (1937) Ltd,OP_5AT_3078__000003_UB34DD,OPT,48 Station Road,Hayes,Middlesex,,,UB3 4DD,Tel: 0208 573 4400, - ,,,1 rating Rate it yourself - /Services/opticians/LeaveReview/DefaultView.aspx?id=OP_5AT_3078__000003_UB34DD,,,
Eyecloud Opticians,OP_5K5_6725__000002_NW104NS,OPT,75 High Street,Harlesden,,London,,NW10 4NS,Tel: 020 8961 0077, - ,,,1 rating Rate it yourself - /Services/opticians/LeaveReview/DefaultView.aspx?id=OP_5K5_6725__000002_NW104NS,,,
Costco Wholesale UK Ltd,CO-1833-20,OPT,,Western International Park,Hayes Road,Hayes,,UB2 5XJ,Tel: 0208 571 8675, - ,,,No ratings yet Rate it yourself - /Services/opticians/LeaveReview/DefaultView.aspx?id=CO-1833-20,0,0,
Wiseman and Ashley Optical Centre,OP_5K5_14712__000001_NW99EL,OPT,561 Kingsbury Road,561 Kingsbury High Road,London,Kingsbury,,NW9 9EL,Tel: 020 8204 4348, - ,,,5 ratings Rate it yourself - /Services/opticians/LeaveReview/DefaultView.aspx?id=OP_5K5_14712__000001_NW99EL,,,
Eyecare Heston Ltd.,TP4R2,OPT,329 Vicarage Farm Road,Heston,Middlesex,London,,TW5 0DR,Tel: 020 8569 6520, - ,,,1 rating Rate it yourself - /Services/opticians/LeaveReview/DefaultView.aspx?id=TP4R2,,,
Norman Hart Opticians,OP_5K5_13098__000002_NW100AA,OPT,6 Neasden Parade,250 Neasden Lane,London,,,NW10 0AA,Tel: 020 8450 8153, - ,,,2 ratings Rate it yourself - /Services/opticians/LeaveReview/DefaultView.aspx?id=OP_5K5_13098__000002_NW100AA,,,
Eye Spy Opticians,COOL-32795HX__000003_W37DJ,OPT,1a East Acton Arcade,Old Ok Common Lane,East Acton,London,,W3 7DJ,Tel: 020 8746 9200, - ,,,No ratings yet Rate it yourself - /Services/opticians/LeaveReview/DefaultView.aspx?id=COOL-32795HX__000003_W37DJ,0,0,
Icare Opticians,TP8VL,OPT,,6 Barters Walk,,Pinner,,HA5 5LU,, - ,,,No ratings yet Rate it yourself - /Services/opticians/LeaveReview/DefaultView.aspx?id=TP8VL,0,0,
Stanfields Opticians,OP_5K5_7296__000001_NW99HJ,OPT,572 Kingsbury Road,Kingsbury,London,,,NW9 9HJ,Tel: 020 8204 7124, - ,,,No ratings yet Rate it yourself - /Services/opticians/LeaveReview/DefaultView.aspx?id=OP_5K5_7296__000001_NW99HJ,0,0,
B W Martin,OP_5HY_13895__000001_TW59JB,OPT,15 Fairmead Close,Heston,Middlesex,,,TW5 9JB,Tel: 020 8579 7607, - ,,,No ratings yet Rate it yourself - /Services/opticians/LeaveReview/DefaultView.aspx?id=OP_5HY_13895__000001_TW59JB,0,0,
Insight Opticians (Seemera Ltd t/a),OP_5K6_2521__000001_HA53JE,OPT,6 Bridge Street,Pinner,Middlesex,,,HA5 3JE,Tel: 020 8866 5399, - ,,,No ratings yet Rate it yourself - /Services/opticians/LeaveReview/DefaultView.aspx?id=OP_5K6_2521__000001_HA53JE,0,0,
Eye Design Opticians,OP_5AT_8112__000001_HA48LJ,OPT,170 High Street,Ruislip,Middlesex,,,HA4 8LJ,Tel: 01895 621135, - ,,,No ratings yet Rate it yourself - /Services/opticians/LeaveReview/DefaultView.aspx?id=OP_5AT_8112__000001_HA48LJ,0,0,
Kingsbury Opticians,OP_5K5_11069__000001_NW99HE,OPT,528 Kingsbury Road,Kingsbury,London,,,NW9 9HE,Tel: 020 8204 8758, - ,,,No ratings yet Rate it yourself - /Services/opticians/LeaveReview/DefaultView.aspx?id=OP_5K5_11069__000001_NW99HE,0,0,
G&G Pinner Optometrists,OP_5K6_14929__000001_HA53JD,OPT,3 Red Lion Parade,Bridge Street,Pinner,Pinner,Middlesex,HA5 3JD,Tel: 020 8866 2620, - ,,,No ratings yet Rate it yourself - /Services/opticians/LeaveReview/DefaultView.aspx?id=OP_5K6_14929__000001_HA53JD,0,0,yes
Specsavers Opticians,OP_5AT_14107__000001_HA48LL,OPT,134 High Street,,Ruislip,Middlesex,,HA4 8LL,Tel: 01895 679750, - ,,,No ratings yet Rate it yourself - /Services/opticians/LeaveReview/DefaultView.aspx?id=OP_5AT_14107__000001_HA48LL,0,0,
Boots-Pinner,OP_5K6_12949__000002_HA53JF,OPT,28 Bridge Stree,,,Pinner,Middlesex,HA5 3JF,Tel: 020 8866 5106, - ,,,No ratings yet Rate it yourself - /Services/opticians/LeaveReview/DefaultView.aspx?id=OP_5K6_12949__000002_HA53JF,0,0,
Specsavers Opticians,TP9FY,OPT,,36 Bridge Street,,Pinner,,HA5 3JF,, - ,,,No ratings yet Rate it yourself - /Services/opticians/LeaveReview/DefaultView.aspx?id=TP9FY,0,0,