Organisation Name,NACS Code,Organisation Type,Address1,Address2,Address3,Address4,Address5,PostCode,Telephone Number,Opening time,Value  (Opening time),Banding Classification  (Opening time),NHS.UK users rating,Value  (NHS.UK users rating),Banding Classification  (NHS.UK users rating),Car parking (Is there car parking at this organisation?)
Henderson Opticians Ltd,HD97EQ__000001_HD97EQ,OPT,104 School Street,,Holmfirth,,,HD9 7EQ,Tel: 01484 686060, - ,,,No ratings yet Rate it yourself - /Services/opticians/LeaveReview/DefaultView.aspx?id=HD97EQ__000001_HD97EQ,0,0,
Neil Kaye Optometrists,OP_5LK_4603__000001_HD71DN,OPT,,1 Victoria Street,,Holmfirth,,HD9 2DN,Tel: 01484 683152, - ,,,1 rating Rate it yourself - /Services/opticians/LeaveReview/DefaultView.aspx?id=OP_5LK_4603__000001_HD71DN,,,
Valli Opticians,OP_5LK_2514__000002_HD72AA,OPT,30 Westgate,Honley,,Huddersfield,,HD9 6AA,Tel: 01484 667406, - ,,,No ratings yet Rate it yourself - /Services/opticians/LeaveReview/DefaultView.aspx?id=OP_5LK_2514__000002_HD72AA,0,0,
Souten & Agyemang,QDT-00:0182__000001_HD47HE,OPT,345 Meltham Road,Netherton,Huddersfield,West Yorkshire,,HD4 7EH,Tel: 01484 664433, - ,,,No ratings yet Rate it yourself - /Services/opticians/LeaveReview/DefaultView.aspx?id=QDT-00:0182__000001_HD47HE,0,0,yes
Valli Opticians,OP_5LK_2513__000001_HD73AF,OPT,29 Huddersfield Road,Meltham,,Huddersfield,,HD9 4AF,Tel: 01484 851381, - ,,,3 ratings Rate it yourself - /Services/opticians/LeaveReview/DefaultView.aspx?id=OP_5LK_2513__000001_HD73AF,,,
Allegro Optical,OPT_HD95NX_1,OPT,,1-3 Station Street,Meltham,Holmfirth,Yorkshire(West Riding),HD9 5NX,Tel: 01484 907090, - ,,,1 rating Rate it yourself - /Services/opticians/LeaveReview/DefaultView.aspx?id=OPT_HD95NX_1,,,
Valli Opticians,OP_5LJ_10970__000001_HD13TG,OPT,24 Meltham Road,Lockwood,,Huddersfield,West Yorkshire,HD1 3TJ,Tel: 01484 533730, - ,,,No ratings yet Rate it yourself - /Services/opticians/LeaveReview/DefaultView.aspx?id=OP_5LJ_10970__000001_HD13TG,0,0,
Valli Opticians Almondbury,HD5 8LR__000002_HD58LR,OPT,3 Benomley Road,Almondbury,Huddersfield,Huddersfield,,HD5 8LR,Tel: 01484 517768, - ,,,No ratings yet Rate it yourself - /Services/opticians/LeaveReview/DefaultView.aspx?id=HD5 8LR__000002_HD58LR,0,0,
University Valli Opticians,P3Y3Y,OPT,,"Ground Floor, Joseph Priestley East Building, University of Huddersfield, Queensgate",,Huddersfield,,HD1 3DH,, - ,,,No ratings yet Rate it yourself - /Services/opticians/LeaveReview/DefaultView.aspx?id=P3Y3Y,0,0,
The Eye Clinic (Huddersfield),OPT_HD12TW_1,OPT,, 79 New Street,,Huddersfield,,HD1 2TW,, - ,,,1 rating Rate it yourself - /Services/opticians/LeaveReview/DefaultView.aspx?id=OPT_HD12TW_1,,,
Marten House,OP_5LJ_7282__000001_HD16SD,OPT,Fern Street,St andrews Road,Huddersfield,,,HD1 6SD,Tel: 01484 512211, - ,,,No ratings yet Rate it yourself - /Services/opticians/LeaveReview/DefaultView.aspx?id=OP_5LJ_7282__000001_HD16SD,0,0,
Clarus Opticians,OPT_HD58AA_1,OPT,,319 Old Wakefield Road,,Huddersfield,,HD5 8AA,, - ,,,No ratings yet Rate it yourself - /Services/opticians/LeaveReview/DefaultView.aspx?id=OPT_HD58AA_1,0,0,
Optical Express,,OPT,,NU House,,Huddersfield ,,HD1 2LF,, - ,,,N/A - Data not available,,,
Optical Express Limited,OPT_HD12HL_1,OPT,,N U House 3rd Floor,43 Market Street,Huddersfield,,HD1 2HL,Tel: 08455 558264, - ,,,No ratings yet Rate it yourself - /Services/opticians/LeaveReview/DefaultView.aspx?id=OPT_HD12HL_1,0,0,
Vision Express (UK) Ltd,OP_5LJ_8913__000001_HD12AZ,OPT,,17 New Street,,Huddersfield,,HD1 2AZ,Tel: 01484 452442, - ,,,No ratings yet Rate it yourself - /Services/opticians/LeaveReview/DefaultView.aspx?id=OP_5LJ_8913__000001_HD12AZ,0,0,
Boots-Huddersfield - King St,OP_5LJ_2903__000002_HD12QE,OPT,22-24 King Street,,,Huddersfield,West Yorkshire,HD1 2QE,Tel: 01484 519229, - ,,,1 rating Rate it yourself - /Services/opticians/LeaveReview/DefaultView.aspx?id=OP_5LJ_2903__000002_HD12QE,,,
Scrivens,OP_5LJ_10650__000001_HD12DX,OPT,15 Cloth Hall Street,,,Huddersfield,,HD1 2DX,Tel: 01484 532176, - ,,,No ratings yet Rate it yourself - /Services/opticians/LeaveReview/DefaultView.aspx?id=OP_5LJ_10650__000001_HD12DX,0,0,
E Beaumont Ltd,OP_5LJ_1212__000001_HD12AR,OPT,,16-18 Cloth Hall Street,,Huddersfield,,HD1 2EG,Tel: 01484 531084, - ,,,No ratings yet Rate it yourself - /Services/opticians/LeaveReview/DefaultView.aspx?id=OP_5LJ_1212__000001_HD12AR,0,0,
Specsavers,OP_5LJ_5938__000001_HD12ET,OPT,18 Market Street,18 Market Street,Huddersfield,Huddersfield,,HD1 2ET,Tel: 01484 544566, - ,,,No ratings yet Rate it yourself - /Services/opticians/LeaveReview/DefaultView.aspx?id=OP_5LJ_5938__000001_HD12ET,0,0,
Bradley & Smith,OP_5LJ_2388__000001_HD14EN,OPT,17 Greenhead Road,Marsh,Huddersfield,,,HD1 4EN,Tel: 01484 423119, - ,,,No ratings yet Rate it yourself - /Services/opticians/LeaveReview/DefaultView.aspx?id=OP_5LJ_2388__000001_HD14EN,0,0,
Dr Stella Griffiths Ltd,OP 5LJ 10908__000002_HD58PZ,OPT,628 Wakefield Road,Waterloo,,Huddersfield,,HD5 8PZ,Tel: 01484 453833, - ,,,1 rating Rate it yourself - /Services/opticians/LeaveReview/DefaultView.aspx?id=OP 5LJ 10908__000002_HD58PZ,,,
Selbie Opticians,OP_5LJ_14671__000002_HD34HZ,OPT,65 Market Street,Milnsbridge,Huddersfield,,,HD3 4HZ,Tel: 01484 659119, - ,,,No ratings yet Rate it yourself - /Services/opticians/LeaveReview/DefaultView.aspx?id=OP_5LJ_14671__000002_HD34HZ,0,0,
Auckland Opticians Limited,OP_5LK_8096__000001_HD89AE,OPT,8-10 Huddersfield Road,Skelmanthorpe,,Huddersfield,,HD8 9AE,Tel: 01484 862391, - ,,,No ratings yet Rate it yourself - /Services/opticians/LeaveReview/DefaultView.aspx?id=OP_5LK_8096__000001_HD89AE,0,0,
Focus Opticians,HD1 5HS__000001_HD15HS,OPT,56a Blacker Road,Birkby,Huddersfield,West Yorkshire,,HD1 5HS,Tel: 01484 534800, - ,,,No ratings yet Rate it yourself - /Services/opticians/LeaveReview/DefaultView.aspx?id=HD1 5HS__000001_HD15HS,0,0,
Aldreds Opticians,OP_5LK_6551__000002_HD75AN,OPT,8 Carr Lane,Slaithwaite,Huddersfield,,,HD7 5AN,Tel: 01484 843023, - ,,,No ratings yet Rate it yourself - /Services/opticians/LeaveReview/DefaultView.aspx?id=OP_5LK_6551__000002_HD75AN,0,0,
Eye Department,OP_5LJ_769__000002_HD33EA,OPT,Royal Infirmary,Acre Street,Huddersfield,,,HD3 3EA,Tel: 01484 342000, - ,,,1 rating Rate it yourself - /Services/opticians/LeaveReview/DefaultView.aspx?id=OP_5LJ_769__000002_HD33EA,,,
NUR Vision Ltd,OPT_HD33XA_1,OPT,,Salendine Shopping Centre,144 Moor Nook Road,Huddersfield,,HD3 3XA,Tel: 01484 652670, - ,,,No ratings yet Rate it yourself - /Services/opticians/LeaveReview/DefaultView.aspx?id=OPT_HD33XA_1,0,0,
Allegro Optical,T6F9J,OPT,,30 Peel Street,,Marsden,,HD7 6BW,, - ,,,No ratings yet Rate it yourself - /Services/opticians/LeaveReview/DefaultView.aspx?id=T6F9J,0,0,
Hanson Opticians,QDT206__000001_WF148AA,OPT,,164 Huddersfield Road,Mirfield,Mirfield,,WF14 8AN,Tel: 01924 491550, - ,,,6 ratings Rate it yourself - /Services/opticians/LeaveReview/DefaultView.aspx?id=QDT206__000001_WF148AA,,,
K M Cockerill,OP_5J7_1243__000002_WF148AN,OPT,170 Huddersfield Road,,Mirfield,,,WF14 8AN,Tel: 01924 492061, - ,,,No ratings yet Rate it yourself - /Services/opticians/LeaveReview/DefaultView.aspx?id=OP_5J7_1243__000002_WF148AN,0,0,
Auckland Opticians ,OP_5JE_8104__000001_S306BZ,OPT,Back Lane,Penistone,Sheffield,,,S36 6AB,Tel: 01226 766996, - ,,,No ratings yet Rate it yourself - /Services/opticians/LeaveReview/DefaultView.aspx?id=OP_5JE_8104__000001_S306BZ,0,0,
Scrivens Ltd,OP_5JE_7167__000001_S366BR,OPT,7 High Street,Penistone,,Penistone,Yorkshire,S36 6BR,Tel: 01226 762344, - ,,,No ratings yet Rate it yourself - /Services/opticians/LeaveReview/DefaultView.aspx?id=OP_5JE_7167__000001_S366BR,0,0,
Whitakers Opticians Ltd,OP_5J6_11093__000001_HX50EP,OPT,,79 Southgate,,Elland,West Yorkshire,HX5 0EP,Tel: 01422 372008, - ,,,No ratings yet Rate it yourself - /Services/opticians/LeaveReview/DefaultView.aspx?id=OP_5J6_11093__000001_HX50EP,0,0,yes
Andrew Lomas Optometrist Ltd,OP_5J6_8982__000001_HX50BW,OPT,31 Southgate,,Elland,,,HX5 0BW,Tel: 01422 372755, - ,,,No ratings yet Rate it yourself - /Services/opticians/LeaveReview/DefaultView.aspx?id=OP_5J6_8982__000001_HX50BW,0,0,
Donovan Smith Optometrist,OP_5J6_9787__000001_HD61JR,OPT,7 Bethel Street,,Brighouse,,,HD6 1JR,Tel: 01484 713291, - ,,,No ratings yet Rate it yourself - /Services/opticians/LeaveReview/DefaultView.aspx?id=OP_5J6_9787__000001_HD61JR,0,0,
Brighouse Opticians Audiologists,E0I1F,OPT,11 Chapel Court,Park Street,Brighouse,Huddersfield,,HD6 1JH,Tel: 01484 718050, - ,,,No ratings yet Rate it yourself - /Services/opticians/LeaveReview/DefaultView.aspx?id=E0I1F,0,0,
Moorhouse Opticians (Northern) Ltd,OP_5J6_3354__000001_HD61DN,OPT,Park Street,,Brighouse,,,HD6 1JL,Tel: 01484 718050, - ,,,No ratings yet Rate it yourself - /Services/opticians/LeaveReview/DefaultView.aspx?id=OP_5J6_3354__000001_HD61DN,0,0,
Specsavers,OP_5J6_8425__000003_HD61AQ,OPT,55-57 Commercial Street,,,Brighouse,Yorkshire(West Riding),HD6 1AF,Tel: 01484 711222, - ,,,No ratings yet Rate it yourself - /Services/opticians/LeaveReview/DefaultView.aspx?id=OP_5J6_8425__000003_HD61AQ,0,0,
Eye Pharmacy,QDT212__000001_WF133RJ,OPT,Unit 6d,Ravensthorpe Retail Park,Dewsbury,West Yorkshire,,WF13 3RJ,Tel: 01924 466188, - ,,,No ratings yet Rate it yourself - /Services/opticians/LeaveReview/DefaultView.aspx?id=QDT212__000001_WF133RJ,0,0,
Adams Opticians Ltd,QDT207__000001_WF129NB,OPT,41 South Street,Savile Town,Dewsbury,West Yorkshire,,WF12 9NB,Tel: 01924 506466, - ,,,No ratings yet Rate it yourself - /Services/opticians/LeaveReview/DefaultView.aspx?id=QDT207__000001_WF129NB,0,0,
Armitage Allot & Partners,OP_5J7_179__000001_WF160JU,OPT,14 Market Street,,Heckmondwike,,,WF16 0JU,Tel: 01924 403617, - ,,,2 ratings Rate it yourself - /Services/opticians/LeaveReview/DefaultView.aspx?id=OP_5J7_179__000001_WF160JU,,,
Premier Vision,OP_5J7_10379__000001_WF160HX,OPT,Morrisons Supermarket,Unit 1,17 Union Street,Heckmondwike,,WF16 0HL,Tel: 01924 409660, - ,,,No ratings yet Rate it yourself - /Services/opticians/LeaveReview/DefaultView.aspx?id=OP_5J7_10379__000001_WF160HX,0,0,
Phipps Opticians,OP_5J7_11208__000001_WF160HW,OPT,63 Market Place,,Heckmondwike,,,WF16 0EZ,Tel: 01924 409334, - ,,,No ratings yet Rate it yourself - /Services/opticians/LeaveReview/DefaultView.aspx?id=OP_5J7_11208__000001_WF160HW,0,0,
Dewsbury Eyecare,OPT_WF134HT_1,OPT,Dewsbury Eyecare,Optometrists and Opticians,Healds road surgery,Dewsbury,West Yorkshire,WF13 4HT,Tel: 01924 570500, - ,,,No ratings yet Rate it yourself - /Services/opticians/LeaveReview/DefaultView.aspx?id=OPT_WF134HT_1,0,0,
Specsavers Opticians,OP_5J7_5684__000001_WF131DQ,OPT,,2-4 Westgate,,Dewsbury,,WF13 1BW,Tel: 01924 469565, - ,,,No ratings yet Rate it yourself - /Services/opticians/LeaveReview/DefaultView.aspx?id=OP_5J7_5684__000001_WF131DQ,0,0,
Phipps Opticians,WF13 1AU__000001_WF131AU,OPT,16 Bond Street,,Dewsbury,,,WF13 1AU,, - ,,,No ratings yet Rate it yourself - /Services/opticians/LeaveReview/DefaultView.aspx?id=WF13 1AU__000001_WF131AU,0,0,
20/20 Saddleworth Limited,OP_5J5_14337__000001_OL36AY,OPT,61 High Street,Uppermill,Oldham,,,OL3 6AP,Tel: 01457 872020, - ,,,No ratings yet Rate it yourself - /Services/opticians/LeaveReview/DefaultView.aspx?id=OP_5J5_14337__000001_OL36AY,0,0,
Thornton & Wright Opticians,OP_5J6_3319__000001_HX38LT,OPT,Co-Operative Shopping Parade,Denholme Gate Road - Hipperholme,,Halifax,,HX3 8LT,Tel: 01422 201519, - ,,,No ratings yet Rate it yourself - /Services/opticians/LeaveReview/DefaultView.aspx?id=OP_5J6_3319__000001_HX38LT,0,0,
Cleckheaton Specsavers,M6D5T,OPT,,4/4B Central Parade,,Cleckheaton,Yorkshire,BD19 3RU,Tel: 01274 033147, - ,,,No ratings yet Rate it yourself - /Services/opticians/LeaveReview/DefaultView.aspx?id=M6D5T,0,0,
Openshaw Opticians,OP_5J7_9334__000001_BD195DN,OPT,Unit 4,16 Cheapside,,Cleckheaton,Yorkshire(West Riding),BD19 5AF,Tel: 01274 878214, - ,,,3 ratings Rate it yourself - /Services/opticians/LeaveReview/DefaultView.aspx?id=OP_5J7_9334__000001_BD195DN,,,yes
"Morton, J R (Wakefield) Ltd",OP_5JE_4681__000001_S755HG,OPT,38 Church Street,Darton,Barnsley,,,S75 5HG,Tel: 01226 385498, - ,,,No ratings yet Rate it yourself - /Services/opticians/LeaveReview/DefaultView.aspx?id=OP_5JE_4681__000001_S755HG,0,0,
Smith & Hughes Opticians,OP_5J7_10175__000001_BD193HS,OPT,37 Northgate,,Cleckheaton,,,BD19 3HS,Tel: 01274 873837, - ,,,No ratings yet Rate it yourself - /Services/opticians/LeaveReview/DefaultView.aspx?id=OP_5J7_10175__000001_BD193HS,0,0,
Supervision Optics,270516HX13JP,OPT,,202 King Cross Road,,Halifax,West Yorkshire,HX1 3JP,Tel: 01422 323211, - ,,,1 rating Rate it yourself - /Services/opticians/LeaveReview/DefaultView.aspx?id=270516HX13JP,,,yes
King Cross Opticians,OP_HX13JP_29903,OPT,,220 King Cross Road,,Halifax,West Yorkshire,HX1 3JP,Tel: 01422 353000, - ,,,No ratings yet Rate it yourself - /Services/opticians/LeaveReview/DefaultView.aspx?id=OP_HX13JP_29903,0,0,
Mackereth Opticians,OP_5J6_8393__000001_HX12SE,OPT,,6 Regent Street,,Halifax,West Yorkshire,HX1 2SE,Tel: 01422 352883, - ,,,No ratings yet Rate it yourself - /Services/opticians/LeaveReview/DefaultView.aspx?id=OP_5J6_8393__000001_HX12SE,0,0,no
Specsavers Opticians,QDT00:280__000002_HX11TQ,OPT,3-5 The Square,Woolshops Shopping Centre,,Halifax,,HX1 1RJ,Tel: 01422 255055, - ,,,No ratings yet Rate it yourself - /Services/opticians/LeaveReview/DefaultView.aspx?id=QDT00:280__000002_HX11TQ,0,0,
Boots-Halifax - Market St,OP_5J6_1088__000002_HX11PB,OPT,7-11 Market Street,,,Halifax,West Yorkshire,HX1 1PB,Tel: 01422352009, - ,,,3 ratings Rate it yourself - /Services/opticians/LeaveReview/DefaultView.aspx?id=OP_5J6_1088__000002_HX11PB,,,
I Care Opticians,OPT_HX11PB_1,OPT,i care opticians,36 Market Street,,Halifax,,HX1 1PB,Tel: 01422 385254, - ,,,No ratings yet Rate it yourself - /Services/opticians/LeaveReview/DefaultView.aspx?id=OPT_HX11PB_1,0,0,
Vision Express (UK) Ltd,OP_5J6_3092__000001_HX11RU,OPT,6 Woolshops,,Halifax,Halifax,,HX1 1RU,Tel: 01422 331018, - ,,,No ratings yet Rate it yourself - /Services/opticians/LeaveReview/DefaultView.aspx?id=OP_5J6_3092__000001_HX11RU,0,0,
Opticare,QDT215__000002_WF132HQ,OPT,,5 Oxford Street,,Batley,,WF17 7PZ,Tel: 01924 4555777, - ,,,1 rating Rate it yourself - /Services/opticians/LeaveReview/DefaultView.aspx?id=QDT215__000002_WF132HQ,,,
Whitakers Opticians Ltd,OP_5J6_11442__000001_HX62AE,OPT,,34 - 36 Wharf Street,,Sowerby Bridge,West Yorkshire,HX6 2AE,Tel: 01422 831030, - ,,,No ratings yet Rate it yourself - /Services/opticians/LeaveReview/DefaultView.aspx?id=OP_5J6_11442__000001_HX62AE,0,0,yes
Date Opticians,OP_5E8_8211__000001_WF58ER,OPT,,5 Wesley Street,,Ossett,West Yorkshire,WF5 8ER,Tel: 01924 260490, - ,,,No ratings yet Rate it yourself - /Services/opticians/LeaveReview/DefaultView.aspx?id=OP_5E8_8211__000001_WF58ER,0,0,yes
Aucklands Opticians Ltd,OP_5E8_8097__000001_WF45AB,OPT,9 High Street,Horbury,,Wakefield,,WF4 5AB,Tel: 01924 272522, - ,,,No ratings yet Rate it yourself - /Services/opticians/LeaveReview/DefaultView.aspx?id=OP_5E8_8097__000001_WF45AB,0,0,
Martyn Kemp Opticians,OP_5EN_5961__000002_S361BX,OPT,Harry Brearley House,Fox Valley Retail Park,Stocksbridge,Sheffield,,S36 2AB,Tel: 0114 288 2287, - ,,,1 rating Rate it yourself - /Services/opticians/LeaveReview/DefaultView.aspx?id=OP_5EN_5961__000002_S361BX,,,
Auckland Opticians Limited,OP_5E8_3184__000001_WF59BL,OPT,,27 Towngate,Ossett,Wakefield,Yorkshire(West Riding),WF5 9BL,Tel: 01924 263313, - ,,,No ratings yet Rate it yourself - /Services/opticians/LeaveReview/DefaultView.aspx?id=OP_5E8_3184__000001_WF59BL,0,0,
Batley Eyecare,C3X5U,OPT,,111 Upper Commercial Street,,Batley,,WF17 5DQ,Tel: 01924 470 234, - ,,,No ratings yet Rate it yourself - /Services/opticians/LeaveReview/DefaultView.aspx?id=C3X5U,0,0,
opticare Eye Care Specialist Ltd,270516HX14NJ,OPT,,276 Queens Road,,Halifax,,HX1 4NJ,Tel: 01422 364453, - ,,,No ratings yet Rate it yourself - /Services/opticians/LeaveReview/DefaultView.aspx?id=270516HX14NJ,0,0,
Whaley Opticians Ltd,OP_5J7_3958__000001_WF175EP,OPT,57 Commercial Street,,Batley,,,WF17 5EP,Tel: 01924 472486, - ,,,No ratings yet Rate it yourself - /Services/opticians/LeaveReview/DefaultView.aspx?id=OP_5J7_3958__000001_WF175EP,0,0,
Specsavers ,OP_5J7_14315__000002_WF175DS,OPT,T/A Batley Visionplus,78 Commercial Street,Batley,Batley,,WF17 5DS,Tel: 01924 350040, - ,,,3 ratings Rate it yourself - /Services/opticians/LeaveReview/DefaultView.aspx?id=OP_5J7_14315__000002_WF175DS,,,
Vision Centre,OP_5J7_8677__000001_WF175DS,OPT,76 Commercial Street,,Batley,,,WF17 5DS,Tel: 01924 444781, - ,,,No ratings yet Rate it yourself - /Services/opticians/LeaveReview/DefaultView.aspx?id=OP_5J7_8677__000001_WF175DS,0,0,
Wyke Opticians,OP_5CG_7482__000001_BD129JD,OPT,55 Towngate,Wyke,Bradford,Bradford ,,BD12 9JD,Tel: 01274 678701, - ,,,3 ratings Rate it yourself - /Services/opticians/LeaveReview/DefaultView.aspx?id=OP_5CG_7482__000001_BD129JD,,,
Wilton Cottage,OP_5J7_7348__000001_WF170AE,OPT,Carlinghow Hill Nursing Home,Carlinghow Hill,Batley,,,WF17 0AB,Tel: 01924 473333, - ,,,No ratings yet Rate it yourself - /Services/opticians/LeaveReview/DefaultView.aspx?id=OP_5J7_7348__000001_WF170AE,0,0,
Eyecare Matters,OPT_WF179EW_1,OPT,,15 Low Lane,Birstall,Batley,,WF17 9EW,Tel: 01924 473813, - ,,,No ratings yet Rate it yourself - /Services/opticians/LeaveReview/DefaultView.aspx?id=OPT_WF179EW_1,0,0,
Sarah Dineen Opticians,11600__000001_SK131AR,OPT,77 Station Road,Hadfield,Glossop,,,SK13 1AR,Tel: 01457 868111, - ,,,1 rating Rate it yourself - /Services/opticians/LeaveReview/DefaultView.aspx?id=11600__000001_SK131AR,,,
Sarah Dineen,OP_5LH_14385__000001_SK136XR,OPT,,107a Station Road,Hadfield,Glossop,,SK13 1AR,Tel: 01457 868111, - ,,,No ratings yet Rate it yourself - /Services/opticians/LeaveReview/DefaultView.aspx?id=OP_5LH_14385__000001_SK136XR,0,0,
Hirst Opticians,OP_5J6_10501__000001_HX26AL,OPT,52 Keighley Road,Ovenden,Halifax,,,HX2 6AL,Tel: 01422 367348, - ,,,No ratings yet Rate it yourself - /Services/opticians/LeaveReview/DefaultView.aspx?id=OP_5J6_10501__000001_HX26AL,0,0,
Mark Andrew Hurst,HX2 8AL__000003_HX28AL,OPT,52 Keighley Road,Ovenden,Halifax,,,HX2 8AL,Tel: 01422 367348, - ,,,No ratings yet Rate it yourself - /Services/opticians/LeaveReview/DefaultView.aspx?id=HX2 8AL__000003_HX28AL,0,0,
Asda Stores Limited,OP_5E8_14318__000002_WF27EQ,OPT,Asda Opticians,Asdale Road,,Wakefield,,WF2 7EQ,Tel: 01924 241820, - ,,,No ratings yet Rate it yourself - /Services/opticians/LeaveReview/DefaultView.aspx?id=OP_5E8_14318__000002_WF27EQ,0,0,
"Anderton, Akbar & Procter Ltd",OP_5LH_9878__000001_OL50JF,OPT,7 George Street,,Ashton-under-Lyne,Mossley,,OL5 0JF,Tel: 01457 832188, - ,,,No ratings yet Rate it yourself - /Services/opticians/LeaveReview/DefaultView.aspx?id=OP_5LH_9878__000001_OL50JF,0,0,
"Menezes,  A R",OL/0536796__000001_S705TA,OPT,,124 - 126 Park Grove,,Barnsley,,S70 1QE,Tel: 07806 941904, - ,,,No ratings yet Rate it yourself - /Services/opticians/LeaveReview/DefaultView.aspx?id=OL/0536796__000001_S705TA,0,0,
"Flack, G",01-23478__000001_S701QA,OPT,52 Park Grove,,Barnsley,South Yorkshire,,S70 1QA,Tel: 01226 211147, - ,,,No ratings yet Rate it yourself - /Services/opticians/LeaveReview/DefaultView.aspx?id=01-23478__000001_S701QA,0,0,
Boots-Glossop,OP_5LH_11303__000001_SK138AZ,OPT,23 High Street West,,,Glossop,Derbyshire,SK13 8AL,Tel: 01457 852523, - ,,,No ratings yet Rate it yourself - /Services/opticians/LeaveReview/DefaultView.aspx?id=OP_5LH_11303__000001_SK138AZ,0,0,
iVision Opticians,OP_5JE_1692__000001_S701YA,OPT,6-8 Peel Square,6-8 Peel Square,South Yorkshire,Barnsley,,S70 1YA,Tel: 01226 731271, - ,,,No ratings yet Rate it yourself - /Services/opticians/LeaveReview/DefaultView.aspx?id=OP_5JE_1692__000001_S701YA,0,0,
Jacksons Opticians,OP_5LH_6157__000002_SK138AZ,OPT,27 High Street West,,Glossop,,,SK13 8AZ,Tel: 01457 852233, - ,,,2 ratings Rate it yourself - /Services/opticians/LeaveReview/DefaultView.aspx?id=OP_5LH_6157__000002_SK138AZ,,,
Scrivens Ltd,OP_5JE_11305__000001_S701SL,OPT,13 Market Street,,,Barnsley,Yorkshire,S70 1SL,Tel: 01226 295293, - ,,,No ratings yet Rate it yourself - /Services/opticians/LeaveReview/DefaultView.aspx?id=OP_5JE_11305__000001_S701SL,0,0,
Direct Optik International,OP_5JE_11308__000001_S702QP,OPT,31 The Arcade,Barnsley,South Yorkshire,,,S70 2QP,Tel: 01226 770660, - ,,,No ratings yet Rate it yourself - /Services/opticians/LeaveReview/DefaultView.aspx?id=OP_5JE_11308__000001_S702QP,0,0,
Barnsley Vision Plus Ltd t/a Specsavers Opticians,OP_5JE_1128__000001_S701SB,OPT,14 Queen Street,,Barnsley,,,S70 1RJ,Tel: 01226 771455, - ,,,No ratings yet Rate it yourself - /Services/opticians/LeaveReview/DefaultView.aspx?id=OP_5JE_1128__000001_S701SB,0,0,
Boots-Barnsley - Queen St,OP_5JE_6108__000002_S702ST,OPT,1 Queen Street,,South Yorkshire,Barnsley,,S70 1RJ,Tel: 01226 730451, - ,,,No ratings yet Rate it yourself - /Services/opticians/LeaveReview/DefaultView.aspx?id=OP_5JE_6108__000002_S702ST,0,0,
Glossop Eyewear,233 5LH__000001_SK138AY,OPT,11 George Street,,Glossop,Derbyshire,,SK13 8AY,Tel: 01457 862411, - ,,,No ratings yet Rate it yourself - /Services/opticians/LeaveReview/DefaultView.aspx?id=233 5LH__000001_SK138AY,0,0,
Optical Express,OP_5JE_8992__000001_S701SJ,OPT,10-18 Queen Street,,,Barnsley,South Yorkshire,S70 1SJ,Tel: 0800 023 2020, - ,,,No ratings yet Rate it yourself - /Services/opticians/LeaveReview/DefaultView.aspx?id=OP_5JE_8992__000001_S701SJ,0,0,
Brian Stephen McGuire,OP_5EL_15000__000002_WF17AS,OPT,T/A Community Eyecare,Evans Business Centre,Monkton Road,,,WF2 7AS,Tel: 01924 888128, - ,,,No ratings yet Rate it yourself - /Services/opticians/LeaveReview/DefaultView.aspx?id=OP_5EL_15000__000002_WF17AS,0,0,
Berrys Opticians,OP_5JE_8952__000001_S702YN,OPT,Berrys Opticians,54 Market Street,,Barnsley,,S70 1SN,Tel: 01226 203074, - ,,,1 rating Rate it yourself - /Services/opticians/LeaveReview/DefaultView.aspx?id=OP_5JE_8952__000001_S702YN,,,
Norwood & Perrin Ltd,OP_5JE_8201__000001_S702JP,OPT,10 Eldon Arcade,Barnsley,South Yorkshire,,,S70 2JP,Tel: 01226 206033, - ,,,No ratings yet Rate it yourself - /Services/opticians/LeaveReview/DefaultView.aspx?id=OP_5JE_8201__000001_S702JP,0,0,
"Raison, C A",OP_5JE_1818__000002_S701RU,OPT,46 Cheapside,Barnsley,South Yorkshire,,,S70 1RU,Tel: 01226 731292, - ,,,No ratings yet Rate it yourself - /Services/opticians/LeaveReview/DefaultView.aspx?id=OP_5JE_1818__000002_S701RU,0,0,
Asda Stores Ltd,OPT_LS27 0BP,OPT,,Howley Park Road,,Morley,,LS27 0BP,Tel: 0113 2012620, - ,,,No ratings yet Rate it yourself - /Services/opticians/LeaveReview/DefaultView.aspx?id=OPT_LS27 0BP,0,0,
Eyecare Anywhere,0206151118,OPT,,Eyecare,Anywhere,Wakefield,,WF3 1EG,Tel: 0774 373 0129, - ,,,No ratings yet Rate it yourself - /Services/opticians/LeaveReview/DefaultView.aspx?id=0206151118,0,0,
Asda Opticians,OP_5JE_11306__000001_S711LN,OPT,Old Mill Lane,,Barnsley,South Yorkshire,,S71 1LN,Tel: 01226 704912, - ,,,No ratings yet Rate it yourself - /Services/opticians/LeaveReview/DefaultView.aspx?id=OP_5JE_11306__000001_S711LN,0,0,
Michael R Foster,OP_5CG_14045__000001_BD61QN,OPT,22 Fair Road,Wibsey,Bradford,,,BD6 1QN,Tel: 01274 604639, - ,,,No ratings yet Rate it yourself - /Services/opticians/LeaveReview/DefaultView.aspx?id=OP_5CG_14045__000001_BD61QN,0,0,
Lees Optical,OPT_OL45AA_1,OPT,,94 High Street,,"Lees, Oldham",,OL4 5AA,Tel: 0161 627 5735, - ,,,No ratings yet Rate it yourself - /Services/opticians/LeaveReview/DefaultView.aspx?id=OPT_OL45AA_1,0,0,
Gail Collier,OP_5J5_7304__000001_OL45AA,OPT,76 High Street,Lees,Oldham,,,OL4 5AA,Tel: 0161 620 3135, - ,,,No ratings yet Rate it yourself - /Services/opticians/LeaveReview/DefaultView.aspx?id=OP_5J5_7304__000001_OL45AA,0,0,