Organisation Name,NACS Code,Organisation Type,Address1,Address2,Address3,Address4,Address5,PostCode,Telephone Number,Opening time,Value  (Opening time),Banding Classification  (Opening time),NHS.UK users rating,Value  (NHS.UK users rating),Banding Classification  (NHS.UK users rating),Car parking (Is there car parking at this organisation?)
Central Opticians,OP_5A9_13606__000001_NW43UT,OPT,11 Vivian Avenue,Hendon,,London,,NW4 3UT,Tel: 0208 202 5165, - ,,,No ratings yet Rate it yourself - /Services/opticians/LeaveReview/DefaultView.aspx?id=OP_5A9_13606__000001_NW43UT,0,0,
Boots-Colindale,OP_5A9_13592__000001_NW96LE,OPT,The Hyde,Edgware Road,,Colindale,,NW9 5EB,Tel: 0208 205 9280, - ,,,No ratings yet Rate it yourself - /Services/opticians/LeaveReview/DefaultView.aspx?id=OP_5A9_13592__000001_NW96LE,0,0,
Hendon Opticians & Contact Lens Centre,0206141422,OPT,"Hendon Opticians, Hendon",127 Brent Street,,Hendon,,NW4 2DX,Tel: 02082025555, - ,,,No ratings yet Rate it yourself - /Services/opticians/LeaveReview/DefaultView.aspx?id=0206141422,0,0,
Vision Express Ltd,OP_5A9_13669__000002_NW43FB,OPT,Brent Cross Shopping Centre,Prince Charles Drive,Hendon,,,NW4 3FB,Tel: 020 8202 6715, - ,,,No ratings yet Rate it yourself - /Services/opticians/LeaveReview/DefaultView.aspx?id=OP_5A9_13669__000002_NW43FB,0,0,
Ben Mirkin Ltd,OP_5A9_3502__000001_NW43FG,OPT,Unit V2 Brent Cross Shopping Centre,Prince Charles Drive,London,,,NW4 3FG,Tel: 020 8202 3771, - ,,,No ratings yet Rate it yourself - /Services/opticians/LeaveReview/DefaultView.aspx?id=OP_5A9_3502__000001_NW43FG,0,0,
Boots-Brent Cross,OP_5A9_6916__000003_NW43FB,OPT,Brent Cross Centre,,,Brent Cross,,NW4 3FB,Tel: 020 8202 7530, - ,,,No ratings yet Rate it yourself - /Services/opticians/LeaveReview/DefaultView.aspx?id=OP_5A9_6916__000003_NW43FB,0,0,
Asda Opticians,OPT_NW9 0AS,OPT,,EDGEWARE ROAD,COLINDALE,HARROW,,NW9 0AS,Tel: 0208 358 2513, - ,,,No ratings yet Rate it yourself - /Services/opticians/LeaveReview/DefaultView.aspx?id=OPT_NW9 0AS,0,0,
Home Opti-Care Ltd,OP_5PX_0000__000001_NW42QH,OPT,64 Danescroft,Brent Street,Hendon,London,,NW4 2QH,Tel: 0208 202 1364, - ,,,No ratings yet Rate it yourself - /Services/opticians/LeaveReview/DefaultView.aspx?id=OP_5PX_0000__000001_NW42QH,0,0,
Kingsbury Opticians,OP_5K5_11069__000001_NW99HE,OPT,528 Kingsbury Road,Kingsbury,London,,,NW9 9HE,Tel: 020 8204 8758, - ,,,No ratings yet Rate it yourself - /Services/opticians/LeaveReview/DefaultView.aspx?id=OP_5K5_11069__000001_NW99HE,0,0,
Stanfields Opticians,OP_5K5_7296__000001_NW99HJ,OPT,572 Kingsbury Road,Kingsbury,London,,,NW9 9HJ,Tel: 020 8204 7124, - ,,,No ratings yet Rate it yourself - /Services/opticians/LeaveReview/DefaultView.aspx?id=OP_5K5_7296__000001_NW99HJ,0,0,
Oak Optometrists,OP_5K6_14957__000002_HA85EP,OPT,61 Burnt Oak Broadway,Edgware,Middlesex,,,HA8 5EP,Tel: 020 8951 4004, - ,,,No ratings yet Rate it yourself - /Services/opticians/LeaveReview/DefaultView.aspx?id=OP_5K6_14957__000002_HA85EP,0,0,
Simon Hoff,OP_5A9_13613__000001_NW119NN,OPT,18 Russell Parade,Golders Green Road,London,,,NW11 9NN,Tel: 020 8458 9992, - ,,,No ratings yet Rate it yourself - /Services/opticians/LeaveReview/DefaultView.aspx?id=OP_5A9_13613__000001_NW119NN,0,0,
A.I. Jones Ltd,OP_5A9_13578__000001_HA80BB,OPT,132 Burnt Oak Broadway,,,Edgware,Middlesex,HA8 0BB,Tel: 020 8952 1102, - ,,,No ratings yet Rate it yourself - /Services/opticians/LeaveReview/DefaultView.aspx?id=OP_5A9_13578__000001_HA80BB,0,0,
R. R. Weiniger,OP_5A9_13670__000001_NW110JB,OPT,69 Cranbourne Gardens,London,,,,NW11 0JB,Tel: 020 8455 1893, - ,,,No ratings yet Rate it yourself - /Services/opticians/LeaveReview/DefaultView.aspx?id=OP_5A9_13670__000001_NW110JB,0,0,
Wiseman and Ashley Optical Centre,OP_5K5_14712__000001_NW99EL,OPT,561 Kingsbury Road,561 Kingsbury High Road,London,Kingsbury,,NW9 9EL,Tel: 020 8204 4348, - ,,,No ratings yet Rate it yourself - /Services/opticians/LeaveReview/DefaultView.aspx?id=OP_5K5_14712__000001_NW99EL,0,0,
Norman Hart Opticians,OP_5K5_13098__000002_NW100AA,OPT,6 Neasden Parade,250 Neasden Lane,London,,,NW10 0AA,Tel: 020 8450 8153, - ,,,No ratings yet Rate it yourself - /Services/opticians/LeaveReview/DefaultView.aspx?id=OP_5K5_13098__000002_NW100AA,0,0,
Judith Stechler,OP_5A9_13614__000001_N33DS,OPT,13 Chessington Avenue,Finchley,London,,,N3 3DS,Tel: 020 8346 5600, - ,,,No ratings yet Rate it yourself - /Services/opticians/LeaveReview/DefaultView.aspx?id=OP_5A9_13614__000001_N33DS,0,0,
Melissa Conway Ltd,OP_5A9_1485__000002_NW110AA,OPT,1193 Finchley Road,,London,,,NW11 0AA,Tel: 020 8201 9292, - ,,,No ratings yet Rate it yourself - /Services/opticians/LeaveReview/DefaultView.aspx?id=OP_5A9_1485__000002_NW110AA,0,0,
EYELEVEL OPTOMETRISTS,OP 1689__000002_NW110QS,OPT,24 Temple Fortune Parade,Finchley Road,London,,,NW11 0QS,Tel: 020 8209 1231, - ,,,No ratings yet Rate it yourself - /Services/opticians/LeaveReview/DefaultView.aspx?id=OP 1689__000002_NW110QS,0,0,
Kusoom Vadgama,OP_5A9_13668__000001_NW116XL,OPT,808 Finchley Road,Temple Fortune,London,,,NW11 6XL,Tel: 020 8458 3802, - ,,,No ratings yet Rate it yourself - /Services/opticians/LeaveReview/DefaultView.aspx?id=OP_5A9_13668__000001_NW116XL,0,0,
Asda Optician,OPT_HA9 9EX,OPT,,FORTY ROAD,,WEMBLEY,,HA9 9EX,Tel: 0208 7826320, - ,,,No ratings yet Rate it yourself - /Services/opticians/LeaveReview/DefaultView.aspx?id=OPT_HA9 9EX,0,0,
Optipharm Opticians,TP9K5,OPT,,29 Bridge Road,Wembley Park,Middlesex,,HA9 9AB,Tel: 020 8904 7488, - ,,,No ratings yet Rate it yourself - /Services/opticians/LeaveReview/DefaultView.aspx?id=TP9K5,0,0,
Euro Optica,OP_5A9_13678__000001_NW11,OPT,80 Golders Green,Golders Green,London,,,NW11 8LN,Tel: 020 8458 2888, - ,,,No ratings yet Rate it yourself - /Services/opticians/LeaveReview/DefaultView.aspx?id=OP_5A9_13678__000001_NW11,0,0,
Boots-Golders Green,OP_5A9_1698__000002_NW118EL,OPT,55 Golders Green Road,,Golders Green,London,,NW11 8EL,Tel: 0208 455 8418, - ,,,No ratings yet Rate it yourself - /Services/opticians/LeaveReview/DefaultView.aspx?id=OP_5A9_1698__000002_NW118EL,0,0,
Boots-Mill Hill,OP_5A9_7236__000001_NW73LL,OPT,14 The Broadway,,Mill Hill,London,,NW7 3LL,Tel: 0208 201 1817, - ,,,No ratings yet Rate it yourself - /Services/opticians/LeaveReview/DefaultView.aspx?id=OP_5A9_7236__000001_NW73LL,0,0,
SPECSAVERS OPTICIANS,OP-5A9-13607__000001_NW118EE,OPT,29 Golders Green Road,Golders Green,London,,,NW11 8EE,Tel: 020 8209 9840, - ,,,No ratings yet Rate it yourself - /Services/opticians/LeaveReview/DefaultView.aspx?id=OP-5A9-13607__000001_NW118EE,0,0,
Scrivens Opticians,OP_5A9_12214__000002_NW73DA,OPT,47 The Broadway,Mill Hill,London,London,,NW7 3DA,Tel: 020 8906 0626, - ,,,No ratings yet Rate it yourself - /Services/opticians/LeaveReview/DefaultView.aspx?id=OP_5A9_12214__000002_NW73DA,0,0,
TESCO OPTICIANS,5K5/ 3036__000002_NW100TL,OPT,TESCO WEMBLEY BRENT PARK,GREAT CENTRAL WAY,,LONDON,,NW10 0TL,Tel: 0345 601 3479, - ,,,No ratings yet Rate it yourself - /Services/opticians/LeaveReview/DefaultView.aspx?id=5K5/ 3036__000002_NW100TL,0,0,
Costco Wholesale UK Limited,O7A7A,OPT,,30 Second Way,,Wembley,,HA9 0YJ,, - ,,,No ratings yet Rate it yourself - /Services/opticians/LeaveReview/DefaultView.aspx?id=O7A7A,0,0,
Costco Wholesale UK Limited,O7A7A,OPT,,30 Second Way,,Wembley,,HA9 0YJ,, - ,,,No ratings yet Rate it yourself - /Services/opticians/LeaveReview/DefaultView.aspx?id=O7A7A,0,0,
Eye Emporium Ltd,000025K5__000004_NW23HT,OPT,173b Cricklewood Broadway,,Cricklewood,London,,NW2 3HT,Tel: 020 8452 2273, - ,,,No ratings yet Rate it yourself - /Services/opticians/LeaveReview/DefaultView.aspx?id=000025K5__000004_NW23HT,0,0,
Globe Opticians,OP_5A9_1689__000002_NW117RR,OPT,618 Finchley Road,,Golders Green,,,NW11 7RR,Tel: 0208 458 3035, - ,,,No ratings yet Rate it yourself - /Services/opticians/LeaveReview/DefaultView.aspx?id=OP_5A9_1689__000002_NW117RR,0,0,
Central Vision Optics Limited,OP-5A9-13606__000001_N31DP,OPT,327 Regents Park Road,Finchley,,London,,N3 1DP,Tel: 020 8343 1122, - ,,,No ratings yet Rate it yourself - /Services/opticians/LeaveReview/DefaultView.aspx?id=OP-5A9-13606__000001_N31DP,0,0,
Opticalise Ophthalmic Opticians,00001__000003_HA30PS,OPT,241 - 243 Preston Road,Harrow,Middlesex,,,HA3 0PS,Tel: 020 8908 4888, - ,,,No ratings yet Rate it yourself - /Services/opticians/LeaveReview/DefaultView.aspx?id=00001__000003_HA30PS,0,0,
Optikal,OP_5A9_689__000001_N32LJ,OPT,352 Regents Park Road,,London,,,N3 2LJ,Tel: 020 8371 0023, - ,,,No ratings yet Rate it yourself - /Services/opticians/LeaveReview/DefaultView.aspx?id=OP_5A9_689__000001_N32LJ,0,0,
Vision Express (uk) Ltd,VISION EXPRESS (UK) LTD_HA8 7BD,OPT,,"Unit 6b, Broadwalk Shopping Centre",,"Edgware, Middlesex,",,HA8 7BD,, - ,,,No ratings yet Rate it yourself - /Services/opticians/LeaveReview/DefaultView.aspx?id=VISION EXPRESS (UK) LTD_HA8 7BD,0,0,
Specsavers Opticians,OP_5A9_13676__000004_HA87BD,OPT,3 Broadwalk Shopping Centre,Station Road,Edgware,,,HA8 7BD,Tel: 020 8952 2262, - ,,,No ratings yet Rate it yourself - /Services/opticians/LeaveReview/DefaultView.aspx?id=OP_5A9_13676__000004_HA87BD,0,0,
icare optician T/a myicare,OP_5LC_610__000001_HA30RN,OPT,23 Trevelyan Cresent,Kenton,,Harrow,Middlesex,HA3 0RN,Tel: 0208 907 7787, - ,,,No ratings yet Rate it yourself - /Services/opticians/LeaveReview/DefaultView.aspx?id=OP_5LC_610__000001_HA30RN,0,0,
Vaid Optometrists,OP_5A9_10905__000001_HA87AA,OPT,132 Station Road,Edgware,Middlesex,,,HA8 7AA,Tel: 020 8381 2641, - ,,,No ratings yet Rate it yourself - /Services/opticians/LeaveReview/DefaultView.aspx?id=OP_5A9_10905__000001_HA87AA,0,0,
Glasses 2 Go,GLASSES2GO_NW2_3EP,OPT,,62 Cricklewood Broadway,,London,,NW2 3EP,, - ,,,No ratings yet Rate it yourself - /Services/opticians/LeaveReview/DefaultView.aspx?id=GLASSES2GO_NW2_3EP,0,0,
Eye Emporium Ltd,OP_5K5_3180__000002_NW102PB,OPT,184 High Road,Willesden,London,,,NW10 2PB,Tel: 020 8459 7689, - ,,,No ratings yet Rate it yourself - /Services/opticians/LeaveReview/DefaultView.aspx?id=OP_5K5_3180__000002_NW102PB,0,0,
Blink Eye Care,OP_5P2_3373__000001_HA63AT,OPT,4 Wigton Gardens,Stanmore,,Middlesex,Middlesex,HA7 1BG,Tel: 0208 816 8549, - ,,,No ratings yet Rate it yourself - /Services/opticians/LeaveReview/DefaultView.aspx?id=OP_5P2_3373__000001_HA63AT,0,0,
Eye Emporium Ltd T/A Open Eye Opticians,OP_5K5_14720__000001_NW102PU,OPT,64 High Road,Willesden,London,,,NW10 2PU,Tel: 020 8830 2727, - ,,,No ratings yet Rate it yourself - /Services/opticians/LeaveReview/DefaultView.aspx?id=OP_5K5_14720__000001_NW102PU,0,0,
K J Popat,OP_5K5_4272__000001_NW102TE,OPT,11 High Road,Willesden,London,,,NW10 2TE,Tel: 020 8451 0754, - ,,,No ratings yet Rate it yourself - /Services/opticians/LeaveReview/DefaultView.aspx?id=OP_5K5_4272__000001_NW102TE,0,0,
Kingsley Opticians,OP_5A9_5525__000003_N31XP,OPT,71 Ballards Lane,Finchley,,London,,N3 1XT,Tel: 020 8346 9636, - ,,,No ratings yet Rate it yourself - /Services/opticians/LeaveReview/DefaultView.aspx?id=OP_5A9_5525__000003_N31XP,0,0,
Simon Gavzey,OP_5A9_13594__000001_HA89TP,OPT,Gavzey Opticians,48 The Market Place,,Hampstead Garden Suburb,,NW11 6JP,Tel: 020 8731 9999, - ,,,No ratings yet Rate it yourself - /Services/opticians/LeaveReview/DefaultView.aspx?id=OP_5A9_13594__000001_HA89TP,0,0,
Home Eyecare Limited,OP_EN191PH_34835,OPT,Falcon House,40 Green Lane,,Edgware,Middlesex,HA8 7PT,Tel: 0208 5906666, - ,,,No ratings yet Rate it yourself - /Services/opticians/LeaveReview/DefaultView.aspx?id=OP_EN191PH_34835,0,0,
Finchley Eyecare,OP_5A9_6337__000001_N32BU,OPT,90 Ballards Lane,Finchley,London,,,N3 2DL,Tel: 020 8343 0780, - ,,,No ratings yet Rate it yourself - /Services/opticians/LeaveReview/DefaultView.aspx?id=OP_5A9_6337__000001_N32BU,0,0,
The Vision Clinic,R9J0E,OPT,,327 Kenton Road,,"Kenton, Harrow",,HA3 0XS,Tel: 020 8907 5270, - ,,,No ratings yet Rate it yourself - /Services/opticians/LeaveReview/DefaultView.aspx?id=R9J0E,0,0,
VISION ONE 2 ONE OPTICIANS,OL01160915K6__000002_HA86RW,OPT,19 Station Parade,Whitchurch Lane,Edgware,Middx,,HA8 6RW,, - ,,,No ratings yet Rate it yourself - /Services/opticians/LeaveReview/DefaultView.aspx?id=OL01160915K6__000002_HA86RW,0,0,
Susan Leighter,OP_5A9_13664__000001_HA88JE,OPT,41 Fairview Way,Edgware,Middlesex,,,HA8 8JE,Tel: 020 8958 2211, - ,,,No ratings yet Rate it yourself - /Services/opticians/LeaveReview/DefaultView.aspx?id=OP_5A9_13664__000001_HA88JE,0,0,
Paul Simon Opticians,OP_5K5_5997__000001_HA96AA,OPT,383 High Road,,Wembley,,,HA9 6AA,Tel: 020 8902 0271, - ,,,No ratings yet Rate it yourself - /Services/opticians/LeaveReview/DefaultView.aspx?id=OP_5K5_5997__000001_HA96AA,0,0,
Optomlink Limited,OP_5GD_2767__000001_HA72LZ,OPT,97 St andrews Drive,,,Stanmore,Middlesex,HA7 2LZ,Tel: 020 8357 7925, - ,,,No ratings yet Rate it yourself - /Services/opticians/LeaveReview/DefaultView.aspx?id=OP_5GD_2767__000001_HA72LZ,0,0,
Betterspecs Wembley Ltd,OP_5K5_14718__000001_HA97AY,OPT,475 - 477 High Road,Wembley,Middlesex,,,HA9 7AY,Tel: 020 8900 0677, - ,,,No ratings yet Rate it yourself - /Services/opticians/LeaveReview/DefaultView.aspx?id=OP_5K5_14718__000001_HA97AY,0,0,
The Eye Cube,OP_5K7_7002__000002_NW61LJ,OPT,256 West End Lane,,London,,,NW6 1LJ,Tel: 020 7433 1333, - ,,,No ratings yet Rate it yourself - /Services/opticians/LeaveReview/DefaultView.aspx?id=OP_5K7_7002__000002_NW61LJ,0,0,
Boots-Wembley,OP_5K5_3809__000001_HA97AG,OPT,449 High Road,,,Wembley,Middlesex,HA9 7AF,Tel: 0208 9022721, - ,,,No ratings yet Rate it yourself - /Services/opticians/LeaveReview/DefaultView.aspx?id=OP_5K5_3809__000001_HA97AG,0,0,
Realeyes The Eye Clinic,01-1853,OPT,,"Unit 7, Wembley Central Square",,Wembley,,HA9 7AJ,Tel: 020 3909 9181, - ,,,No ratings yet Rate it yourself - /Services/opticians/LeaveReview/DefaultView.aspx?id=01-1853,0,0,
Cravitz Opticians,OP_5K5_11249__000001_HA30AZ,OPT,119 Kenton Road,Kenton,Harrow,,,HA3 0AZ,Tel: 020 8907 7860, - ,,,No ratings yet Rate it yourself - /Services/opticians/LeaveReview/DefaultView.aspx?id=OP_5K5_11249__000001_HA30AZ,0,0,
Specsavers Opticians (Wembley Visionplus Ltd T/A),OP_5K5_1786__000002_HA97BH,OPT,476 High Road,Wembley,Middlesex,,,HA9 7AS,Tel: 020 8900 1433, - ,,,No ratings yet Rate it yourself - /Services/opticians/LeaveReview/DefaultView.aspx?id=OP_5K5_1786__000002_HA97BH,0,0,
Insight West Hampstead Opticians,OP_5K7_7494__000001_NW61XN,OPT,247 West End Lane,,London,,,NW6 1XN,Tel: 020 7435 1485, - ,,,No ratings yet Rate it yourself - /Services/opticians/LeaveReview/DefaultView.aspx?id=OP_5K7_7494__000001_NW61XN,0,0,
Specsavers Opticians (Harlesden Visionplus),5K5_NW10 4LT,OPT,,"Bank Buildings, Unit 8, High Street ",,Harlesden,,NW10 4LT,, - ,,,No ratings yet Rate it yourself - /Services/opticians/LeaveReview/DefaultView.aspx?id=5K5_NW10 4LT,0,0,
Eye Professionals Ltd,OP_HA72SA_85045,OPT,,40 Lansdowne Road,Stanmore,London,,HA7 2SA,Tel: 0800 8815207, - ,,,No ratings yet Rate it yourself - /Services/opticians/LeaveReview/DefaultView.aspx?id=OP_HA72SA_85045,0,0,
Eyegen Opticians,OP_5K7_5007__000001_NW62DP,OPT,,298 Kilburn Road,,London,,NW6 2DB,Tel: 0207 625 8925, - ,,,No ratings yet Rate it yourself - /Services/opticians/LeaveReview/DefaultView.aspx?id=OP_5K7_5007__000001_NW62DP,0,0,
Eyegen Opticians (DOM),OP_5LC_622__000001_NW62DB,OPT,298 Kilburn High Road,,,London,,NW6 2DB,Tel: 0207 625 8925, - ,,,No ratings yet Rate it yourself - /Services/opticians/LeaveReview/DefaultView.aspx?id=OP_5LC_622__000001_NW62DB,0,0,
Eyecraft Optometrist Ltd,OP_5K5_213__000001_HA04TL,OPT,26 Ealing Road,,Wembley,,,HA0 4TL,Tel: 020 8902 9908, - ,,,No ratings yet Rate it yourself - /Services/opticians/LeaveReview/DefaultView.aspx?id=OP_5K5_213__000001_HA04TL,0,0,
Eyecloud Opticians,OP_5K5_6725__000002_NW104NS,OPT,75 High Street,Harlesden,,London,,NW10 4NS,Tel: 020 8961 0077, - ,,,No ratings yet Rate it yourself - /Services/opticians/LeaveReview/DefaultView.aspx?id=OP_5K5_6725__000002_NW104NS,0,0,
Vision Direct Opticians,OP_5K5_1673__000001_NW108TS,OPT,6 Acton Lane,Harlesden,London,,,NW10 8TS,Tel: 020 8965 6707, - ,,,No ratings yet Rate it yourself - /Services/opticians/LeaveReview/DefaultView.aspx?id=OP_5K5_1673__000001_NW108TS,0,0,
Vision Express Hampstead,OP_5K7_7003__000001_NW31DL,OPT,54 Heath Street,,London,,,NW3 1DL,Tel: 020 7431 0031, - ,,,No ratings yet Rate it yourself - /Services/opticians/LeaveReview/DefaultView.aspx?id=OP_5K7_7003__000001_NW31DL,0,0,
David Hillel,HILLEL123,OPT,,119 High Road,East Finchley,London,,N2 8AG,Tel: 020 8444 2233, - ,,,No ratings yet Rate it yourself - /Services/opticians/LeaveReview/DefaultView.aspx?id=HILLEL123,0,0,
Miltons Eyecare,OP_5K7_12749__000001_NW36TE,OPT,38 Heath Street,,London,,,NW3 6TE,Tel: 020 7794 4477, - ,,,No ratings yet Rate it yourself - /Services/opticians/LeaveReview/DefaultView.aspx?id=OP_5K7_12749__000001_NW36TE,0,0,
Dolland and Aitchison,OP_5K7_10607__000002_NW36TE,OPT,26 Heath Street,,Hampstead,London,,NW3 6TE,Tel: 0207 7946101, - ,,,No ratings yet Rate it yourself - /Services/opticians/LeaveReview/DefaultView.aspx?id=OP_5K7_10607__000002_NW36TE,0,0,
Stewart Duncan,OP_5A9_4396__000002_N29ED,OPT,126 High Road,East Finchley,London,London,,N2 9ED,Tel: 020 8883 2020, - ,,,No ratings yet Rate it yourself - /Services/opticians/LeaveReview/DefaultView.aspx?id=OP_5A9_4396__000002_N29ED,0,0,
Eye 2 Eye Opticians Harrow,HARR5K6__000002_HA38SA,OPT,6 Warwick Parade,"Belmont Ciircle , Kenton Lane",Harrow,Middlesex,,HA3 8SA,Tel: 020 8907 8128, - ,,,No ratings yet Rate it yourself - /Services/opticians/LeaveReview/DefaultView.aspx?id=HARR5K6__000002_HA38SA,0,0,
Panoptica,OP_5A9_10056__000001_N29PN,OPT,56 High Road,East Finchley,London,,,N2 9PN,Tel: 020 8883 6693, - ,,,No ratings yet Rate it yourself - /Services/opticians/LeaveReview/DefaultView.aspx?id=OP_5A9_10056__000001_N29PN,0,0,
David Clulow,OP_5K7_6461__000001_NW31QX,OPT,73 Hampstead High Street,,London,,,NW3 1QX,Tel: 020 7435 8445, - ,,,No ratings yet Rate it yourself - /Services/opticians/LeaveReview/DefaultView.aspx?id=OP_5K7_6461__000001_NW31QX,0,0,
InView Opticians,OP_5K6_13916__000001_HA38RF,OPT,15 Belmont Circle,Harrow,Middlesex,HARROW,Middlesex,HA3 8RF,Tel: 020 8907 3454, - ,,,No ratings yet Rate it yourself - /Services/opticians/LeaveReview/DefaultView.aspx?id=OP_5K6_13916__000001_HA38RF,0,0,
Socialeyes Optics Ltd,OP_5A9_13604__000001_N120EL,OPT,4 Nether Street,North Finchley,London,,,N12 0EL,Tel: 020 8445 9661, - ,,,No ratings yet Rate it yourself - /Services/opticians/LeaveReview/DefaultView.aspx?id=OP_5A9_13604__000001_N120EL,0,0,
Ashdown & Collins,OP_5K5_14713__000001_NW103JP,OPT,118 Chamberlayne Road,Kensal Rise,London,,,NW10 3JP,Tel: 020 8969 0881, - ,,,No ratings yet Rate it yourself - /Services/opticians/LeaveReview/DefaultView.aspx?id=OP_5K5_14713__000001_NW103JP,0,0,
Kensal Eyes Opticians,OP_5K5_4919__000001_NW103NR,OPT,1 Bridge House,Chamberlayne Road,London,,,NW10 3NR,Tel: 020 8969 4109, - ,,,No ratings yet Rate it yourself - /Services/opticians/LeaveReview/DefaultView.aspx?id=OP_5K5_4919__000001_NW103NR,0,0,
Boots-North Finchley,OP_5A9_7229__000001_N129QD,OPT,734 High Road,,North Finchley,London,,N12 9QD,Tel: 0208 343 7721, - ,,,No ratings yet Rate it yourself - /Services/opticians/LeaveReview/DefaultView.aspx?id=OP_5A9_7229__000001_N129QD,0,0,
Scrivens Opticians,OP_5A9_7641__000002_N128PR,OPT,752 High Road,North Finchley,London,London,,N12 9QG,Tel: 020 8445 5881, - ,,,No ratings yet Rate it yourself - /Services/opticians/LeaveReview/DefaultView.aspx?id=OP_5A9_7641__000002_N128PR,0,0,
Arthur Morrice,OP_5K7_136__000001_NW31ND,OPT,62 Rosslyn Hill,Hampstead,London,,,NW3 1ND,Tel: 020 7794 4112, - ,,,No ratings yet Rate it yourself - /Services/opticians/LeaveReview/DefaultView.aspx?id=OP_5K7_136__000001_NW31ND,0,0,
Boots-Kilburn,OP_5K7_7995__000001_NW64JD,OPT,132 High Road,,Kilburn,London,,NW6 4JD,Tel: 0207 624 5166, - ,,,No ratings yet Rate it yourself - /Services/opticians/LeaveReview/DefaultView.aspx?id=OP_5K7_7995__000001_NW64JD,0,0,
Specsavers Opticians,5A9_OPT01__000002_N129QU,OPT,796 High Road,North Finchley,London,,,N12 9QU,Tel: 020 8492 9750, - ,,,No ratings yet Rate it yourself - /Services/opticians/LeaveReview/DefaultView.aspx?id=5A9_OPT01__000002_N129QU,0,0,
Optique 20:20 ,OP_5K7_6008__000002_NW36LU,OPT,"Unit 1a, The O2 Centre, 255 Finchley Road",,London,,,NW3 6LU,Tel: 020 7431 6902, - ,,,No ratings yet Rate it yourself - /Services/opticians/LeaveReview/DefaultView.aspx?id=OP_5K7_6008__000002_NW36LU,0,0,
Aristone Opticians,OP_5K5_1709__000001_NW67HR,OPT,137 Kilburn High Road,,London,,,NW6 7HR,Tel: 020 7372 1525, - ,,,No ratings yet Rate it yourself - /Services/opticians/LeaveReview/DefaultView.aspx?id=OP_5K5_1709__000001_NW67HR,0,0,
Boots-Stanmore,-805K6__000001_HA74DJ,OPT,47 The Broadway,,,Stanmore,Middlesex,HA7 4DJ,Tel: 0208 954 4513, - ,,,No ratings yet Rate it yourself - /Services/opticians/LeaveReview/DefaultView.aspx?id=-805K6__000001_HA74DJ,0,0,
Specsavers Opticians,OP_5K7_1678__000001_NW64HY,OPT,116 Kilburn High Road,Kilburn,London,,,NW6 4HY,Tel: 020 7328 5655, - ,,,No ratings yet Rate it yourself - /Services/opticians/LeaveReview/DefaultView.aspx?id=OP_5K7_1678__000001_NW64HY,0,0,
Sidfiz Optique,04BR,OPT,Sid Fiz Optique,46 Salusbury Road,,London,,NW6 6NN,Tel: 02076256694, - ,,,No ratings yet Rate it yourself - /Services/opticians/LeaveReview/DefaultView.aspx?id=04BR,0,0,
Sidfiz Optic,OPT_NW66NN_1,OPT,,46 Salusbury Road,,London,,NW6 6NN,, - ,,,No ratings yet Rate it yourself - /Services/opticians/LeaveReview/DefaultView.aspx?id=OPT_NW66NN_1,0,0,
Sidfiz Optic,OPT_NW66NN_2,OPT,,46 Salusbury Road,,London,,NW6 6NN,, - ,,,No ratings yet Rate it yourself - /Services/opticians/LeaveReview/DefaultView.aspx?id=OPT_NW66NN_2,0,0,
Dave Opticians,OP_5K6_22__000001_HA74AW,OPT,2 Church Road,,Stanmore,,,HA7 4AW,Tel: 020 8954 7707, - ,,,No ratings yet Rate it yourself - /Services/opticians/LeaveReview/DefaultView.aspx?id=OP_5K6_22__000001_HA74AW,0,0,
Adams Opticians (Stanmore),OP_5K6_74__000001_HA73DP,OPT,3 Church Road,.,Stanmore,Middx,,HA7 4AR,Tel: 020 8954 2133, - ,,,No ratings yet Rate it yourself - /Services/opticians/LeaveReview/DefaultView.aspx?id=OP_5K6_74__000001_HA73DP,0,0,
Brush & Fowler Opticians,OP_5K6_3376__000001_HA12JN,OPT,3 Manor Parade,Sheepcote Road,Harrow,,,HA1 2JN,Tel: 0208 427 0279, - ,,,No ratings yet Rate it yourself - /Services/opticians/LeaveReview/DefaultView.aspx?id=OP_5K6_3376__000001_HA12JN,0,0,
Spec Savers Swiss Cottage,SPECSAVERS_NW3_6LB,OPT,,171 Finchley Road,,London,,NW3 6LB,Tel: 02076449990, - ,,,No ratings yet Rate it yourself - /Services/opticians/LeaveReview/DefaultView.aspx?id=SPECSAVERS_NW3_6LB,0,0,
Icon the Opticians,OP_5K7_6005__000001_NW32QB,OPT,57 Southend Road,,London,,,NW3 2QB,Tel: 020 7435 5888, - ,,,No ratings yet Rate it yourself - /Services/opticians/LeaveReview/DefaultView.aspx?id=OP_5K7_6005__000001_NW32QB,0,0,
Icon the Opticians (DOM),5LA_OPT_25__000008_NW32QB,OPT,23 Southend Road,,London,,,NW3 2QB,Tel: 0207 435 5888, - ,,,No ratings yet Rate it yourself - /Services/opticians/LeaveReview/DefaultView.aspx?id=5LA_OPT_25__000008_NW32QB,0,0,
I S Cohen,OP_5K7_6006__000003_NW64HJ,OPT,46 Kilburn High Road,,London,,,NW6 4HJ,Tel: 020 7624 9277, - ,,,No ratings yet Rate it yourself - /Services/opticians/LeaveReview/DefaultView.aspx?id=OP_5K7_6006__000003_NW64HJ,0,0,
Specsavers Opticians (Harrow Visionplus Ltd),OP_5K6_13138__000002_HA12TA,OPT,289 Station Road,,Harrow,,,HA1 2TA,Tel: 020 8424 0244, - ,,,No ratings yet Rate it yourself - /Services/opticians/LeaveReview/DefaultView.aspx?id=OP_5K6_13138__000002_HA12TA,0,0,
Malcom Coates,OP_5K7_1239__000001_NW35EP,OPT,11 New College Parade,,London,,,NW3 5EP,Tel: 020 7586 3866, - ,,,No ratings yet Rate it yourself - /Services/opticians/LeaveReview/DefaultView.aspx?id=OP_5K7_1239__000001_NW35EP,0,0,