Organisation Name,NACS Code,Organisation Type,Address1,Address2,Address3,Address4,Address5,PostCode,Telephone Number,Opening time,Value  (Opening time),Banding Classification  (Opening time),NHS.UK users rating,Value  (NHS.UK users rating),Banding Classification  (NHS.UK users rating),Car parking (Is there car parking at this organisation?)
Alford Opticians (Garry Crome),OP_5H9_6976__000001_LN139AF,OPT,,1 South Street,,Alford,Lincolnshire,LN13 9AF,Tel: 01507 462992, - ,,,3 ratings Rate it yourself - /Services/opticians/LeaveReview/DefaultView.aspx?id=OP_5H9_6976__000001_LN139AF,,,no
G J Drew & Partners,OP_5H9_8302__000001_LN122AF,OPT,47 Victoria Road,,Mablethorpe,,,LN12 2AF,Tel: 01507 473202, - ,,,No ratings yet Rate it yourself - /Services/opticians/LeaveReview/DefaultView.aspx?id=OP_5H9_8302__000001_LN122AF,0,0,
Lydia Hayes Opticians,C-0105-Q59,OPT,,1 & 2 Regents Mews,Victoria Road,Lincolnshire,Lincolnshire,LN12 2AQ,Tel: 01507 472842, - ,,,7 ratings Rate it yourself - /Services/opticians/LeaveReview/DefaultView.aspx?id=C-0105-Q59,,,
Rawlinsons Optometrists,OP_5N9_0096__000001_PE252AH,OPT,,1 Lumley Avenue,,Skegness,Lincolnshire,PE25 2AH,Tel: 01754 766773, - ,,,2 ratings Rate it yourself - /Services/opticians/LeaveReview/DefaultView.aspx?id=OP_5N9_0096__000001_PE252AH,,,no
Specsavers Opticians,OP_5H9_12159__000002_PE253NG,OPT,66 Lumley Road,,Skegness,,,PE25 3NG,Tel: 01754 898000, - ,,,No ratings yet Rate it yourself - /Services/opticians/LeaveReview/DefaultView.aspx?id=OP_5H9_12159__000002_PE253NG,0,0,
Boots-Skegness,OP_5H9_10633__000001_PE253NU,OPT,Unit 7,The Hildreds Shopping Centre,,Skegness,Lincolnshire,PE25 3NU,Tel: 01754 763 146, - ,,,1 rating Rate it yourself - /Services/opticians/LeaveReview/DefaultView.aspx?id=OP_5H9_10633__000001_PE253NU,,,
Spilsby Opticians,OP_5H9_8478__000001_PE235EF,OPT,6 Church Street,,Spilsby,,,PE23 5EF,Tel: 01790 753948, - ,,,No ratings yet Rate it yourself - /Services/opticians/LeaveReview/DefaultView.aspx?id=OP_5H9_8478__000001_PE235EF,0,0,no
Louth Vision Centre,OP_5H9_13828__000001_LN119NR,OPT,,Louth Vision Centre,4 Market Place,Louth,Lincolnshire,LN11 9NR,Tel: 01507 609499, - ,,,3 ratings Rate it yourself - /Services/opticians/LeaveReview/DefaultView.aspx?id=OP_5H9_13828__000001_LN119NR,,,
Stephen Hewitt eyecare,OP_5H9_13823__000001_LN119JG,OPT,21 Mercer Row,Louth,,.,,LN11 9JG,Tel: 01507 607276, - ,,,No ratings yet Rate it yourself - /Services/opticians/LeaveReview/DefaultView.aspx?id=OP_5H9_13823__000001_LN119JG,0,0,
Horncastle Opticians (Garry Crome),OP_5H9_8477__000002_LN95BL,OPT,,6a High Street,,Horncastle,Lincolnshire,LN9 5BL,Tel: 01507 526205, - ,,,No ratings yet Rate it yourself - /Services/opticians/LeaveReview/DefaultView.aspx?id=OP_5H9_8477__000002_LN95BL,0,0,no
Boots-Horncastle,OP_5H9_5286__000001_LN95HZ,OPT,,10 Bridge Street,Horncastle,Lincolnshire,,LN9 5HZ,Tel: 01507 527044, - ,,,No ratings yet Rate it yourself - /Services/opticians/LeaveReview/DefaultView.aspx?id=OP_5H9_5286__000001_LN95HZ,0,0,
Peebles & Hilton,OP_5H9_2611__000002_LN44SG,OPT,,16 Silver Street,,Coningsby,Lincolnshire,LN4 4SG,Tel: 01526 344556, - ,,,No ratings yet Rate it yourself - /Services/opticians/LeaveReview/DefaultView.aspx?id=OP_5H9_2611__000002_LN44SG,0,0,no
Opticks Opticians,OP_5H9_2501__000001_LN106QL,OPT,,7 Station Road,Woodhall Spa,Lincolnshire,,LN10 6QL,Tel: 01526 352236, - ,,,No ratings yet Rate it yourself - /Services/opticians/LeaveReview/DefaultView.aspx?id=OP_5H9_2501__000001_LN106QL,0,0,
Tesco Opticians,OPT_5AN_019__000002_DN359QR,OPT,Hewitt Retail Park,Hewitt Avenue,Cleethorpes,North East Lincolnshire,,DN35 9QR,Tel: 0345 601 3479, - ,,,No ratings yet Rate it yourself - /Services/opticians/LeaveReview/DefaultView.aspx?id=OPT_5AN_019__000002_DN359QR,0,0,
"Keen, King & Jones",OP_5AN_7360__000001_DN370LS,OPT,4 Kirkgate,Waltham,Grimsby,,,DN37 0LS,Tel: 01472 824643, - ,,,No ratings yet Rate it yourself - /Services/opticians/LeaveReview/DefaultView.aspx?id=OP_5AN_7360__000001_DN370LS,0,0,
David Hallgate Optometrists (I.O.E Ltd),OP_5H9_13813__000001_PE216SE,OPT,,86/88 Wide Bargate,,Boston,Lincolnshire,PE21 6SE,Tel: 01205 310 710, - ,,,1 rating Rate it yourself - /Services/opticians/LeaveReview/DefaultView.aspx?id=OP_5H9_13813__000001_PE216SE,,,yes
Enderbys of Boston,OP_5H9_13814__000002_PE216SE,OPT,,84 Wide Bargate,,Boston,,PE21 6SE,Tel: 01205 311181, - ,,,1 rating Rate it yourself - /Services/opticians/LeaveReview/DefaultView.aspx?id=OP_5H9_13814__000002_PE216SE,,,no
Peebles & Hilton,OP_5H9_2503__000002_PE216PA,OPT,Lyndon,Tawney Street,,Boston,,PE21 6PA,Tel: 01205 365395, - ,,,No ratings yet Rate it yourself - /Services/opticians/LeaveReview/DefaultView.aspx?id=OP_5H9_2503__000002_PE216PA,0,0,yes
Dollond & Aitchison,OP_5H9_5271__000001_PE216LS,OPT,8 Market Place,Boston,Lincolnshire,,,PE21 6LS,Tel: 01205 351414, - ,,,No ratings yet Rate it yourself - /Services/opticians/LeaveReview/DefaultView.aspx?id=OP_5H9_5271__000001_PE216LS,0,0,
R & T Opticians,OP_5H9_2127__000001_PE216EU,OPT,30-32 Dolphin Lane,,Boston,,,PE21 6EU,Tel: 01205 355550, - ,,,1 rating Rate it yourself - /Services/opticians/LeaveReview/DefaultView.aspx?id=OP_5H9_2127__000001_PE216EU,,,yes
Specsavers Opticians,OP_5H9_1081__000002_PE216EH,OPT,29a Market Place,,Boston,,,PE21 6EH,Tel: 01205 353263, - ,,,No ratings yet Rate it yourself - /Services/opticians/LeaveReview/DefaultView.aspx?id=OP_5H9_1081__000002_PE216EH,0,0,
Boots-Boston,OP_PE216LS_17891,OPT,,8 Market Place,,Boston,Lincolnshire,PE21 6EH,Tel: 01205 351414, - ,,,No ratings yet Rate it yourself - /Services/opticians/LeaveReview/DefaultView.aspx?id=OP_PE216LS_17891,0,0,
Specsavers Opticians,OP_5AN_14619__000001_DN353HL,OPT,36 St Peters Avenue,,Cleethorpes,,,DN35 8HL,Tel: 01472 608840, - ,,,No ratings yet Rate it yourself - /Services/opticians/LeaveReview/DefaultView.aspx?id=OP_5AN_14619__000001_DN353HL,0,0,
Stephens & Drew Opticians,OP_5AN_13993__000001_DN358JZ,OPT,9-11 Cross Street,Cleethorpes,North East Lincolnshire,Cleethorpes,,DN35 8JZ,Tel: 01472 691636, - ,,,No ratings yet Rate it yourself - /Services/opticians/LeaveReview/DefaultView.aspx?id=OP_5AN_13993__000001_DN358JZ,0,0,
Ulph & Kearns Ltd,OP_5AN_1981__000002_DN332EP,OPT,1 Scartho Court,Pinfold Lane,Scartho,,,DN33 2EW,Tel: 01472 870164, - ,,,No ratings yet Rate it yourself - /Services/opticians/LeaveReview/DefaultView.aspx?id=OP_5AN_1981__000002_DN332EP,0,0,
Scartho Eyecare Limited,OPT TAN-082__000003_DN332LY,OPT,11 Waltham Road,Scartho,Grimsby,North East Lincolnshire,,DN33 2LY,Tel: 01472 877235, - ,,,1 rating Rate it yourself - /Services/opticians/LeaveReview/DefaultView.aspx?id=OPT TAN-082__000003_DN332LY,,,
Hunstanton EyeCare,OP_5CY_7973__000001_PE365HD,OPT,Hunstanton Eyecare,44 Church Street,,Hunstanton,Norfolk,PE36 5HD,Tel: 01485 532326, - ,,,No ratings yet Rate it yourself - /Services/opticians/LeaveReview/DefaultView.aspx?id=OP_5CY_7973__000001_PE365HD,0,0,
Specsavers Hunstanton,TP98K,OPT,,29 High Street,,Hunstanton,,PE36 5AB,Tel: 01485 500490, - ,,,No ratings yet Rate it yourself - /Services/opticians/LeaveReview/DefaultView.aspx?id=TP98K,0,0,
Anglia Regional Co-operative Society Ltd,5PQ0001__000001_PE365EP,OPT,69 Westgate,,Hunstanton,Norfolk,,PE36 5EP,Tel: 01485 532381, - ,,,No ratings yet Rate it yourself - /Services/opticians/LeaveReview/DefaultView.aspx?id=5PQ0001__000001_PE365EP,0,0,
Asda Vision,OPT_5AN 018__000002_DN329DL,OPT,Holles Street,,Grimsby,North East Lincolnshire,,DN32 9DL,Tel: 01472 243124, - ,,,No ratings yet Rate it yourself - /Services/opticians/LeaveReview/DefaultView.aspx?id=OPT_5AN 018__000002_DN329DL,0,0,
Optic Direct,OPT-TAN-020__000001_DN311LH,OPT,2 East Street,Mary Gate,,Grimsby,,DN31 1LH,Tel: 01472 267779, - ,,,No ratings yet Rate it yourself - /Services/opticians/LeaveReview/DefaultView.aspx?id=OPT-TAN-020__000001_DN311LH,0,0,
Boots-Grimsby - Victoria St,OP_5AN_1566__000001_DN311UU,OPT,45 Victoria Street,,,Grimsby,Lincolnshire,DN31 1UU,Tel: 01472 242997, - ,,,No ratings yet Rate it yourself - /Services/opticians/LeaveReview/DefaultView.aspx?id=OP_5AN_1566__000001_DN311UU,0,0,
Specsavers Opticians,OP_5AN_12791__000001_DN311EY,OPT,31-33 Victoria St West,,,Grimsby,,DN31 1DL,Tel: 01472 242018, - ,,,1 rating Rate it yourself - /Services/opticians/LeaveReview/DefaultView.aspx?id=OP_5AN_12791__000001_DN311EY,,,
Vision Express (UK) Ltd,OP_5AN_12319__000001_DN311TB,OPT,2 Newbiggin Walk,Freshney Place,Grimsby,,,DN31 1ED,Tel: 01472 344244, - ,,,No ratings yet Rate it yourself - /Services/opticians/LeaveReview/DefaultView.aspx?id=OP_5AN_12319__000001_DN311TB,0,0,
Boots-Grimsby - Friargate,OP_5AN_11689__000002_DN311ED,OPT,17 Friargate,,Freshney Place,Grimsby,,DN31 1QQ,Tel: 01472 342 209, - ,,,No ratings yet Rate it yourself - /Services/opticians/LeaveReview/DefaultView.aspx?id=OP_5AN_11689__000002_DN311ED,0,0,
Mackay & Rollett Limited,OP_5AN_13995__000002_DN312AB,OPT,14 Dudley Street,Grimsby,North East Lincolnshire,,,DN31 2AB,Tel: 01472 354040, - ,,,No ratings yet Rate it yourself - /Services/opticians/LeaveReview/DefaultView.aspx?id=OP_5AN_13995__000002_DN312AB,0,0,
"Keen, King & Jones",OP_5AN_4059__000001_DN312BD,OPT,3 Lynton Parade,Cromwell Road,Grimsby,,,DN31 2BD,Tel: 01472 360900, - ,,,No ratings yet Rate it yourself - /Services/opticians/LeaveReview/DefaultView.aspx?id=OP_5AN_4059__000001_DN312BD,0,0,
Greenwood Opticians,OP_5D2_3341__000001_LN83HL,OPT,25 Market Place,,,Market Rasen,Lincolnshire,LN8 3HL,Tel: 01673 842265, - ,,,8 ratings Rate it yourself - /Services/opticians/LeaveReview/DefaultView.aspx?id=OP_5D2_3341__000001_LN83HL,,,
Smith & Walker (Optometrists) Ltd,OP_5AN_8150__000001_DN402AE,OPT,2 Kennedy Way,,,Immingham,,DN40 2AE,Tel: 01469 572702, - ,,,No ratings yet Rate it yourself - /Services/opticians/LeaveReview/DefaultView.aspx?id=OP_5AN_8150__000001_DN402AE,0,0,
Richards Optometrists,OP_5JM_3774__000002_NR231AG,OPT,15 Station Road,,Wells-Next-The-Sea,,,NR23 1AG,Tel: 01328 711014, - ,,,No ratings yet Rate it yourself - /Services/opticians/LeaveReview/DefaultView.aspx?id=OP_5JM_3774__000002_NR231AG,0,0,
