Organisation Name,NACS Code,Organisation Type,Address1,Address2,Address3,Address4,Address5,PostCode,Telephone Number,Opening time,Value  (Opening time),Banding Classification  (Opening time),NHS.UK users rating,Value  (NHS.UK users rating),Banding Classification  (NHS.UK users rating),Car parking (Is there car parking at this organisation?)
Boots-Stroud,OP_5KY_11005__000001_GL51AU,OPT,9-10 High Street,,Stroud,Gloucestershire,,GL5 1AU,Tel: 01453 764699, - ,,,No ratings yet Rate it yourself - /Services/opticians/LeaveReview/DefaultView.aspx?id=OP_5KY_11005__000001_GL51AU,0,0,
Specsavers Opticians,OP_5KY_2376__000001_GL53DE,OPT,22 King Street,,Stroud,Gloucestershire,,GL5 3DE,Tel: 01453 766601, - ,,,No ratings yet Rate it yourself - /Services/opticians/LeaveReview/DefaultView.aspx?id=OP_5KY_2376__000001_GL53DE,0,0,
Stroud Vision Centre,OP_5KY_9164__000001_GL53DX,OPT,3 George Street,,Stroud,Gloucestershire,,GL5 3DX,Tel: 01453 764103, - ,,,No ratings yet Rate it yourself - /Services/opticians/LeaveReview/DefaultView.aspx?id=OP_5KY_9164__000001_GL53DX,0,0,
"Tesco Opticians, Gloucester",OP_GL34AA_30175,OPT,,"Gloucester Business Park, Delta Way",,Gloucester,,GL3 4AA,Tel: 0345 601 3479, - ,,,No ratings yet Rate it yourself - /Services/opticians/LeaveReview/DefaultView.aspx?id=OP_GL34AA_30175,0,0,
John Weygang Optometrists,OP_5KX_1556__000001_GL45UA,OPT,4 Abbeymead Avenue,Abbeymead,Gloucester,Gloucestershire,,GL4 5UA,Tel: 01452 306807, - ,,,No ratings yet Rate it yourself - /Services/opticians/LeaveReview/DefaultView.aspx?id=OP_5KX_1556__000001_GL45UA,0,0,
John Weygang Optometrists,OP_5KX_3798__000001_GL33TL,OPT,39 Hucclecote Road,Hucclecote,Gloucester,Gloucestershire,,GL3 3TL,Tel: 01452 619100, - ,,,No ratings yet Rate it yourself - /Services/opticians/LeaveReview/DefaultView.aspx?id=OP_5KX_3798__000001_GL33TL,0,0,
Kodak Lens Optician Outlet,TP817,OPT,,Unit 2 Morrison Centre,,Cheltenham,,GL51 3BW,, - ,,,No ratings yet Rate it yourself - /Services/opticians/LeaveReview/DefaultView.aspx?id=TP817,0,0,
Signet Armorlite Europe Limited (Kodak Lens Designer Outlet),OP_GL22DE_30173,OPT,,"Davy Way, Waterwells Business Park",,Quedgeley,Gloucestershire,GL2 2DE,Tel: 01452 887470, - ,,,No ratings yet Rate it yourself - /Services/opticians/LeaveReview/DefaultView.aspx?id=OP_GL22DE_30173,0,0,
Bailey Opticians,OP_5KY_3374__000001_GL102NG,OPT,15 High Street,Bailey Opticians,15 High Street,Stonehouse,Gloucestershire,GL10 2NG,Tel: 01453 823399, - ,,,No ratings yet Rate it yourself - /Services/opticians/LeaveReview/DefaultView.aspx?id=OP_5KY_3374__000001_GL102NG,0,0,
John Weygang Optometrist - Quedgeley,,OPT,,100 Bristol Road,,Quedgeley,,GL2 4NA,Tel: 01452 721108, - ,,,N/A - Data not available,,,
"Tesco Opticians, Quedgeley",OP_GL24PF_30174,OPT,,Bristol Road,,Quedgeley,,GL2 4PF,Tel: 0345 677 9567, - ,,,No ratings yet Rate it yourself - /Services/opticians/LeaveReview/DefaultView.aspx?id=OP_GL24PF_30174,0,0,
Asda Stores Ltd,TP1JR,OPT,,Bruton Way,,Gloucester,,GL1 1DS,Tel: 01452 833012, - ,,,No ratings yet Rate it yourself - /Services/opticians/LeaveReview/DefaultView.aspx?id=TP1JR,0,0,
Finch Optical,L5C9G,OPT,,7 Old Market,,Nailsworth,Gloucestershire,GL6 0DU,Tel: 01453 834339, - ,,,No ratings yet Rate it yourself - /Services/opticians/LeaveReview/DefaultView.aspx?id=L5C9G,0,0,
Gloucester Royal Hospital,OP_5KX_3397__000003_GL13NN,OPT,Great Western Road,,Gloucester,Gloucestershire,,GL1 3NN,Tel: 08454 222222, - ,,,No ratings yet Rate it yourself - /Services/opticians/LeaveReview/DefaultView.aspx?id=OP_5KX_3397__000003_GL13NN,0,0,
Vision Care for Homeless People ,W3O7X,OPT,Gloucester City Mission,72 Eastgate Street,,Gloucester,Gloucestershire,GL1 1QN,Tel: 07468 492341, - ,,,No ratings yet Rate it yourself - /Services/opticians/LeaveReview/DefaultView.aspx?id=W3O7X,0,0,
Norville Opticians Gloucester,OP_5KX_1218__000001_GL11PN,OPT,65 Eastgate Street,,Gloucester,Gloucestershire,,GL1 1PN,Tel: 01452 522033, - ,,,No ratings yet Rate it yourself - /Services/opticians/LeaveReview/DefaultView.aspx?id=OP_5KX_1218__000001_GL11PN,0,0,
John Weygang Optometrists,D4R1G,OPT,,"31 Morley Avenue, Churchdown",,Gloucester,,GL3 2BL,Tel: 01452 855484, - ,,,No ratings yet Rate it yourself - /Services/opticians/LeaveReview/DefaultView.aspx?id=D4R1G,0,0,
John Weygang & Partners,OP_5KX_8694__000001_GL11DP,OPT,26 Clarence Street,26 Clarence Street,Gloucester,Gloucester,,GL1 1DP,Tel: 01452 522118, - ,,,No ratings yet Rate it yourself - /Services/opticians/LeaveReview/DefaultView.aspx?id=OP_5KX_8694__000001_GL11DP,0,0,
Boots Opticians - Gloucester (38-46 Eastgate Street),GL1 1PU_18173,OPT,,38-46 Eastgate Street,,Gloucester,Gloucestershire,GL1 1PU,Tel: 01452 419429, - ,,,No ratings yet Rate it yourself - /Services/opticians/LeaveReview/DefaultView.aspx?id=GL1 1PU_18173,0,0,
Vision Express,5KX  8928__000004_GL11XH,OPT,,Eastgate Centre,,Gloucester,Gloucestershire,GL1 1XH,Tel: 01452 421122, - ,,,No ratings yet Rate it yourself - /Services/opticians/LeaveReview/DefaultView.aspx?id=5KX  8928__000004_GL11XH,0,0,
Specsavers Opticians,OP_5KX_13099__000003_GL11XH,OPT,4-6 Bell Walk,Eastgate Shopping Centre,Gloucester,Gloucestershire,,GL1 1XH,Tel: 01452 505163, - ,,,No ratings yet Rate it yourself - /Services/opticians/LeaveReview/DefaultView.aspx?id=OP_5KX_13099__000003_GL11XH,0,0,
Boots Opticians - Gloucester (7 Eastgate Street),OP_5KX_10567__000001_GL11NS,OPT,7 Eastgate Street,,,Gloucester,Gloucestershire,GL1 1NS,Tel: 01452 524 175, - ,,,No ratings yet Rate it yourself - /Services/opticians/LeaveReview/DefaultView.aspx?id=OP_5KX_10567__000001_GL11NS,0,0,
The Vision Centre,TP1L0,OPT,,50 Northgate Street,,Gloucester,,GL1 1SQ,Tel: 0145 2410494, - ,,,No ratings yet Rate it yourself - /Services/opticians/LeaveReview/DefaultView.aspx?id=TP1L0,0,0,
Independent Eyecare Centre,OP_5KW_12701__000002_GL537NG,OPT,144 Bath Road,,Cheltenham,Gloucestershire,,GL53 7NG,Tel: 01242 222802, - ,,,No ratings yet Rate it yourself - /Services/opticians/LeaveReview/DefaultView.aspx?id=OP_5KW_12701__000002_GL537NG,0,0,
Cheltenham General Hospital,OP_5KW_1846__000001_GL537AN,OPT,Department Of Optometry,Sandford Road,Cheltenham,Gloucestershire,,GL53 7AN,Tel: 08454 223 203, - ,,,No ratings yet Rate it yourself - /Services/opticians/LeaveReview/DefaultView.aspx?id=OP_5KW_1846__000001_GL537AN,0,0,
R J Holmes Opticians ,OP_5KY_1317__000001_GL71QA,OPT,6 Castle Street,,Cirencester,Gloucestershire,,GL7 1QA,Tel: 01285 650136, - ,,,No ratings yet Rate it yourself - /Services/opticians/LeaveReview/DefaultView.aspx?id=OP_5KY_1317__000001_GL71QA,0,0,
Smith & Swepson Opticians,OP_5KW_915__000001_GL501QB,OPT,,2 Imperial Square,,Cheltenham,Gloucestershire,GL50 1QB,Tel: 01242 243800, - ,,,No ratings yet Rate it yourself - /Services/opticians/LeaveReview/DefaultView.aspx?id=OP_5KW_915__000001_GL501QB,0,0,
Specsavers Opticians,5KY 20003__000003_GL71JH,OPT,"30, Cricklade Street",,Cirencester,Gloucestershire,,GL7 1JH,Tel: 01285 648610, - ,,,No ratings yet Rate it yourself - /Services/opticians/LeaveReview/DefaultView.aspx?id=5KY 20003__000003_GL71JH,0,0,
Haine & Smith Opticians,OP_5KY_2823__000002_GL71JH,OPT,,6c Cricklade Street,,Cirencester,Gloucestershire,GL7 1JH,Tel: 01285 651161, - ,,,No ratings yet Rate it yourself - /Services/opticians/LeaveReview/DefaultView.aspx?id=OP_5KY_2823__000002_GL71JH,0,0,
Boots-Cirencester,OP_5KY_1665__000001_GL71JH,OPT,42 Cricklade Street,,Cirencester,Gloucestershire,,GL7 1JH,Tel: 01285 654579, - ,,,No ratings yet Rate it yourself - /Services/opticians/LeaveReview/DefaultView.aspx?id=OP_5KY_1665__000001_GL71JH,0,0,
Keith Holland & Associates,OP_5KW_3508__000002_GL503DT,OPT,27 St. Georges Road,,,Cheltenham,,GL50 3DT,Tel: 01242 233500, - ,,,No ratings yet Rate it yourself - /Services/opticians/LeaveReview/DefaultView.aspx?id=OP_5KW_3508__000002_GL503DT,0,0,no
Scrivens,OP_5KW_10764__000001_GL517RY,OPT,"60, Edinburgh Place",Coronation Square,,Cheltenham,Gloucestershire,GL51 7SA,Tel: 01242 235220, - ,,,No ratings yet Rate it yourself - /Services/opticians/LeaveReview/DefaultView.aspx?id=OP_5KW_10764__000001_GL517RY,0,0,
Harper and Cooper Opticians,CO-5293,OPT,,4 Ormond Place,,Cheltenham  ,,GL50 1JD,, - ,,,No ratings yet Rate it yourself - /Services/opticians/LeaveReview/DefaultView.aspx?id=CO-5293,0,0,
Philip Kersey & Partners,OP_5KY_7259__000003_GL72PF,OPT,56 Dyer Street,,Cirencester,Gloucestershire,,GL7 2PF,Tel: 01285 641999, - ,,,No ratings yet Rate it yourself - /Services/opticians/LeaveReview/DefaultView.aspx?id=OP_5KY_7259__000003_GL72PF,0,0,
Leightons Opticians & Hearing Care,OP_5KY_11919__000001_GL72PP,OPT,,Merchants House,39-41 Dyer Street,Cirencester,Gloucestershire,GL7 2PP,Tel: 01285 651 344, - ,,,No ratings yet Rate it yourself - /Services/opticians/LeaveReview/DefaultView.aspx?id=OP_5KY_11919__000001_GL72PP,0,0,
Ellis and Killpartrick,OP_5KW_12083__000002_GL501JZ,OPT,Regent Arcade,Regent Street,Cheltenham,Gloucestershire,,GL50 1JZ,Tel: 01242 228686, - ,,,No ratings yet Rate it yourself - /Services/opticians/LeaveReview/DefaultView.aspx?id=OP_5KW_12083__000002_GL501JZ,0,0,
Boots-Cheltenham - Regent Arcade,OP_5KW_3677__000001_GL501JZ,OPT,"Unit 40, Regent Arcade",Regent Street,Cheltenham,Gloucestershire,,GL50 1JZ,Tel: 01242 577811, - ,,,No ratings yet Rate it yourself - /Services/opticians/LeaveReview/DefaultView.aspx?id=OP_5KW_3677__000001_GL501JZ,0,0,
Chapman  Opticians,OP_5KW_11399__000003_GL501JZ,OPT,12 Regent Arcade,Regent Street,Cheltenham,Gloucestershire,,GL50 1JZ,Tel: 01242 584358, - ,,,No ratings yet Rate it yourself - /Services/opticians/LeaveReview/DefaultView.aspx?id=OP_5KW_11399__000003_GL501JZ,0,0,
Cheltenham Medical Eye Centre,OP_5KW_1077__000003_GL501HE,OPT,11 Regent Street,,Cheltenham,Gloucestershire,,GL50 1HE,Tel: 01242 221442, - ,,,No ratings yet Rate it yourself - /Services/opticians/LeaveReview/DefaultView.aspx?id=OP_5KW_1077__000003_GL501HE,0,0,
Optical Express,5KW20008__000001_GL501DG,OPT,,43-45 Promenade,,Cheltenham,Gloucestershire,GL50 1PY,Tel: 0800 0232020, - ,,,No ratings yet Rate it yourself - /Services/opticians/LeaveReview/DefaultView.aspx?id=5KW20008__000001_GL501DG,0,0,
Vision Express ,OP_5KW_12700__000001_GL501DQ,OPT,188 High Street,,Cheltenham,Gloucestershire,,GL50 1EP,Tel: 01242 238777, - ,,,No ratings yet Rate it yourself - /Services/opticians/LeaveReview/DefaultView.aspx?id=OP_5KW_12700__000001_GL501DQ,0,0,
Boots-Cheltenham - High St,OP_5KW_8341__000002_GL501DB,OPT,197-199 High Street,,,Cheltenham,Gloucestershire,GL50 1DB,Tel: 01242 580730, - ,,,No ratings yet Rate it yourself - /Services/opticians/LeaveReview/DefaultView.aspx?id=OP_5KW_8341__000002_GL501DB,0,0,
David Clulow,OP_5KW_11848__000001_GL501EN,OPT,213 High Street,,Cheltenham,Gloucestershire,,GL50 3HH,Tel: 01242 250005, - ,,,No ratings yet Rate it yourself - /Services/opticians/LeaveReview/DefaultView.aspx?id=OP_5KW_11848__000001_GL501EN,0,0,
Specsavers Opticians,OP_5KW_128__000002_GL503HF,OPT,206. High Street,,,Cheltenham,,GL50 3HF,Tel: 01242 224314, - ,,,No ratings yet Rate it yourself - /Services/opticians/LeaveReview/DefaultView.aspx?id=OP_5KW_128__000002_GL503HF,0,0,
"Tesco’s Opticians, Cheltenham ",OP_GL518JQ_30717,OPT,,Colletts Drive,,Cheltenham,,GL51 8JQ,Tel: 0345 601 3479, - ,,,No ratings yet Rate it yourself - /Services/opticians/LeaveReview/DefaultView.aspx?id=OP_GL518JQ_30717,0,0,
Maddox Eyecare,01-21036,OPT,,St Paul’s Medical Centre,,Cheltenham,,GL50 4DP,Tel: 01242 282059, - ,,,No ratings yet Rate it yourself - /Services/opticians/LeaveReview/DefaultView.aspx?id=01-21036,0,0,yes
"Tesco’s Opticians, Cirencester",OP_GL71NP_30718,OPT,,"Kings Meadow, Cricklade Road",,Cirencester,,GL7 1NP,Tel: 0345 601 3479, - ,,,No ratings yet Rate it yourself - /Services/opticians/LeaveReview/DefaultView.aspx?id=OP_GL71NP_30718,0,0,
Specsavers Cheltenham North West,111003012017,OPT,,Sainsburys Superstore,,Cheltenham,,GL51 9RR,, - ,,,No ratings yet Rate it yourself - /Services/opticians/LeaveReview/DefaultView.aspx?id=111003012017,0,0,
Haine & Smith Opticians,OP_5KY_10964__000001_GL88JG,OPT,,5 Church Street,Tetbury,Gloucestershire,,GL8 8JG,Tel: 01666 503610, - ,,,No ratings yet Rate it yourself - /Services/opticians/LeaveReview/DefaultView.aspx?id=OP_5KY_10964__000001_GL88JG,0,0,
Poole Optometry,OP_5KY_10708__000002_GL88JG,OPT,2 Church Street,,Tetbury,Gloucestershire,,GL8 8JG,Tel: 01666 502913, - ,,,No ratings yet Rate it yourself - /Services/opticians/LeaveReview/DefaultView.aspx?id=OP_5KY_10708__000002_GL88JG,0,0,
Guilford & Carter Optometrists,OP_5KW_3199__000002_GL524LR,OPT,21 Church Road,Bishop's Cleeve,Cheltenham,Gloucestershire,Gloucestershire,GL52 8LR,Tel: 01242 675964, - ,,,No ratings yet Rate it yourself - /Services/opticians/LeaveReview/DefaultView.aspx?id=OP_5KW_3199__000002_GL524LR,0,0,yes
Armstrong and North Opticians,OP_5KY_2433__000002_GL114AA,OPT,24a Parsonage Street,,Dursley,Gloucestershire,,GL11 4AA,Tel: 01453 545816, - ,,,No ratings yet Rate it yourself - /Services/opticians/LeaveReview/DefaultView.aspx?id=OP_5KY_2433__000002_GL114AA,0,0,
Cotswold Eye Care Centre,OP_5KW_6379__000002_GL545LJ,OPT,High Street,,Winchcombe,Gloucestershire,Gloucestershire,GL54 5LJ,Tel: 01242 604654, - ,,,No ratings yet Rate it yourself - /Services/opticians/LeaveReview/DefaultView.aspx?id=OP_5KW_6379__000002_GL545LJ,0,0,
Mobileyes,OP_GL127JE_30172,OPT,,70 Court Orchard,,Wotton Under edge,Gloucestershire,GL12 7JE,Tel: 01453 842061, - ,,,No ratings yet Rate it yourself - /Services/opticians/LeaveReview/DefaultView.aspx?id=OP_GL127JE_30172,0,0,
Haine & Smith Opticians,OP_5K4_617__000002_SN169AU,OPT,,25 High Street,,Malmesbury,Wiltshire,SN16 9AA,Tel: 01666 824234, - ,,,No ratings yet Rate it yourself - /Services/opticians/LeaveReview/DefaultView.aspx?id=OP_5K4_617__000002_SN169AU,0,0,
Armstrong and North Opticians,OP_5KY_361__000001_GL127ES,OPT,5 Long Street,,,Wotton-under-Edge,,GL12 7ES,Tel: 01453 842851, - ,,,No ratings yet Rate it yourself - /Services/opticians/LeaveReview/DefaultView.aspx?id=OP_5KY_361__000001_GL127ES,0,0,
Malmesbury Opticians,OP_5K4_1516__000001_SN169AG,OPT,57 High Street,57 High Street,Malmesbury,Malmesbury,,SN16 9AG,Tel: 01666 822444, - ,,,No ratings yet Rate it yourself - /Services/opticians/LeaveReview/DefaultView.aspx?id=OP_5K4_1516__000001_SN169AG,0,0,
Norville Opticians,OP_5KY_5619__000002_GL127DE,OPT,13 High Street,,Wotton-under-Edge,,,GL12 7DE,Tel: 01453 842129, - ,,,No ratings yet Rate it yourself - /Services/opticians/LeaveReview/DefaultView.aspx?id=OP_5KY_5619__000002_GL127DE,0,0,
"O'Brien,Wrench & Lowcock Opticians",OP_5KW_912__000001_GL205PP,OPT,Theocsbury House,18-20 Barton Street,,Tewkesbury,Gloucestershire,GL20 5PP,Tel: 01684 850212, - ,,,No ratings yet Rate it yourself - /Services/opticians/LeaveReview/DefaultView.aspx?id=OP_5KW_912__000001_GL205PP,0,0,yes
Scrivens,OP_5KW_5468__000003_GL205LQ,OPT,"131, High Street",,,Tewkesbury,Gloucestershire,GL20 5JR,Tel: 01684 299904, - ,,,No ratings yet Rate it yourself - /Services/opticians/LeaveReview/DefaultView.aspx?id=OP_5KW_5468__000003_GL205LQ,0,0,
Zeiss Opticians,OP_5KW_1158__000002_GL205JZ,OPT,108 High Street,,Tewkesbury,Gloucestershire,,GL20 5JZ,Tel: 01684 292201, - ,,,No ratings yet Rate it yourself - /Services/opticians/LeaveReview/DefaultView.aspx?id=OP_5KW_1158__000002_GL205JZ,0,0,
Boots Opticians,TP4GR,OPT,,99-100 High Street,,Tewkesbury,,GL20 5JZ,, - ,,,No ratings yet Rate it yourself - /Services/opticians/LeaveReview/DefaultView.aspx?id=TP4GR,0,0,
Specsavers Opticians,OP_5KW_6582__000002_GL205LQ,OPT,Unit 3,Bishops Walk,Tewkesbury,Gloucestershire,,GL20 5LQ,Tel: 01684 273027, - ,,,No ratings yet Rate it yourself - /Services/opticians/LeaveReview/DefaultView.aspx?id=OP_5KW_6582__000002_GL205LQ,0,0,
Andrew Rhys Evans (Optometrists),OP_5K4_273__000001_SN66DF,OPT,82 High Street,,Cricklade,,,SN6 6DF,Tel: 01793 750415, - ,,,No ratings yet Rate it yourself - /Services/opticians/LeaveReview/DefaultView.aspx?id=OP_5K4_273__000001_SN66DF,0,0,
Armstrong and North Opticians,OP_5KY_1260__000001_GL139BP,OPT,Market Place,,Berkeley,Gloucestershire,,GL13 9BP,Tel: 01453 511436, - ,,,No ratings yet Rate it yourself - /Services/opticians/LeaveReview/DefaultView.aspx?id=OP_5KY_1260__000001_GL139BP,0,0,
Fairford Opticians,5KY 20004__000002_GL74AD,OPT,11 High Street,,Fairford,Gloucestershire,,GL7 4AD,Tel: 01285 713313, - ,,,No ratings yet Rate it yourself - /Services/opticians/LeaveReview/DefaultView.aspx?id=5KY 20004__000002_GL74AD,0,0,
Ashton & Daniels,OP_5KX_8207__000001_GL181AH,OPT,,35 Broad Street,Newent,Gloucestershire,,GL18 1AQ,Tel: 01531 820677, - ,,,No ratings yet Rate it yourself - /Services/opticians/LeaveReview/DefaultView.aspx?id=OP_5KX_8207__000001_GL181AH,0,0,
David Kear Opticians,OP_5KX_7702__000001_GL142NL,OPT,David Kear Opticians,1 Woodside Street,,Cinderford,Gloucestershire,GL14 2NL,Tel: 01594 823690, - ,,,No ratings yet Rate it yourself - /Services/opticians/LeaveReview/DefaultView.aspx?id=OP_5KX_7702__000001_GL142NL,0,0,
Ashton & Daniels,OP_5KX_8206__000001_GL142SU,OPT,63 High Street,,Cinderford,Gloucestershire,,GL14 2SU,Tel: 01594 823666, - ,,,No ratings yet Rate it yourself - /Services/opticians/LeaveReview/DefaultView.aspx?id=OP_5KX_8206__000001_GL142SU,0,0,
Armstrong & North ,OP_5KX_8237__000001_GL155RF,OPT,36-38 Newerne Street,,,Lydney,Gloucestershire,GL15 5RF,Tel: 01594 844956, - ,,,No ratings yet Rate it yourself - /Services/opticians/LeaveReview/DefaultView.aspx?id=OP_5KX_8237__000001_GL155RF,0,0,
David Kear Opticians,OP_5KX_12478__000001_GL155HJ,OPT,David Kear Opticians,9 Hill Street,,Lydney,Gloucestershire,GL15 5HJ,Tel: 01594 846233 (ext. 843233), - ,,,No ratings yet Rate it yourself - /Services/opticians/LeaveReview/DefaultView.aspx?id=OP_5KX_12478__000001_GL155HJ,0,0,
ASDA Vision Centre,OP_5K3_14300__000002_SN254BG,OPT,North Swindon District Centre,Thamesdown Drive,,Swindon,,SN25 4BG,Tel: 01793 707882, - ,,,No ratings yet Rate it yourself - /Services/opticians/LeaveReview/DefaultView.aspx?id=OP_5K3_14300__000002_SN254BG,0,0,
Specsavers (Royal Wootton Bassett),T0H0Q,OPT,,10-11 Borough Fields Shopping Centre,,Royal Wootton Bassett,Wiltshire,SN4 7AX,Tel: 01793 290062, - ,,,No ratings yet Rate it yourself - /Services/opticians/LeaveReview/DefaultView.aspx?id=T0H0Q,0,0,
Haine & Smith Opticians,OP_5K4_2814__000003_SN47AY,OPT,,140 High Street,,Royal Wootton Bassett,Wiltshire,SN4 7AY,Tel: 01793 853298, - ,,,No ratings yet Rate it yourself - /Services/opticians/LeaveReview/DefaultView.aspx?id=OP_5K4_2814__000003_SN47AY,0,0,
Upton Vision,P0N0A,OPT,,6 Old Street,,Worcester,,WR8 0HA,, - ,,,No ratings yet Rate it yourself - /Services/opticians/LeaveReview/DefaultView.aspx?id=P0N0A,0,0,
Glasses Direct,OP5M2_148__000001_SN169RU,OPT,Unit 3 Gemini House,Groundwell Industrial Estate,Swindon,Wiltshire,,SN25 5AJ,Tel: 08456 882020, - ,,,No ratings yet Rate it yourself - /Services/opticians/LeaveReview/DefaultView.aspx?id=OP5M2_148__000001_SN169RU,0,0,
The Opticians,5KY 20005__000001_GL541AA,OPT,Sheep Street,Sheep Street,Stow On The Wold,Gloucestershire,,GL54 1AA,Tel: 01451 830554, - ,,,No ratings yet Rate it yourself - /Services/opticians/LeaveReview/DefaultView.aspx?id=5KY 20005__000001_GL541AA,0,0,
R J Holmes Opticians Ltd,OP_5K3_8460__000003_SN57DL,OPT,West Swindon District Centre,Tewkesbury Way,Swindon,,,SN5 7DL,Tel: 01793 870011, - ,,,No ratings yet Rate it yourself - /Services/opticians/LeaveReview/DefaultView.aspx?id=OP_5K3_8460__000003_SN57DL,0,0,
Armstrong & North Opticians,OP_5A3_9099__000002_BS376BA,OPT,23 High Street,Chipping Sodbury,,Bristol,,BS37 6BA,Tel: 01454 313865, - ,,,No ratings yet Rate it yourself - /Services/opticians/LeaveReview/DefaultView.aspx?id=OP_5A3_9099__000002_BS376BA,0,0,
Haine & Smith Opticians,OP_5K3_3933__000002_SN67AG,OPT,22 High Street,Highworth,,Wiltshire,,SN6 7AG,Tel: 01793 762204, - ,,,No ratings yet Rate it yourself - /Services/opticians/LeaveReview/DefaultView.aspx?id=OP_5K3_3933__000002_SN67AG,0,0,
Chris Cheshire Opticians,0000001__000001_WR127AA,OPT,17 The Green,High Street,,Broadway,Worcestershire,WR12 7AA,Tel: 01386 859109, - ,,,No ratings yet Rate it yourself - /Services/opticians/LeaveReview/DefaultView.aspx?id=0000001__000001_WR127AA,0,0,
Specsavers Opticians,OP_5A3_57__000003_BS374AP,OPT,,2-4 North Walk,Yate,Bristol,,BS37 4AR,Tel: 01454 325 473, - ,,,No ratings yet Rate it yourself - /Services/opticians/LeaveReview/DefaultView.aspx?id=OP_5A3_57__000003_BS374AP,0,0,
Armstrong & North Opticians,OP_5A3_8987__000004_BS374AP,OPT,2a North Walk,Yate,,Bristol,,BS37 4AP,Tel: 01454 313594, - ,,,No ratings yet Rate it yourself - /Services/opticians/LeaveReview/DefaultView.aspx?id=OP_5A3_8987__000004_BS374AP,0,0,
Haine & Smith Opticians,OP_5K3_1303__000002_SN26AN,OPT,,105 Cricklade Road,,Swindon,Wiltshire,SN2 1AB,Tel: 01793 522572, - ,,,No ratings yet Rate it yourself - /Services/opticians/LeaveReview/DefaultView.aspx?id=OP_5K3_1303__000002_SN26AN,0,0,
Norville Opticians,OP_5A3_6669__000002_BS352AZ,OPT,6 Horseshoe Lane,Thornbury,Bristol,,,BS35 2AZ,Tel: 01454 418366, - ,,,No ratings yet Rate it yourself - /Services/opticians/LeaveReview/DefaultView.aspx?id=OP_5A3_6669__000002_BS352AZ,0,0,
Specsavers Thornbury,OP_BS352BH_85641,OPT,,12 St Mary's Way,,Thornbury,,BS35 2BH,Tel: 01454 414341, - ,,,No ratings yet Rate it yourself - /Services/opticians/LeaveReview/DefaultView.aspx?id=OP_BS352BH_85641,0,0,
Thornbury Eye Centre,OP_5A3_2095__000001_BS122BH,OPT,1 St. Mary's Way,1 St Marys Way,Bristol,Thornbury,,BS35 2BH,Tel: 01454 416929, - ,,,No ratings yet Rate it yourself - /Services/opticians/LeaveReview/DefaultView.aspx?id=OP_5A3_2095__000001_BS122BH,0,0,
Optical Express,SN1 1DA_83473,OPT,,"1st Floor (suite 4), Minton Place, Station Road",,Swindon,,SN1 1DA,Tel: 08000232020, - ,,,No ratings yet Rate it yourself - /Services/opticians/LeaveReview/DefaultView.aspx?id=SN1 1DA_83473,0,0,
Armstrong & North Opticians,OP_5A3_4376__000003_BS352AR,OPT,45 High Street,Thornbury,,Bristol,,BS35 2AR,Tel: 01454 419662, - ,,,No ratings yet Rate it yourself - /Services/opticians/LeaveReview/DefaultView.aspx?id=OP_5A3_4376__000003_BS352AR,0,0,
Johnson & Furze Optometrists and Opticians,OP_5A3_14815__000001_BS352BJ,OPT,7 Chapel Street,Thornbury,,Bristol,,BS35 2BJ,Tel: 01454 411760, - ,,,No ratings yet Rate it yourself - /Services/opticians/LeaveReview/DefaultView.aspx?id=OP_5A3_14815__000001_BS352BJ,0,0,
David Kear Opticians,OP_5KX_4608__000002_GL168HF,OPT,David Kear Opticians,10 High Street,,Coleford,Gloucestershire,GL16 8HF,Tel: 01594 832968, - ,,,No ratings yet Rate it yourself - /Services/opticians/LeaveReview/DefaultView.aspx?id=OP_5KX_4608__000002_GL168HF,0,0,
Tesco Opticians,TP41K,OPT,,Ocotal Way,,Swindon,,SN1 2EH,, - ,,,No ratings yet Rate it yourself - /Services/opticians/LeaveReview/DefaultView.aspx?id=TP41K,0,0,
The White Horse Optical Practice,OP_5K3_5315__000006_SN11LF,OPT,,7 Brunel Plaza,,Swindon,,SN1 1LF,Tel: 01793 432751, - ,,,No ratings yet Rate it yourself - /Services/opticians/LeaveReview/DefaultView.aspx?id=OP_5K3_5315__000006_SN11LF,0,0,
Boots-Swindon - Brunel Plaza (in Boots UK),OP_5K3_11563__000002_SN11LF,OPT,3 Brunel Plaza,,,Swindon,Wiltshire,SN1 1LF,Tel: 01793 433060, - ,,,No ratings yet Rate it yourself - /Services/opticians/LeaveReview/DefaultView.aspx?id=OP_5K3_11563__000002_SN11LF,0,0,
Vision Express (UK) Ltd,OP_5K3_11424__000001_SN11JY,OPT,83 Regent Street,,Swindon,,,SN1 1JY,Tel: 01793 491194, - ,,,No ratings yet Rate it yourself - /Services/opticians/LeaveReview/DefaultView.aspx?id=OP_5K3_11424__000001_SN11JY,0,0,
G D Monk,OP_5K3_14301__000004_SN11SD,OPT,35 Havelock Street,,Swindon,Wiltshire,,SN1 1SD,Tel: 01793 523743, - ,,,No ratings yet Rate it yourself - /Services/opticians/LeaveReview/DefaultView.aspx?id=OP_5K3_14301__000004_SN11SD,0,0,