Organisation Name,NACS Code,Organisation Type,Address1,Address2,Address3,Address4,Address5,PostCode,Telephone Number,Opening time,Value  (Opening time),Banding Classification  (Opening time),NHS.UK users rating,Value  (NHS.UK users rating),Banding Classification  (NHS.UK users rating),Car parking (Is there car parking at this organisation?)
Tesco Opticians,OPT_5AN_019__000002_DN359QR,OPT,Hewitt Retail Park,Hewitt Avenue,Cleethorpes,North East Lincolnshire,,DN35 9QR,Tel: 0345 601 3479, - ,,,No ratings yet Rate it yourself - /Services/opticians/LeaveReview/DefaultView.aspx?id=OPT_5AN_019__000002_DN359QR,0,0,
"Keen, King & Jones",OP_5AN_7360__000001_DN370LS,OPT,4 Kirkgate,Waltham,Grimsby,,,DN37 0LS,Tel: 01472 824643, - ,,,No ratings yet Rate it yourself - /Services/opticians/LeaveReview/DefaultView.aspx?id=OP_5AN_7360__000001_DN370LS,0,0,
Ulph & Kearns Ltd,OP_5AN_1981__000002_DN332EP,OPT,1 Scartho Court,Pinfold Lane,Scartho,,,DN33 2EW,Tel: 01472 870164, - ,,,No ratings yet Rate it yourself - /Services/opticians/LeaveReview/DefaultView.aspx?id=OP_5AN_1981__000002_DN332EP,0,0,
Scartho Eyecare Limited,OPT TAN-082__000003_DN332LY,OPT,11 Waltham Road,Scartho,Grimsby,North East Lincolnshire,,DN33 2LY,Tel: 01472 877235, - ,,,No ratings yet Rate it yourself - /Services/opticians/LeaveReview/DefaultView.aspx?id=OPT TAN-082__000003_DN332LY,0,0,
Specsavers Opticians,OP_5AN_14619__000001_DN353HL,OPT,36 St Peters Avenue,,Cleethorpes,,,DN35 8HL,Tel: 01472 608840, - ,,,No ratings yet Rate it yourself - /Services/opticians/LeaveReview/DefaultView.aspx?id=OP_5AN_14619__000001_DN353HL,0,0,
Stephens & Drew Opticians,OP_5AN_13993__000001_DN358JZ,OPT,9-11 Cross Street,Cleethorpes,North East Lincolnshire,Cleethorpes,,DN35 8JZ,Tel: 01472 691636, - ,,,No ratings yet Rate it yourself - /Services/opticians/LeaveReview/DefaultView.aspx?id=OP_5AN_13993__000001_DN358JZ,0,0,
Optic Direct,OPT-TAN-020__000001_DN311LH,OPT,2 East Street,Mary Gate,,Grimsby,,DN31 1LH,Tel: 01472 267779, - ,,,No ratings yet Rate it yourself - /Services/opticians/LeaveReview/DefaultView.aspx?id=OPT-TAN-020__000001_DN311LH,0,0,
Boots-Grimsby - Victoria St,OP_5AN_1566__000001_DN311UU,OPT,45 Victoria Street,,,Grimsby,Lincolnshire,DN31 1UU,Tel: 01472 242997, - ,,,No ratings yet Rate it yourself - /Services/opticians/LeaveReview/DefaultView.aspx?id=OP_5AN_1566__000001_DN311UU,0,0,
Specsavers Opticians,OP_5AN_12791__000001_DN311EY,OPT,31-33 Victoria St West,,,Grimsby,,DN31 1DL,Tel: 01472 242018, - ,,,No ratings yet Rate it yourself - /Services/opticians/LeaveReview/DefaultView.aspx?id=OP_5AN_12791__000001_DN311EY,0,0,
Asda Vision,OPT_5AN 018__000002_DN329DL,OPT,Holles Street,,Grimsby,North East Lincolnshire,,DN32 9DL,Tel: 01472 243124, - ,,,No ratings yet Rate it yourself - /Services/opticians/LeaveReview/DefaultView.aspx?id=OPT_5AN 018__000002_DN329DL,0,0,
Mackay & Rollett Limited,OP_5AN_13995__000002_DN312AB,OPT,14 Dudley Street,Grimsby,North East Lincolnshire,,,DN31 2AB,Tel: 01472 354040, - ,,,No ratings yet Rate it yourself - /Services/opticians/LeaveReview/DefaultView.aspx?id=OP_5AN_13995__000002_DN312AB,0,0,
Vision Express (UK) Ltd,OP_5AN_12319__000001_DN311TB,OPT,2 Newbiggin Walk,Freshney Place,Grimsby,,,DN31 1ED,Tel: 01472 344244, - ,,,No ratings yet Rate it yourself - /Services/opticians/LeaveReview/DefaultView.aspx?id=OP_5AN_12319__000001_DN311TB,0,0,
Boots-Grimsby - Friargate,OP_5AN_11689__000002_DN311ED,OPT,17 Friargate,,Freshney Place,Grimsby,,DN31 1QQ,Tel: 01472 342 209, - ,,,No ratings yet Rate it yourself - /Services/opticians/LeaveReview/DefaultView.aspx?id=OP_5AN_11689__000002_DN311ED,0,0,
"Keen, King & Jones",OP_5AN_4059__000001_DN312BD,OPT,3 Lynton Parade,Cromwell Road,Grimsby,,,DN31 2BD,Tel: 01472 360900, - ,,,No ratings yet Rate it yourself - /Services/opticians/LeaveReview/DefaultView.aspx?id=OP_5AN_4059__000001_DN312BD,0,0,
Louth Vision Centre,OP_5H9_13828__000001_LN119NR,OPT,,Louth Vision Centre,4 Market Place,Louth,Lincolnshire,LN11 9NR,Tel: 01507 609499, - ,,,No ratings yet Rate it yourself - /Services/opticians/LeaveReview/DefaultView.aspx?id=OP_5H9_13828__000001_LN119NR,0,0,
Stephen Hewitt eyecare,OP_5H9_13823__000001_LN119JG,OPT,21 Mercer Row,Louth,,.,,LN11 9JG,Tel: 01507 607276, - ,,,No ratings yet Rate it yourself - /Services/opticians/LeaveReview/DefaultView.aspx?id=OP_5H9_13823__000001_LN119JG,0,0,
Smith & Walker (Optometrists) Ltd,OP_5AN_8150__000001_DN402AE,OPT,2 Kennedy Way,,,Immingham,,DN40 2AE,Tel: 01469 572702, - ,,,No ratings yet Rate it yourself - /Services/opticians/LeaveReview/DefaultView.aspx?id=OP_5AN_8150__000001_DN402AE,0,0,
Greenwood Opticians,OP_5D2_3341__000001_LN83HL,OPT,25 Market Place,,,Market Rasen,Lincolnshire,LN8 3HL,Tel: 01673 842265, - ,,,No ratings yet Rate it yourself - /Services/opticians/LeaveReview/DefaultView.aspx?id=OP_5D2_3341__000001_LN83HL,0,0,
Lydia Hayes Opticians,C-0105-Q59,OPT,,1 & 2 Regents Mews,Victoria Road,Lincolnshire,Lincolnshire,LN12 2AQ,Tel: 01507 472842, - ,,,No ratings yet Rate it yourself - /Services/opticians/LeaveReview/DefaultView.aspx?id=C-0105-Q59,0,0,
G J Drew & Partners,OP_5H9_8302__000001_LN122AF,OPT,47 Victoria Road,,Mablethorpe,,,LN12 2AF,Tel: 01507 473202, - ,,,No ratings yet Rate it yourself - /Services/opticians/LeaveReview/DefaultView.aspx?id=OP_5H9_8302__000001_LN122AF,0,0,
R M Higson Optometrist ,OP_5E4_1132__000003_HU192HB,OPT,,120 Queen Street,,Withernsea,East Yorkshire,HU19 2HB,Tel: 01964 612012, - ,,,No ratings yet Rate it yourself - /Services/opticians/LeaveReview/DefaultView.aspx?id=OP_5E4_1132__000003_HU192HB,0,0,
Alford Opticians (Garry Crome),OP_5H9_6976__000001_LN139AF,OPT,,1 South Street,,Alford,Lincolnshire,LN13 9AF,Tel: 01507 462992, - ,,,No ratings yet Rate it yourself - /Services/opticians/LeaveReview/DefaultView.aspx?id=OP_5H9_6976__000001_LN139AF,0,0,no
Eyesite,OP_5E4_4737__000001_HU128EU,OPT,19 St. Augustines Gate,,Hedon,E Yorkshire,,HU12 8EU,Tel: 01482 890621, - ,,,No ratings yet Rate it yourself - /Services/opticians/LeaveReview/DefaultView.aspx?id=OP_5E4_4737__000001_HU128EU,0,0,
Robert Higson Opticians,OP_5E4_9272__000001_HU128JS,OPT,18 Souttergate,,Hedon,E Yorkshire,,HU12 8JS,Tel: 01482 896803, - ,,,No ratings yet Rate it yourself - /Services/opticians/LeaveReview/DefaultView.aspx?id=OP_5E4_9272__000001_HU128JS,0,0,
O'Brien's Opticians,OP_5EF_3276__000001_DN208JB,OPT,43-44 Wrawby Street,Brigg,Scunthorpe,North Lincolnshire,,DN20 8BS,Tel: 01652 653595, - ,,,No ratings yet Rate it yourself - /Services/opticians/LeaveReview/DefaultView.aspx?id=OP_5EF_3276__000001_DN208JB,0,0,
Brigg Optical,OPT_5EF_017__000001_DN208JZ,OPT,5 Chapel Court,,Brigg,North Lincolnshire,,DN20 8JZ,Tel: 01652 650400, - ,,,No ratings yet Rate it yourself - /Services/opticians/LeaveReview/DefaultView.aspx?id=OPT_5EF_017__000001_DN208JZ,0,0,
Boots-Horncastle,OP_5H9_5286__000001_LN95HZ,OPT,,10 Bridge Street,Horncastle,Lincolnshire,,LN9 5HZ,Tel: 01507 527044, - ,,,No ratings yet Rate it yourself - /Services/opticians/LeaveReview/DefaultView.aspx?id=OP_5H9_5286__000001_LN95HZ,0,0,
Horncastle Opticians (Garry Crome),OP_5H9_8477__000002_LN95BL,OPT,,6a High Street,,Horncastle,Lincolnshire,LN9 5BL,Tel: 01507 526205, - ,,,No ratings yet Rate it yourself - /Services/opticians/LeaveReview/DefaultView.aspx?id=OP_5H9_8477__000002_LN95BL,0,0,no
Asda Opticians,OPT_HU9 2BN,OPT,,THE MOUNT RETAIL PARK,,HULL,,HU9 2BN,, - ,,,No ratings yet Rate it yourself - /Services/opticians/LeaveReview/DefaultView.aspx?id=OPT_HU9 2BN,0,0,
Vision Express (UK) Ltd,OP_5E6_8572__000002_HU12PQ,OPT,F14-15 Upper Deck,Princes Quay,Hull,,,HU1 2PQ,Tel: 01482 323333, - ,,,No ratings yet Rate it yourself - /Services/opticians/LeaveReview/DefaultView.aspx?id=OP_5E6_8572__000002_HU12PQ,0,0,
Eyesite Opticians Ltd,OP_5EF_4393__000002_DN185PD,OPT,42 High Street,,Barton-upon-Humber,North Lincolnshire,,DN18 5PD,Tel: 01652 635997, - ,,,No ratings yet Rate it yourself - /Services/opticians/LeaveReview/DefaultView.aspx?id=OP_5EF_4393__000002_DN185PD,0,0,
Smith & Walker (Optometrists) Ltd,OP_5EF_3196__000003_DN185PD,OPT,16 High Street,,Barton-upon-Humber,North Lincolnshire,,DN18 5PD,Tel: 01652 632315, - ,,,No ratings yet Rate it yourself - /Services/opticians/LeaveReview/DefaultView.aspx?id=OP_5EF_3196__000003_DN185PD,0,0,
Vision Plus Opticians,OP_5E5_9519__000001_HU88TE,OPT,,283 Holderness Road,,Hull,,HU8 8TE,Tel: 01482 225545, - ,,,No ratings yet Rate it yourself - /Services/opticians/LeaveReview/DefaultView.aspx?id=OP_5E5_9519__000001_HU88TE,0,0,
Robert Higson Opticians,OP_5E5_3497__000001_HU88SH,OPT,323 Holderness Road,,,Hull,,HU8 8SH,Tel: 01482 329404, - ,,,No ratings yet Rate it yourself - /Services/opticians/LeaveReview/DefaultView.aspx?id=OP_5E5_3497__000001_HU88SH,0,0,
R M Higson,OP_5E6_1131__000001_HU13EA,OPT,,44 Savile Street,,Hull,East Yorkshire,HU1 3EA,Tel: 01482 329122, - ,,,No ratings yet Rate it yourself - /Services/opticians/LeaveReview/DefaultView.aspx?id=OP_5E6_1131__000001_HU13EA,0,0,
Bush Opticians (Hull) Ltd,OP_5E5_7794__000001_HU88RD,OPT,337 Holderness Road,,Hull,E Yorkshire,,HU8 8RD,Tel: 01482 323443, - ,,,No ratings yet Rate it yourself - /Services/opticians/LeaveReview/DefaultView.aspx?id=OP_5E5_7794__000001_HU88RD,0,0,
Aspec's Opticians,OP_5E6_14671__000001_HU28PP,OPT,Unit 4 Saville Row,18 Saville Street,,Hull,East Yorkshire,HU1 3EF,Tel: 01482 211115, - ,,,No ratings yet Rate it yourself - /Services/opticians/LeaveReview/DefaultView.aspx?id=OP_5E6_14671__000001_HU28PP,0,0,
Todd & Clarke,OP_5E6_3229__000001_HU13QH,OPT,,10 Anlaby Road,,Hull,East Yorkshire,HU1 2PA,Tel: 01482 223502, - ,,,No ratings yet Rate it yourself - /Services/opticians/LeaveReview/DefaultView.aspx?id=OP_5E6_3229__000001_HU13QH,0,0,
Specsavers Opticians,OP_5E6_12910__000001_HU13LS,OPT,50-52 Jameson Street,,Hull,,,HU1 3LS,Tel: 01482 324494, - ,,,No ratings yet Rate it yourself - /Services/opticians/LeaveReview/DefaultView.aspx?id=OP_5E6_12910__000001_HU13LS,0,0,
The Spectacle Shop,OP_5E6_14668__000001_HU34BE,OPT,271 Hessle Road,,Hull,E Yorkshire,,HU3 4BE,Tel: 01482 585083, - ,,,No ratings yet Rate it yourself - /Services/opticians/LeaveReview/DefaultView.aspx?id=OP_5E6_14668__000001_HU34BE,0,0,
Winter Opticians,OP_5E5_14667__000001_HU89AL,OPT,,623 Holderness Road,,Hull,,HU8 9AL,Tel: 01482 375295, - ,,,No ratings yet Rate it yourself - /Services/opticians/LeaveReview/DefaultView.aspx?id=OP_5E5_14667__000001_HU89AL,0,0,
Bright Eyes,OP_5E6_14672__000001_HU28HH,OPT,3 Percy Street,,Hull,East Yorkshire,,HU2 8HH,Tel: 01482 210888, - ,,,No ratings yet Rate it yourself - /Services/opticians/LeaveReview/DefaultView.aspx?id=OP_5E6_14672__000001_HU28HH,0,0,
ASDA Opticians,OPT_HU11 4AL,OPT,,"Main Road, Bilton",,HULL,,HU11 4AL,Tel: 01482 818812, - ,,,No ratings yet Rate it yourself - /Services/opticians/LeaveReview/DefaultView.aspx?id=OPT_HU11 4AL,0,0,
Boots-Hull - Prospect Centre,OP_5E6_11583__000002_HU28PS,OPT,48-58 Prospect Centre,,,Hull,,HU2 8PS,Tel: 01482 323892, - ,,,No ratings yet Rate it yourself - /Services/opticians/LeaveReview/DefaultView.aspx?id=OP_5E6_11583__000002_HU28PS,0,0,
Rouse Opticians,OP_5E6_14674__000001_HU33SE,OPT,428 Hessle Road,,Hull,E Yorkshire,,HU3 3SE,Tel: 01482 323856, - ,,,No ratings yet Rate it yourself - /Services/opticians/LeaveReview/DefaultView.aspx?id=OP_5E6_14674__000001_HU33SE,0,0,
Asda Opticians,OP_5E6_14670__000001_HU34PE,OPT,Hessle Road,,,Hull,,HU3 4PE,Tel: 01482 596620, - ,,,No ratings yet Rate it yourself - /Services/opticians/LeaveReview/DefaultView.aspx?id=OP_5E6_14670__000001_HU34PE,0,0,
Optical Express,HU2 8PX_11111,OPT,Prospect Street,,,Hull,Yorkshire(East Riding),HU2 8PX,Tel: 0800 023 2020, - ,,,No ratings yet Rate it yourself - /Services/opticians/LeaveReview/DefaultView.aspx?id=HU2 8PX_11111,0,0,
Tesco Opticians,CO1998__000001_HU28RW,OPT,Park Street,,Hull,E Yorkshire,,HU2 8RW,Tel: 01482 303437, - ,,,No ratings yet Rate it yourself - /Services/opticians/LeaveReview/DefaultView.aspx?id=CO1998__000001_HU28RW,0,0,
Rose Eyecare Ltd,OP_5E6_2056__000002_HU32SE,OPT,275 Anlaby Road,,Hull,,,HU3 2SE,Tel: 01482 324414, - ,,,No ratings yet Rate it yourself - /Services/opticians/LeaveReview/DefaultView.aspx?id=OP_5E6_2056__000002_HU32SE,0,0,
Wheatcroft Opticians Ltd,OP_5E6_12554__000001_HU31AB,OPT,72 Spring Bank,,Hull,,,HU3 1AB,Tel: 01482 329545, - ,,,No ratings yet Rate it yourself - /Services/opticians/LeaveReview/DefaultView.aspx?id=OP_5E6_12554__000001_HU31AB,0,0,
Spilsby Opticians,OP_5H9_8478__000001_PE235EF,OPT,6 Church Street,,Spilsby,,,PE23 5EF,Tel: 01790 753948, - ,,,No ratings yet Rate it yourself - /Services/opticians/LeaveReview/DefaultView.aspx?id=OP_5H9_8478__000001_PE235EF,0,0,no
"Daniels, Turner & Associates",5NXDANIELS__000002_HU31AA,OPT,90 Spring Bank,,Hull,E Yorkshire,,HU3 1AA,Tel: 01482 228525, - ,,,No ratings yet Rate it yourself - /Services/opticians/LeaveReview/DefaultView.aspx?id=5NXDANIELS__000002_HU31AA,0,0,
Buckingham Opticians,OP_5E6_452__000001_HU36AS,OPT,453 Anlaby Road,,Hull,Hull,,HU3 6AS,Tel: 01482 566451, - ,,,No ratings yet Rate it yourself - /Services/opticians/LeaveReview/DefaultView.aspx?id=OP_5E6_452__000001_HU36AS,0,0,
Kirton in Lindsey Opticians,OP_5EF_3529__000002_DN214LU,OPT,6 High Street,Kirton Lindsey,Gainsborough,Lincolnshire,,DN21 4LU,Tel: 01652 649024, - ,,,No ratings yet Rate it yourself - /Services/opticians/LeaveReview/DefaultView.aspx?id=OP_5EF_3529__000002_DN214LU,0,0,
Eye Contact Opticians,OP_5E3_4150__000002_HU130AA,OPT,8 The Orchard Centre,,Hessle,,,HU13 0AA,Tel: 01482 645369, - ,,,No ratings yet Rate it yourself - /Services/opticians/LeaveReview/DefaultView.aspx?id=OP_5E3_4150__000002_HU130AA,0,0,
Rouse Opticians,OP_5E6_2061__000001_HU52AA,OPT,95 Newland Avenue,95 Newland Avenue,,Hull,,HU5 2AA,Tel: 01482 346728, - ,,,No ratings yet Rate it yourself - /Services/opticians/LeaveReview/DefaultView.aspx?id=OP_5E6_2061__000001_HU52AA,0,0,
Specsavers Hessle,OP_5E3_3367__000001_HU130RD,OPT,44-46 Prestongate,,Hessle,,,HU13 0RE,Tel: 01482 640971, - ,,,No ratings yet Rate it yourself - /Services/opticians/LeaveReview/DefaultView.aspx?id=OP_5E3_3367__000001_HU130RD,0,0,
M & A Optics,OP_5E6_5538__000002_HU52ES,OPT,115 Newland Avenue,,Hull,,,HU5 2ES,Tel: 01482 472848, - ,,,No ratings yet Rate it yourself - /Services/opticians/LeaveReview/DefaultView.aspx?id=OP_5E6_5538__000002_HU52ES,0,0,
Bush Opticians (Hull) Ltd,OP_5E3_8458__000001_HU130RU,OPT,18 The Weir,Hessle,,East Yorkshire,,HU13 0RU,Tel: 01482 648919, - ,,,No ratings yet Rate it yourself - /Services/opticians/LeaveReview/DefaultView.aspx?id=OP_5E3_8458__000001_HU130RU,0,0,
Rouse Opticians,OP_5E5_2060__000004_HU74EE,OPT,5c North Point Shopping Centre,Goodhart Road,Hull,E Yorkshire,,HU7 4EE,Tel: 01482 833451, - ,,,No ratings yet Rate it yourself - /Services/opticians/LeaveReview/DefaultView.aspx?id=OP_5E5_2060__000004_HU74EE,0,0,
Jane Gray Eyecare Ltd,OP_5E3_8347__000001_HU107AN,OPT,7 Wilson Street,,Anlaby,E Yorkshire,,HU10 7AN,Tel: 01482 651531, - ,,,No ratings yet Rate it yourself - /Services/opticians/LeaveReview/DefaultView.aspx?id=OP_5E3_8347__000001_HU107AN,0,0,
Asda Opticians,OP_5E5_14668__000003_HU74HS,OPT,Asda Stores,Kingswood,,Hull,,HU7 4HS,Tel: 01482 370820, - ,,,No ratings yet Rate it yourself - /Services/opticians/LeaveReview/DefaultView.aspx?id=OP_5E5_14668__000003_HU74HS,0,0,
David Burghardt Vision Care (David Burghardt),OP_5D2_1569__000002_LN22PD,OPT,1 Church Street,Nettleham,Lincoln,",",,LN2 2PD,Tel: 01522 754821, - ,,,No ratings yet Rate it yourself - /Services/opticians/LeaveReview/DefaultView.aspx?id=OP_5D2_1569__000002_LN22PD,0,0,
Opticks Opticians,OP_5H9_2501__000001_LN106QL,OPT,,7 Station Road,Woodhall Spa,Lincolnshire,,LN10 6QL,Tel: 01526 352236, - ,,,No ratings yet Rate it yourself - /Services/opticians/LeaveReview/DefaultView.aspx?id=OP_5H9_2501__000001_LN106QL,0,0,
Sight Care UK Ltd,OP_5E3_8924__000001_HU106BN,OPT,4 Kingston Road,,Willerby,,,HU10 6BN,Tel: 01482 658048, - ,,,No ratings yet Rate it yourself - /Services/opticians/LeaveReview/DefaultView.aspx?id=OP_5E3_8924__000001_HU106BN,0,0,
Eyesite Opticians,OP_5E3_13040__000003_HU165QE,OPT,96 King Street,,Cottingham,E Yorkshire,,HU16 5QE,Tel: 01482 845651, - ,,,No ratings yet Rate it yourself - /Services/opticians/LeaveReview/DefaultView.aspx?id=OP_5E3_13040__000003_HU165QE,0,0,
Coates Opticians,OP_5E3_4819__000002_HU165QE,OPT,,8 King Street,,Cottingham,East Yorkshire,HU16 5QE,Tel: 01482 840989, - ,,,No ratings yet Rate it yourself - /Services/opticians/LeaveReview/DefaultView.aspx?id=OP_5E3_4819__000002_HU165QE,0,0,
Scrivens Opticians,OP_5E3_5474__000002_HU164BD,OPT,160 Hallgate,,Cottingham,Nr Hull,Yorkshire(East Riding),HU16 4BD,Tel: 01482 845056, - ,,,No ratings yet Rate it yourself - /Services/opticians/LeaveReview/DefaultView.aspx?id=OP_5E3_5474__000002_HU164BD,0,0,
Buckingham Opticians,OP_5E3_3903__000001_HU164BB,OPT,183 Hallgate,,Cottingham,Cottingham,,HU16 4BB,Tel: 01482 841359, - ,,,No ratings yet Rate it yourself - /Services/opticians/LeaveReview/DefaultView.aspx?id=OP_5E3_3903__000001_HU164BB,0,0,
Craig Leaver Eyecare,OP_5D2_13820__000001_LN24QP,OPT,2 Bunkers Hill,Lincoln,,",",,LN2 4QP,Tel: 01522 522088, - ,,,No ratings yet Rate it yourself - /Services/opticians/LeaveReview/DefaultView.aspx?id=OP_5D2_13820__000001_LN24QP,0,0,
Smith & Walker (Optometrists) Ltd,OP_5EF_8151__000001_DN159PU,OPT,1 High Street,,Winterton,North Lincolnshire,,DN15 9PU,Tel: 01724 733754, - ,,,No ratings yet Rate it yourself - /Services/opticians/LeaveReview/DefaultView.aspx?id=OP_5EF_8151__000001_DN159PU,0,0,
Tesco Opticians,TP6NY,OPT,,Wragby Road,,Lincoln,,LN2 4QQ,, - ,,,No ratings yet Rate it yourself - /Services/opticians/LeaveReview/DefaultView.aspx?id=TP6NY,0,0,
Harold Barnaby Optical Services,OP_5D2_13817__000001_LN24BL,OPT,,31 Mainwaring Road,,Lincoln,,LN2 4BL,Tel: 01522 524732, - ,,,No ratings yet Rate it yourself - /Services/opticians/LeaveReview/DefaultView.aspx?id=OP_5D2_13817__000001_LN24BL,0,0,yes
Mucklow & Hardy,OP_5D2_13819__000001_LN21QA,OPT,Clear View Opticians,6a Eastgate,,Lincoln,Lincolnshire,LN2 1QA,Tel: 01522 538889, - ,,,No ratings yet Rate it yourself - /Services/opticians/LeaveReview/DefaultView.aspx?id=OP_5D2_13819__000001_LN21QA,0,0,no
Vision Care @ No 8 (Julian Gunn & Jason Rickaby),OP_5D2_14304__000001_LN13AJ,OPT,3 Gordon Road,8 Gordon Road,,Lincoln,,LN1 3AJ,Tel: 01522 530088, - ,,,No ratings yet Rate it yourself - /Services/opticians/LeaveReview/DefaultView.aspx?id=OP_5D2_14304__000001_LN13AJ,0,0,
Clear View Vision Ltd (Mrs Annabelle Magee),LN1_3LW_1,OPT,Clear View Opticians,169 Burton Road,,Lincoln,Lincolnshire,LN1 3LW,Tel: 01522 542121, - ,,,No ratings yet Rate it yourself - /Services/opticians/LeaveReview/DefaultView.aspx?id=LN1_3LW_1,0,0,yes
Sightcare UK Ltd,BROUGH1__000001_HU151AF,OPT,Welton Road,,Brough,E Yorkshire,,HU15 1AF,Tel: 01482 665999, - ,,,No ratings yet Rate it yourself - /Services/opticians/LeaveReview/DefaultView.aspx?id=BROUGH1__000001_HU151AF,0,0,
Martin Smith Opticians Ltd,OP_5D2_2805__000001_LN21DH,OPT,22 Saltergate,,Lincoln,,,LN2 1DH,Tel: 01522 521100, - ,,,No ratings yet Rate it yourself - /Services/opticians/LeaveReview/DefaultView.aspx?id=OP_5D2_2805__000001_LN21DH,0,0,yes
Optique Vision,C/0117-Q59_LN2 1DH,OPT,The Stonebow,224 High Street,,Lincoln,Lincolnshire,LN2 1AH,Tel: 01522244390, - ,,,No ratings yet Rate it yourself - /Services/opticians/LeaveReview/DefaultView.aspx?id=C/0117-Q59_LN2 1DH,0,0,yes
Vision Express (UK) Ltd,OP_5D2_10307__000003_LN21AP,OPT,Unit 8 Waterside Shopping Centre,High Street,Lincoln,Lincolnshire,,LN2 1AP,Tel: 01522 560111, - ,,,No ratings yet Rate it yourself - /Services/opticians/LeaveReview/DefaultView.aspx?id=OP_5D2_10307__000003_LN21AP,0,0,
Water Lane Opticians,OP_5D2_13818__000001_LN11TY,OPT,5 Water Lane,Lincoln,,,,LN1 1TY,Tel: 01522 525395, - ,,,No ratings yet Rate it yourself - /Services/opticians/LeaveReview/DefaultView.aspx?id=OP_5D2_13818__000001_LN11TY,0,0,
Boots-Lincoln - High St (in Boots UK),OP_5D2_6992__000002_LN57DZ,OPT,311-312 High Street,,,Lincoln,Lincolnshire,LN5 7DZ,Tel: 01522 536982, - ,,,No ratings yet Rate it yourself - /Services/opticians/LeaveReview/DefaultView.aspx?id=OP_5D2_6992__000002_LN57DZ,0,0,
Opticial Express,OP_12345_LN1 1XP,OPT,"2nd Floor, Lincoln House",37 Newland,,Lincoln,Lincolnshire,LN1 1XP,Tel: 0800 023 2020, - ,,,No ratings yet Rate it yourself - /Services/opticians/LeaveReview/DefaultView.aspx?id=OP_12345_LN1 1XP,0,0,
E R Dixon Ltd,OP_5D2_2970__000002_LN57AL,OPT,,194 High Street,,Lincoln,,LN5 7AL,Tel: 01522 523786, - ,,,No ratings yet Rate it yourself - /Services/opticians/LeaveReview/DefaultView.aspx?id=OP_5D2_2970__000002_LN57AL,0,0,no
Boots-Lincoln - High St,OP_5D2_7188__000001_LN57AL,OPT,192 High Street,,,Lincoln,Lincolnshire,LN5 7AL,Tel: 01522 523 960, - ,,,No ratings yet Rate it yourself - /Services/opticians/LeaveReview/DefaultView.aspx?id=OP_5D2_7188__000001_LN57AL,0,0,
Specsavers Opticians,OP_5D2_2444__000001_LN57DW,OPT,324 High Street,,Lincoln,,,LN5 7DW,Tel: 01522 576655, - ,,,No ratings yet Rate it yourself - /Services/opticians/LeaveReview/DefaultView.aspx?id=OP_5D2_2444__000001_LN57DW,0,0,no
Specsavers Opticians,OP_5H9_12159__000002_PE253NG,OPT,66 Lumley Road,,Skegness,,,PE25 3NG,Tel: 01754 898000, - ,,,No ratings yet Rate it yourself - /Services/opticians/LeaveReview/DefaultView.aspx?id=OP_5H9_12159__000002_PE253NG,0,0,
Rawlinsons Optometrists,OP_5N9_0096__000001_PE252AH,OPT,,1 Lumley Avenue,,Skegness,Lincolnshire,PE25 2AH,Tel: 01754 766773, - ,,,No ratings yet Rate it yourself - /Services/opticians/LeaveReview/DefaultView.aspx?id=OP_5N9_0096__000001_PE252AH,0,0,no
Boots-Skegness,OP_5H9_10633__000001_PE253NU,OPT,Unit 7,The Hildreds Shopping Centre,,Skegness,Lincolnshire,PE25 3NU,Tel: 01754 763 146, - ,,,No ratings yet Rate it yourself - /Services/opticians/LeaveReview/DefaultView.aspx?id=OP_5H9_10633__000001_PE253NU,0,0,
Edwards Opticians,OP_5E3_4047__000001_HU151HW,OPT,1 Stockbridge Road,,Elloughton,E Yorkshire,,HU15 1HW,Tel: 01482 668712, - ,,,No ratings yet Rate it yourself - /Services/opticians/LeaveReview/DefaultView.aspx?id=OP_5E3_4047__000001_HU151HW,0,0,
Specsavers Opticians,OP_5D2_14302__000001_LN67QL,OPT,Unit 4,Morrisons Supermarket,Tritton Road,Lincoln,,LN6 7QL,Tel: 01522 572710, - ,,,No ratings yet Rate it yourself - /Services/opticians/LeaveReview/DefaultView.aspx?id=OP_5D2_14302__000001_LN67QL,0,0,yes
John Tomlinson Mobile Optician,OP_5E3_13034__000001_HU151QT,OPT,Mobile Unit,The Library Car Park,Church Street (Tues 9-12.15pm Alt),,,HU15 1QT,Tel: 07976 567487, - ,,,No ratings yet Rate it yourself - /Services/opticians/LeaveReview/DefaultView.aspx?id=OP_5E3_13034__000001_HU151QT,0,0,
Specsavers Opticians,OP_5E3_7142__000001_HU179BN,OPT,52 Toll Gavel,,Beverley,,,HU17 9BN,Tel: 01482 679933, - ,,,No ratings yet Rate it yourself - /Services/opticians/LeaveReview/DefaultView.aspx?id=OP_5E3_7142__000001_HU179BN,0,0,
Boots-Beverley,OP_5E3_11631__000001_HU179AJ,OPT,43-45 Toll Gavel,,,Beverley,Yorkshire,HU17 9AA,Tel: 01482 872333, - ,,,No ratings yet Rate it yourself - /Services/opticians/LeaveReview/DefaultView.aspx?id=OP_5E3_11631__000001_HU179AJ,0,0,
Beverley Vision Express,5NW VE__000003_HU179AJ,OPT,,12 Toll Gavel,,Beverley,Yorkshire(East Riding),HU17 9AJ,Tel: 01482 863547, - ,,,No ratings yet Rate it yourself - /Services/opticians/LeaveReview/DefaultView.aspx?id=5NW VE__000003_HU179AJ,0,0,
Eyesite,OPT_5E3_HARRODS__000003_HU178BB,OPT,13a Saturday Market Place,Beverley,,East Yorkshire,,HU17 8BB,Tel: 01482 868039, - ,,,No ratings yet Rate it yourself - /Services/opticians/LeaveReview/DefaultView.aspx?id=OPT_5E3_HARRODS__000003_HU178BB,0,0,
Edwards Opticians,OP_5E3_487__000002_HU178BB,OPT,8 Saturday Market,,Beverley,,,HU17 8BB,Tel: 01482 868428, - ,,,No ratings yet Rate it yourself - /Services/opticians/LeaveReview/DefaultView.aspx?id=OP_5E3_487__000002_HU178BB,0,0,