Organisation Name,NACS Code,Organisation Type,Address1,Address2,Address3,Address4,Address5,PostCode,Telephone Number,Opening time,Value  (Opening time),Banding Classification  (Opening time),NHS.UK users rating,Value  (NHS.UK users rating),Banding Classification  (NHS.UK users rating),Car parking (Is there car parking at this organisation?)
Greys Opticians,OP_5D1_4664__000001_B93ONA,OPT,1642 High Street,Knowle,,Solihull,West Midlands,B93 0NA,Tel: 01564 773466, - ,,,No ratings yet Rate it yourself - /Services/opticians/LeaveReview/DefaultView.aspx?id=OP_5D1_4664__000001_B93ONA,0,0,
Bannister Opticians Ltd,OP_5D1_8378__000001_B930LE,OPT,,17 St. Johns Way,Knowle,Solihull,,B93 0LE,Tel: 01564 778206, - ,,,3 ratings Rate it yourself - /Services/opticians/LeaveReview/DefaultView.aspx?id=OP_5D1_8378__000001_B930LE,,,
Maginnis Opticians (Optometrists) Ltd,OP_5D1_4086__000001_CV77ER,OPT,384 Kenilworth Road,Balsall Common,Coventry,,,CV7 7ER,Tel: 01676 532180, - ,,,1 rating Rate it yourself - /Services/opticians/LeaveReview/DefaultView.aspx?id=OP_5D1_4086__000001_CV77ER,,,
Alan Tyler Opticians,5QW047,OPT,,11 Arden Buildings,Station Road,Solihull,,B93 8HH,Tel: 01564 772217, - ,,,No ratings yet Rate it yourself - /Services/opticians/LeaveReview/DefaultView.aspx?id=5QW047,0,0,
ZMP:  Charles Barlow (domiciliary),OL/01-10826/5EY__000003_B946JG,OPT,171 Station Lane,Lapworth,Solihull,West Midlands,,B94 6JG,Tel: 0800 652 5505, - ,,,No ratings yet Rate it yourself - /Services/opticians/LeaveReview/DefaultView.aspx?id=OL/01-10826/5EY__000003_B946JG,0,0,
Community Eyecare trading as Vision Call,OP_B920AJ_20418,OPT,463-465 Warwick Road,"Cleeves House, Hampton Court, 55 Marsh Lane, Hampton-in-Arden",,Solihull,,B92 0AJ,Tel: 01675 446 065, - ,,,No ratings yet Rate it yourself - /Services/opticians/LeaveReview/DefaultView.aspx?id=OP_B920AJ_20418,0,0,
S W Optics Ltd,5PG183,OPT,,3 Libbards Gate,Solihull,West Midlands,,B91 3XQ,Tel: 0121 704 1429, - ,,,No ratings yet Rate it yourself - /Services/opticians/LeaveReview/DefaultView.aspx?id=5PG183,0,0,
J & D Mason Opticians,5M144__000001_B296AU,OPT,,18 Farmhouse Way,Shirley,Solihull,,B90 4EH,Tel: 0121 705 8139, - ,,,No ratings yet Rate it yourself - /Services/opticians/LeaveReview/DefaultView.aspx?id=5M144__000001_B296AU,0,0,
Eye C Healthcare (Domiciliary Only) BY APPOINTMENT ONLY  ,DOM04__000001_B904UZ,OPT,,11 Horton Grove,,Solihull,West Midlands,B90 4UZ,Tel: 07957 652170, - ,,,No ratings yet Rate it yourself - /Services/opticians/LeaveReview/DefaultView.aspx?id=DOM04__000001_B904UZ,0,0,
Tesco Stores Ltd,OL/CO-1998/TAM__000001_B904EN,OPT,,1505 Stratford Road,Shirley,Solihull,,B90 4EN,Tel: 0121 253 7538, - ,,,No ratings yet Rate it yourself - /Services/opticians/LeaveReview/DefaultView.aspx?id=OL/CO-1998/TAM__000001_B904EN,0,0,
Perspective Opticians ,OP_5D1_5333__000001_B913BH,OPT,56 Drury Lane,Mell Square,Solihull,Solihull,,B91 3BH,Tel: 0121 709 1000, - ,,,No ratings yet Rate it yourself - /Services/opticians/LeaveReview/DefaultView.aspx?id=OP_5D1_5333__000001_B913BH,0,0,
Boots-Solihull,OP_5D1_3193__000001_B913AT,OPT,57 Mill Lane,,,Solihull,West Midlands,B91 3AT,Tel: 0121 705 2152, - ,,,No ratings yet Rate it yourself - /Services/opticians/LeaveReview/DefaultView.aspx?id=OP_5D1_3193__000001_B913AT,0,0,
Specsavers Opticians,OP_5D1_3685__000001_B913TA,OPT,,90 High Street,,Solihull,,B91 3TA,Tel: 0121 711 3411, - ,,,No ratings yet Rate it yourself - /Services/opticians/LeaveReview/DefaultView.aspx?id=OP_5D1_3685__000001_B913TA,0,0,
A B Optics,OP_5D1_13858__000001_B913DA,OPT,,681 Warwick Road,,Solihull,,B91 3DA,Tel: 0121 704 2615, - ,,,5 ratings Rate it yourself - /Services/opticians/LeaveReview/DefaultView.aspx?id=OP_5D1_13858__000001_B913DA,,,
Vision Express (UK) Ltd,5QW005,OPT,,Touchwood Shopping Centre,,Solihull,,B91 3QE,Tel: 0121 704 7150, - ,,,No ratings yet Rate it yourself - /Services/opticians/LeaveReview/DefaultView.aspx?id=5QW005,0,0,
Eyecare at Home,EYECAREATHOME1,OPT,208 Wharf lane,,,Solihull,West Midlands,B91 2UN,Tel: 0845 299 6069, - ,,,No ratings yet Rate it yourself - /Services/opticians/LeaveReview/DefaultView.aspx?id=EYECAREATHOME1,0,0,
Walford & Round,OP_5D1_8708__000002_B911BQ,OPT,,Dovehouse Parade,33 Warwick Road,Solihull,,B91 1BQ,Tel: 0121 706 4522, - ,,,No ratings yet Rate it yourself - /Services/opticians/LeaveReview/DefaultView.aspx?id=OP_5D1_8708__000002_B911BQ,0,0,
Pike Opticians Ltd,OP_5D1_13856__000001_B903BB,OPT,,452 Stratford Road,Shirley,Solihull,,B90 4AQ,Tel: 0121 744 9093, - ,,,No ratings yet Rate it yourself - /Services/opticians/LeaveReview/DefaultView.aspx?id=OP_5D1_13856__000001_B903BB,0,0,
Sims Opticians,OP_5D1_11728__000002_B903BT,OPT,,1 Union Road,Solihull,Solihull,,B90 3BT,Tel: 0121 744 6036, - ,,,No ratings yet Rate it yourself - /Services/opticians/LeaveReview/DefaultView.aspx?id=OP_5D1_11728__000002_B903BT,0,0,
Homespecs,5QW052,OPT,,383 Stratford Road,Shirley,Birmingham,,B90 3BW,Tel: 0121 733 1232, - ,,,No ratings yet Rate it yourself - /Services/opticians/LeaveReview/DefaultView.aspx?id=5QW052,0,0,
Eyesite Eyecare Centres,OP_5MD_9954__000001_CV49PQ,OPT,44 Jardine Crescent,,,Coventry,,CV4 9PQ,Tel: 024 7647 3739, - ,,,No ratings yet Rate it yourself - /Services/opticians/LeaveReview/DefaultView.aspx?id=OP_5MD_9954__000001_CV49PQ,0,0,
Eye Specialist Opticians,OP_5D1_13861__000002_B928JL,OPT,,83 Hobs Moat Road,,Solihull,,B92 8JL,Tel: 0121 742 6043, - ,,,1 rating Rate it yourself - /Services/opticians/LeaveReview/DefaultView.aspx?id=OP_5D1_13861__000002_B928JL,,,
Visioncraft (UK) Ltd,5PG194,OPT,,166 Streetsbrook Road,Shirley,Solihull,,B90 3PH,Tel: 0121 772 4424, - ,,,No ratings yet Rate it yourself - /Services/opticians/LeaveReview/DefaultView.aspx?id=5PG194,0,0,
Specsavers Opticians,TAM01__000004_B903AH,OPT,,207 Stratford Road,Shirley,Solihull,,B90 3AH,Tel: 0121 506 8650, - ,,,No ratings yet Rate it yourself - /Services/opticians/LeaveReview/DefaultView.aspx?id=TAM01__000004_B903AH,0,0,
Scrivens Opticians & Hearing Care,13022015_B90 3AU,OPT,,191 Stratford Road,,"Shirley, Solihull",,B90 3AU,, - ,,,No ratings yet Rate it yourself - /Services/opticians/LeaveReview/DefaultView.aspx?id=13022015_B90 3AU,0,0,
Boots-Birmingham- Shirley,OP_5D1_862__000001_B903AU,OPT,,199 Stratford Road,Shirley,Solihull,,B90 3AU,Tel: 0121 744 1207, - ,,,1 rating Rate it yourself - /Services/opticians/LeaveReview/DefaultView.aspx?id=OP_5D1_862__000001_B903AU,,,
Dickens Eye Clinic,DICKENS__000001_B901UB,OPT,39 Main Street,Dickens Heath,Solihull,West Midlands,,B90 1UB,Tel: 0121 744 5544, - ,,,2 ratings Rate it yourself - /Services/opticians/LeaveReview/DefaultView.aspx?id=DICKENS__000001_B901UB,,,
Specsavers Opticians,5PM-CV8 1EF__000003_CV81EF,OPT,17 The Square,,Kenilworth,Warwickshire,,CV8 1EF,Tel: 01926 865030, - ,,,2 ratings Rate it yourself - /Services/opticians/LeaveReview/DefaultView.aspx?id=5PM-CV8 1EF__000003_CV81EF,,,
Asda Opticians,OPT_B90 3GG,OPT,,STRATFORD ROAD,PARKGATE,SHIRLEY,,B90 3GG,Tel: 0121 296 3736, - ,,,No ratings yet Rate it yourself - /Services/opticians/LeaveReview/DefaultView.aspx?id=OPT_B90 3GG,0,0,
Boots-Sheldon,OP_5MY_2665__000002_B263JH,OPT,2236 Coventry Road,Sheldon,,Birmingham,,B26 3JH,Tel: 0121 743 3360, - ,,,No ratings yet Rate it yourself - /Services/opticians/LeaveReview/DefaultView.aspx?id=OP_5MY_2665__000002_B263JH,0,0,
Boots-Kenilworth,5PM-CV8 1JB__000002_CV81JB,OPT,20 Talisman Square,,,Kenilworth,Warwickshire,CV8 1JB,Tel: 01926 856025, - ,,,No ratings yet Rate it yourself - /Services/opticians/LeaveReview/DefaultView.aspx?id=5PM-CV8 1JB__000002_CV81JB,0,0,
Vision Express,OP_5MQ_7051__000001_CV81HE,OPT,,28 Warwick Rd,,Kenilworth,Warwickshire,CV8 1HE,Tel: 01926 853331, - ,,,No ratings yet Rate it yourself - /Services/opticians/LeaveReview/DefaultView.aspx?id=OP_5MQ_7051__000001_CV81HE,0,0,
Costco Wholesale UK Ltd,CO-1833-5,OPT,,51 Torrington Avenue,,Coventry,,CV4 9AQ,Tel: 02476 854 675, - ,,,No ratings yet Rate it yourself - /Services/opticians/LeaveReview/DefaultView.aspx?id=CO-1833-5,0,0,
Keith Murphy Opticians Ltd,OP_5MQ_14437__000001_CV81HN,OPT,69 Warwick Road,Kenilworth,Warwickshire,,,CV8 1HN,Tel: 01926 853366, - ,,,7 ratings Rate it yourself - /Services/opticians/LeaveReview/DefaultView.aspx?id=OP_5MQ_14437__000001_CV81HN,,,
Susan Bowers Opticians,OP_5MD_12273__000002_CV49DU,OPT,349 Tile Hill Lane,Tile Hill,Coventry,Coventry,West Midlands,CV4 9DU,Tel: 02476466661, - ,,,No ratings yet Rate it yourself - /Services/opticians/LeaveReview/DefaultView.aspx?id=OP_5MD_12273__000002_CV49DU,0,0,
Scrivens Ltd,OP_5MY_6315__000002_B263JB,OPT,2162 Coventry Road,Sheldon,,Birmingham,West Midlands,B26 3JB,Tel: 0121 743 2704, - ,,,No ratings yet Rate it yourself - /Services/opticians/LeaveReview/DefaultView.aspx?id=OP_5MY_6315__000002_B263JB,0,0,
My Optician,OP_5MD_8278__000002_CV47EH,OPT,8 Cannon Park Centre,Lynchgate Road,,Coventry,,CV4 7EH,Tel: 024 7641 6667, - ,,,5 ratings Rate it yourself - /Services/opticians/LeaveReview/DefaultView.aspx?id=OP_5MD_8278__000002_CV47EH,,,
Optical Eye Lusions,5M1017,OPT,,1514 Stratford Road,Hall Green,Birmingham,,B28 9ET,Tel: 0121 744 2805, - ,,,1 rating Rate it yourself - /Services/opticians/LeaveReview/DefaultView.aspx?id=5M1017,,,
Maginnis Opticians (Optometrists) Ltd,OP_5D1_4083__000001_B377AE,OPT,32a Holly Lane,Marston Green,Birmingham,,,B37 7AE,Tel: 0121 779 4242, - ,,,No ratings yet Rate it yourself - /Services/opticians/LeaveReview/DefaultView.aspx?id=OP_5D1_4083__000001_B377AE,0,0,
Healthcall Optical Services,5EJ_01582__000003_LU48EF,OPT,"Unit 3, Bow Court",Fletchworth Gate,Canley,Coventry,,CV5 6SP,Tel: 0800 198 1132, - ,,,No ratings yet Rate it yourself - /Services/opticians/LeaveReview/DefaultView.aspx?id=5EJ_01582__000003_LU48EF,0,0,
Direct Vision Opticians at Pan Pharmacy,,OPT,Direct Vision Opticians,297-299 Church Road,Sheldon,Birmingham,West Midlands,B26 3YH,Tel: 0121 742 9599 (ext. 3), - ,,,N/A - Data not available,,,yes
C R Williams Opticians,OP_5MD_982__000001_CV59JE,OPT,1 Whitaker Road,,,Coventry,,CV5 9JE,Tel: 024 7667 7511, - ,,,No ratings yet Rate it yourself - /Services/opticians/LeaveReview/DefaultView.aspx?id=OP_5MD_982__000001_CV59JE,0,0,
Waddam Opticians Ltd,OP_5M1_12038__000002_B280XB,OPT,278 Baldwins Lane,Hall Green,Birmingham,,,B28 0XB,Tel: 0121 745 3663, - ,,,No ratings yet Rate it yourself - /Services/opticians/LeaveReview/DefaultView.aspx?id=OP_5M1_12038__000002_B280XB,0,0,
Complete Community Care,C/7200/5PK,OPT,Complete Community Care Birmingham,42 Ringswood Road,,Solihull,West Midlands,B92 7NH,Tel: 0121 439 6496, - ,,,No ratings yet Rate it yourself - /Services/opticians/LeaveReview/DefaultView.aspx?id=C/7200/5PK,0,0,
New Image Opticians,5PG152,OPT,,1120 Warwick Road,Acocks Green,Birmingham,,B27 6BL,Tel: 0121 707 9733, - ,,,1 rating Rate it yourself - /Services/opticians/LeaveReview/DefaultView.aspx?id=5PG152,,,
Banks Opticians,5PG02__000005_B276RA,OPT,,1115A Warwick Road,Acocks Green,Birmingham,West Midlands,B27 6RA,Tel: 0121 706 6604, - ,,,No ratings yet Rate it yourself - /Services/opticians/LeaveReview/DefaultView.aspx?id=5PG02__000005_B276RA,0,0,
Boots-Acocks Green,OP_5MY_2664__000002_B276BH,OPT,1082 Warwick Road,Acocks Green,,Birmingham,,B27 6BH,Tel: 0121 706 1386, - ,,,1 rating Rate it yourself - /Services/opticians/LeaveReview/DefaultView.aspx?id=OP_5MY_2664__000002_B276BH,,,
Manor Opticians,5PG120,OPT,,1752 Coventry Road,Sheldon,Birmingham,,B26 1PB,Tel: 0121 722 7226, - ,,,No ratings yet Rate it yourself - /Services/opticians/LeaveReview/DefaultView.aspx?id=5PG120,0,0,
Specsavers Opticians,5QW048,OPT,,"Unit 34, 2-4 Greenwood Square",Chelmsley Wood Shopping Centre,Birmingham,,B37 5TR,Tel: 0121 329 5510, - ,,,No ratings yet Rate it yourself - /Services/opticians/LeaveReview/DefaultView.aspx?id=5QW048,0,0,
Alan Tyler Opticians,5PG01__000003_B277PS,OPT,,291 Fox Hollies Road,,Birmingham,West Midlands,B27 7PS,Tel: 0121 706 3998, - ,,,2 ratings Rate it yourself - /Services/opticians/LeaveReview/DefaultView.aspx?id=5PG01__000003_B277PS,,,
The Eyewear House,76594999__000002_CV58HU,OPT,467 Holyhead Road,,,Coventry,,CV5 8HU,Tel: 024 76594999, - ,,,No ratings yet Rate it yourself - /Services/opticians/LeaveReview/DefaultView.aspx?id=76594999__000002_CV58HU,0,0,
Midlands Community Eyecare Limited,TP9FV,OPT,Kings Court,17 School Road,,Birmingham,West Midlands,B28 8JG,Tel: 0121 517 0218, - ,,,3 ratings Rate it yourself - /Services/opticians/LeaveReview/DefaultView.aspx?id=TP9FV,,,
A Tissington,OP_5MQ_8857__000001_B955AU,OPT,133 High Street,Henley-In-Arden,Solihull,Warwickshire,,B95 5AU,Tel: 01564 792334, - ,,,No ratings yet Rate it yourself - /Services/opticians/LeaveReview/DefaultView.aspx?id=OP_5MQ_8857__000001_B955AU,0,0,
Eye Tech Optometrists,CV36BP1901,OPT,Eyetech Optometrists,42 Kenpas Highway,,Coventry,,CV3 6BP,Tel: 02476 233 993, - ,,,No ratings yet Rate it yourself - /Services/opticians/LeaveReview/DefaultView.aspx?id=CV36BP1901,0,0,
Katie Hattersley Opticians,CV5 6EJ__000002_CV56EJ,OPT,56 Earlsdon Street,,,Coventry,,CV5 6EJ,Tel: 024 76675885, - ,,,No ratings yet Rate it yourself - /Services/opticians/LeaveReview/DefaultView.aspx?id=CV5 6EJ__000002_CV56EJ,0,0,
Michael P Harris (Opticians) Ltd,OP_5MD_3452__000002_CV56EP,OPT,25 Earlsdon Street,,,Coventry,,CV5 6EP,Tel: 024 7671 1620, - ,,,No ratings yet Rate it yourself - /Services/opticians/LeaveReview/DefaultView.aspx?id=OP_5MD_3452__000002_CV56EP,0,0,
Krystal Vision,5MY26__000002_B261AD,OPT,,1592 Coventry Road,Yardley,Birmingham,,B26 1AL,Tel: 0121 707 7004, - ,,,No ratings yet Rate it yourself - /Services/opticians/LeaveReview/DefaultView.aspx?id=5MY26__000002_B261AD,0,0,
Tesco Opticians,5PG121,OPT,,Swan Shopping Centre,Coventry Road,Birmingham,,B26 1AD,Tel: 0121 601 3438, - ,,,1 rating Rate it yourself - /Services/opticians/LeaveReview/DefaultView.aspx?id=5PG121,,,
Specsavers,5PG117,OPT,,"Unit 3, The Swan Shopping Centre",Yardley,Birmingham,,B25 8UJ,Tel: 0121 765 5700, - ,,,No ratings yet Rate it yourself - /Services/opticians/LeaveReview/DefaultView.aspx?id=5PG117,0,0,
Eagle Eyes Opticians Ltd,SOUTH102__000003_B288AE,OPT,1132 Stratford Road,Hall Green,Birmingham,,,B28 8AE,Tel: 0121 777 8889, - ,,,No ratings yet Rate it yourself - /Services/opticians/LeaveReview/DefaultView.aspx?id=SOUTH102__000003_B288AE,0,0,
Scrivens Opticians & Hearing Care,5PG126,OPT,,146 Church Road,Yardley,Birmingham,,B25 8UT,Tel: 0121 784 8022, - ,,,No ratings yet Rate it yourself - /Services/opticians/LeaveReview/DefaultView.aspx?id=5PG126,0,0,
Boots-Birmingham - Yardley,OP_5MY_9735__000002_B258LP,OPT,1321 Coventry Road,Yardley,,Birmingham,,B25 8LP,Tel: 0121 707 9177, - ,,,No ratings yet Rate it yourself - /Services/opticians/LeaveReview/DefaultView.aspx?id=OP_5MY_9735__000002_B258LP,0,0,
Lakis Stelios Stylianou,5M1011,OPT,,22 School Road,,Birmingham,,B14 4BJ,Tel: 0121 474 3359, - ,,,No ratings yet Rate it yourself - /Services/opticians/LeaveReview/DefaultView.aspx?id=5M1011,0,0,
Specs at Home (Midlands) Ltd,5MX105__000001_B280PH,OPT,249 Wake Green Rd,Moseley,Birmingham,B13 9XH,West Midlands,B13 9XH,Tel: 0121 769 2672, - ,,,No ratings yet Rate it yourself - /Services/opticians/LeaveReview/DefaultView.aspx?id=5MX105__000001_B280PH,0,0,
Scrivens Ltd,OP_5MY_5456__000002_B339SB,OPT,300 Kitts Green Road,Lea Hall,,Birmingham,West Midlands,B33 9SB,Tel: 0121 783 3159, - ,,,No ratings yet Rate it yourself - /Services/opticians/LeaveReview/DefaultView.aspx?id=OP_5MY_5456__000002_B339SB,0,0,
Boots-Coventry - Central Six Retail Park,OP_5MD_6233__000002_CV36TA,OPT,Unit 7,Central Six Retail Park,,Coventry,West Midlands,CV3 6TA,Tel: 0247 6226051, - ,,,No ratings yet Rate it yourself - /Services/opticians/LeaveReview/DefaultView.aspx?id=OP_5MD_6233__000002_CV36TA,0,0,
Pabari Opticians,00000055__000001_B475DX,OPT,Unit2 Drakes Cross Shopping Parade,,Wythall,Worcestershire,,B47 5HD,Tel: 01564 824482, - ,,,1 rating Rate it yourself - /Services/opticians/LeaveReview/DefaultView.aspx?id=00000055__000001_B475DX,,,
ZMP:  Healthcall Optical Services,OL/CO-2008/5EY__000001_CV13EZ,OPT,25 Warwick Road,,Coventry,,,CV1 3EZ,Tel: 0845 601 7241, - ,,,No ratings yet Rate it yourself - /Services/opticians/LeaveReview/DefaultView.aspx?id=OL/CO-2008/5EY__000001_CV13EZ,0,0,
Optical Clinic,B114DA_0001__000002_B114DA,OPT,837 Stratford Road,Sparkhill,Birmingham,West Midlands,,B11 4DA,Tel: 0121 777 2111, - ,,,No ratings yet Rate it yourself - /Services/opticians/LeaveReview/DefaultView.aspx?id=B114DA_0001__000002_B114DA,0,0,
Jason Rice i-Care,OP_5MD_8668__000001_CV61JF,OPT,1a Engleton Road,,Coventry,,,CV6 1JF,Tel: 024 7659 2173, - ,,,1 rating Rate it yourself - /Services/opticians/LeaveReview/DefaultView.aspx?id=OP_5MD_8668__000001_CV61JF,,,
Vision Call Midlands,01259__000003_B112JP,OPT,463-465 Warwick Road,Tylesley,Tylesley,,,B11 2JP,Tel: 0121 708 1349, - ,,,No ratings yet Rate it yourself - /Services/opticians/LeaveReview/DefaultView.aspx?id=01259__000003_B112JP,0,0,
Ian Michael Hadfield,OP_5D1_13860__000001_B376BB,OPT,,37 The Parade,Kingshurst,Birmingham,,B37 6BB,Tel: 0121 770 3226, - ,,,No ratings yet Rate it yourself - /Services/opticians/LeaveReview/DefaultView.aspx?id=OP_5D1_13860__000001_B376BB,0,0,
Maxton Saunders Ltd,5PG175,OPT,,842 Stratford Road,Sparkhill,Birmingham,,B11 4BS,Tel: 0121 777 4081, - ,,,1 rating Rate it yourself - /Services/opticians/LeaveReview/DefaultView.aspx?id=5PG175,,,
Boots-Coventry - Lower Precinct,CV1 1DS_01918,OPT,,49 Lower Precinct,,Coventry,West Midlands,CV1 1DS,Tel: 02476226561, - ,,,1 rating Rate it yourself - /Services/opticians/LeaveReview/DefaultView.aspx?id=CV1 1DS_01918,,,
Specsavers Opticians,OP_5MD_12567__000001_CV11DX,OPT,56-58 Lower Precinct,,Coventry,West Midlands,,CV1 1DS,Tel: 024 7663 3378, - ,,,No ratings yet Rate it yourself - /Services/opticians/LeaveReview/DefaultView.aspx?id=OP_5MD_12567__000001_CV11DX,0,0,
Boots-Coventry - Radford Rd,OP_5MD_9322__000001_CV63BU,OPT,258 Radford Road,,,Coventry,Warwickshire,CV6 3BU,Tel: 02476 598 233, - ,,,1 rating Rate it yourself - /Services/opticians/LeaveReview/DefaultView.aspx?id=OP_5MD_9322__000001_CV63BU,,,
Vision Replublic,5M1098,OPT,,1003 Alcester Road South,Maypole,Birmingham,,B14 5JA,Tel: 0121 430 6572, - ,,,No ratings yet Rate it yourself - /Services/opticians/LeaveReview/DefaultView.aspx?id=5M1098,0,0,
Penzer Opticians,OP_5M1_5811__000001_B145HG,OPT,1024 Alcester Road South,Maypole,Nr Kings Heath,Birmingham,,B14 5NG,Tel: 0121 430 5538, - ,,,1 rating Rate it yourself - /Services/opticians/LeaveReview/DefaultView.aspx?id=OP_5M1_5811__000001_B145HG,,,yes
Scrivens Opticians,OP_5MP_453__000002_B463AG,OPT,91 High Street,Coleshill,Birmingham,,,B46 3AG,Tel: 01675 464507, - ,,,No ratings yet Rate it yourself - /Services/opticians/LeaveReview/DefaultView.aspx?id=OP_5MP_453__000002_B463AG,0,0,
Vision Express (UK) Ltd,OP_5MD_11409__000001_CV11QS,OPT,11 West Orchard Shopping Centre,,Coventry,,,CV1 1QS,Tel: 024 7623 1123, - ,,,No ratings yet Rate it yourself - /Services/opticians/LeaveReview/DefaultView.aspx?id=OP_5MD_11409__000001_CV11QS,0,0,
Clarke Opticians Ltd,OP_5MD_3230__000001_CV35HW,OPT,8 Quinton Parade,,,Coventry,,CV3 5HW,Tel: 024 7650 6300, - ,,,No ratings yet Rate it yourself - /Services/opticians/LeaveReview/DefaultView.aspx?id=OP_5MD_3230__000001_CV35HW,0,0,
Boots Opticians Ltd,OP_5MD_6983__000002_CV11HF,OPT,49 Lower Precinct,,Coventry,,,CV1 1HF,Tel: 024 7622 2225, - ,,,No ratings yet Rate it yourself - /Services/opticians/LeaveReview/DefaultView.aspx?id=OP_5MD_6983__000002_CV11HF,0,0,
Asda Optician,OPT_B10 0HH,OPT,,SMALL HEATH,"859, COVENTRY ROAD",BIRMINGHAM,,B10 0HH,Tel: 0121 7664810, - ,,,No ratings yet Rate it yourself - /Services/opticians/LeaveReview/DefaultView.aspx?id=OPT_B10 0HH,0,0,
Specsavers Opticians,000CV35HD,OPT,,129 Daventry Road,,"Cheylesmore, Coventry",West Midlands,CV3 5HD,Tel: 02476 507950, - ,,,No ratings yet Rate it yourself - /Services/opticians/LeaveReview/DefaultView.aspx?id=000CV35HD,0,0,
Opticial Express,OP_12345_CV1 2JZ,OPT,4th Floor Sun Alliance House,Little Park Street,,Coventry,West Midlands,CV1 2JZ,Tel: 0800 023 2020, - ,,,No ratings yet Rate it yourself - /Services/opticians/LeaveReview/DefaultView.aspx?id=OP_12345_CV1 2JZ,0,0,
Boots-Coventry - Daventry Rd,OP_5MD_7170__000001_CV35HF,OPT,179 Daventry Road,Cheylesmore,Coventry,West Midlands,,CV3 5HF,Tel: 02476 502825, - ,,,2 ratings Rate it yourself - /Services/opticians/LeaveReview/DefaultView.aspx?id=OP_5MD_7170__000001_CV35HF,,,
Vision Replublic Opticians,5PG129,OPT,,15 Ownall Road,Shard End,Birmingham,,B34 7AH,Tel: 0121 439 7979, - ,,,No ratings yet Rate it yourself - /Services/opticians/LeaveReview/DefaultView.aspx?id=5PG129,0,0,
20-20 Vision,5PG131,OPT,,226 Warwick Road,Acocks Green,Birmingham,,B11 2ND,Tel: 0121 772 7709, - ,,,No ratings yet Rate it yourself - /Services/opticians/LeaveReview/DefaultView.aspx?id=5PG131,0,0,
Browetts Opticians,OP_5MQ_1346__000001_CV344HS,OPT,Browett Opticians,3 Market Street,,Warwick,,CV34 4DH,Tel: 01926 493157, - ,,,2 ratings Rate it yourself - /Services/opticians/LeaveReview/DefaultView.aspx?id=OP_5MQ_1346__000001_CV344HS,,,
Vision Express,OP_5MQ_7813__000001_CV344SD,OPT,,72 Market Place,,Warwick,Warwickshire,CV34 4SD,Tel: 01926 419100, - ,,,No ratings yet Rate it yourself - /Services/opticians/LeaveReview/DefaultView.aspx?id=OP_5MQ_7813__000001_CV344SD,0,0,
McConnell Optometrist,OP_5MQ_2263__000001_CV344AB,OPT,,6 Swan Street,,Warwick,Warwickshire,CV34 4BJ,Tel: 01926 492487, - ,,,No ratings yet Rate it yourself - /Services/opticians/LeaveReview/DefaultView.aspx?id=OP_5MQ_2263__000001_CV344AB,0,0,
Eye Centre (Birmingham) Ltd,5PG04__000004_B112NB,OPT,,202 Warwick Road,Greet,Birmingham,,B11 2NB,Tel: 0121 772 2505, - ,,,No ratings yet Rate it yourself - /Services/opticians/LeaveReview/DefaultView.aspx?id=5PG04__000004_B112NB,0,0,
Eyesite Eyecare Centre,OP_5MD_4162__000002_CV63ET,OPT,50 Jubilee Crescent,"50 Jubilee Crescent, Radford",Coventry,Coventry,,CV6 3ET,Tel: 024 7660 1113, - ,,,No ratings yet Rate it yourself - /Services/opticians/LeaveReview/DefaultView.aspx?id=OP_5MD_4162__000002_CV63ET,0,0,yes
Cook Eyecare Ltd,COOKS__000001_B347HR,OPT,,6 Hurst Lane,Castle Bromwich,Birmingham,,B34 7HR,Tel: 0121 747 3847, - ,,,2 ratings Rate it yourself - /Services/opticians/LeaveReview/DefaultView.aspx?id=COOKS__000001_B347HR,,,
B S Breakwell Optometrists,OP_5MQ_7876__000001_CV344EW,OPT,16 Jury Street,,Warwick,,,CV34 4EW,Tel: 01926 491426, - ,,,No ratings yet Rate it yourself - /Services/opticians/LeaveReview/DefaultView.aspx?id=OP_5MQ_7876__000001_CV344EW,0,0,
Vincent Roberts Optometrist,OP_5M1_3786__000001_B146EB,OPT,267 Alcester Road South,Kings Heath,Birmingham,,,B14 6EB,Tel: 0121 441 2843, - ,,,4 ratings Rate it yourself - /Services/opticians/LeaveReview/DefaultView.aspx?id=OP_5M1_3786__000001_B146EB,,,
A S Gill Optometrists,5PG159,OPT,,537 Stratford Road,Sparkhill,Birmingham,,B11 4LP,Tel: 0121 766 5491, - ,,,No ratings yet Rate it yourself - /Services/opticians/LeaveReview/DefaultView.aspx?id=5PG159,0,0,
A S Gill Optometrists,5MX59__000003_B114LP,OPT,537 Stratford Road,Sparkhill,Birmingham,Birmingham,,B11 4LP,Tel: 0121 766 5491, - ,,,No ratings yet Rate it yourself - /Services/opticians/LeaveReview/DefaultView.aspx?id=5MX59__000003_B114LP,0,0,
Eye Sight Centre Opticians,5MX099,OPT,,485 Stratford Road,Sparkhill,Birmingham,,B11 4LE,Tel: 0121 771 1277, - ,,,No ratings yet Rate it yourself - /Services/opticians/LeaveReview/DefaultView.aspx?id=5MX099,0,0,
Banks Opticians,5PG162,OPT,,467 Stratford Road,Sparkhill,Birmingham,West Midlands,B11 4LD,Tel: 0121 773 2047, - ,,,No ratings yet Rate it yourself - /Services/opticians/LeaveReview/DefaultView.aspx?id=5PG162,0,0,
The Eyewear House,OP_5MD_9650__000001_CV14FW,OPT,65 Stoney Stanton Road,,,Coventry,,CV1 4FW,Tel: 024 7655 5573, - ,,,No ratings yet Rate it yourself - /Services/opticians/LeaveReview/DefaultView.aspx?id=OP_5MD_9650__000001_CV14FW,0,0,