Organisation Name,NACS Code,Organisation Type,Address1,Address2,Address3,Address4,Address5,PostCode,Telephone Number,Opening time,Value  (Opening time),Banding Classification  (Opening time),NHS.UK users rating,Value  (NHS.UK users rating),Banding Classification  (NHS.UK users rating),Car parking (Is there car parking at this organisation?)
Ingram & Schofield,OP_5LT_8428__000001_BN108JR,OPT,224 South Coast Road,,Peacehaven,East Sussex,,BN10 8JR,Tel: 01273 582549, - ,,,No ratings yet Rate it yourself - /Services/opticians/LeaveReview/DefaultView.aspx?id=OP_5LT_8428__000001_BN108JR,0,0,
Scrivens,OPT_BN108BB_1,OPT,,10-11 Meridian Centre,,Peacehaven,Sussex,BN10 8BB,Tel: 01273 585359, - ,,,No ratings yet Rate it yourself - /Services/opticians/LeaveReview/DefaultView.aspx?id=OPT_BN108BB_1,0,0,
The Deans Optician,9010,OPT,,18 Longridge Avenue,,Saltdean,East Sussex,BN2 8LH,Tel: 01273 303111, - ,,,No ratings yet Rate it yourself - /Services/opticians/LeaveReview/DefaultView.aspx?id=9010,0,0,yes
Barracloughs the Opticians,OP_5LR_2083__000001_BN251DJ,OPT,The Old Cottage,Dane Road,Seaford,Seaford,,BN25 1DJ,Tel: 01323 898777, - ,,,No ratings yet Rate it yourself - /Services/opticians/LeaveReview/DefaultView.aspx?id=OP_5LR_2083__000001_BN251DJ,0,0,
Specsavers Opticians,OP_5P7_3128__000002_BN251NF,OPT,34 Broad Street,,Seaford,East Sussex,,BN25 1NF,Tel: 01323 493050, - ,,,No ratings yet Rate it yourself - /Services/opticians/LeaveReview/DefaultView.aspx?id=OP_5P7_3128__000002_BN251NF,0,0,
Redgold Opticians,OP_5LR_7409__000001_BN251LA,OPT,32 Broad Street,,Seaford,,,BN25 1ND,Tel: 01323 890200, - ,,,No ratings yet Rate it yourself - /Services/opticians/LeaveReview/DefaultView.aspx?id=OP_5LR_7409__000001_BN251LA,0,0,
Sussex Eyecare Ltd,CO2386__000003_BN251LS,OPT,,9 Broad Street,,Seaford,,BN25 1LS,Tel: 01323 892211, - ,,,No ratings yet Rate it yourself - /Services/opticians/LeaveReview/DefaultView.aspx?id=CO2386__000003_BN251LS,0,0,
Specsavers Opticians,OP_5P7_17089__000002_BN72AF,OPT,218 High Street,,Lewes,East Sussex,,BN7 2AF,Tel: 01273 407690, - ,,,No ratings yet Rate it yourself - /Services/opticians/LeaveReview/DefaultView.aspx?id=OP_5P7_17089__000002_BN72AF,0,0,
"Wilson, Wilson & Hancock",OP_5LT_2563__000001_BN72AF,OPT,223a High Street,Lewes,,East Sussex,,BN7 2AF,Tel: 01273 472360, - ,,,No ratings yet Rate it yourself - /Services/opticians/LeaveReview/DefaultView.aspx?id=OP_5LT_2563__000001_BN72AF,0,0,
Spectrum Eyecare,OP_5LT_7843__000001_BN72AH,OPT,,24-25 Cliffe High Street,,Lewes,East Sussex,BN7 2AH,Tel: 01273 480303, - ,,,No ratings yet Rate it yourself - /Services/opticians/LeaveReview/DefaultView.aspx?id=OP_5LT_7843__000001_BN72AH,0,0,
Specsavers Opticians,TP9AN,OPT,,142-143 London Road,,Brighton,Sussex,BN1 4JH,Tel: 01273 121636, - ,,,No ratings yet Rate it yourself - /Services/opticians/LeaveReview/DefaultView.aspx?id=TP9AN,0,0,
Specs,OP_5LQ_8554__000001_BN14AL,OPT,22 Kensington Gardens,,Brighton,East Sussex,,BN1 4AL,Tel: 01273 676796, - ,,,No ratings yet Rate it yourself - /Services/opticians/LeaveReview/DefaultView.aspx?id=OP_5LQ_8554__000001_BN14AL,0,0,
Boots-Brighton - London Rd,OP_5LQ_1521__000001_BN14JB,OPT,,39 London Road,,Brighton,Sussex,BN1 4JB,Tel: 01273 698 142, - ,,,No ratings yet Rate it yourself - /Services/opticians/LeaveReview/DefaultView.aspx?id=OP_5LQ_1521__000001_BN14JB,0,0,
Specsavers Opticians,OP_5LQ_8510__000002_BN11RH,OPT,49 North Street,,Brighton,East Sussex,,BN1 1RH,Tel: 01273 328322, - ,,,No ratings yet Rate it yourself - /Services/opticians/LeaveReview/DefaultView.aspx?id=OP_5LQ_8510__000002_BN11RH,0,0,
Eyesite Opticians,OP_5LQ_12450__000001_BN11RH,OPT,47-48 North Street,,,Brighton,East Sussex,BN1 1RH,Tel: 01273 724111, - ,,,No ratings yet Rate it yourself - /Services/opticians/LeaveReview/DefaultView.aspx?id=OP_5LQ_12450__000001_BN11RH,0,0,
Boots-Brighton - North St,OP_5LQ_3884__000002_BN12BE,OPT,129 North Street,,Brighton,Brighton,East Sussex,BN1 2BE,Tel: 01273 325600, - ,,,No ratings yet Rate it yourself - /Services/opticians/LeaveReview/DefaultView.aspx?id=OP_5LQ_3884__000002_BN12BE,0,0,
Optical Express,OP_12345_BN1 3XF,OPT,Queensberry House,"2nd Floor, 103-109 Queens Road",,Brighton,East Sussex,BN1 3XF,Tel: 0800 023 2020, - ,,,No ratings yet Rate it yourself - /Services/opticians/LeaveReview/DefaultView.aspx?id=OP_12345_BN1 3XF,0,0,
Thomas H. Collison Ltd,TP35T,OPT,57b London Road,57B London Road,Brighton,Brighton ,,BN1 4JE,Tel: 01273 682952, - ,,,No ratings yet Rate it yourself - /Services/opticians/LeaveReview/DefaultView.aspx?id=TP35T,0,0,
Vision Express ,OP_5LQ_13075__000001_BN12TE,OPT,Unit 60,Churchill Square,,Brighton,,BN1 2TE,Tel: 01273 737901, - ,,,No ratings yet Rate it yourself - /Services/opticians/LeaveReview/DefaultView.aspx?id=OP_5LQ_13075__000001_BN12TE,0,0,
Vision Care for Homeless People Ltd,OP_BN13BF_46465,OPT,BHT First Base Day Centre,St Stephens Hall,Montpelier Place,Brighton,,BN1 3BF,Tel: 01273 326844, - ,,,No ratings yet Rate it yourself - /Services/opticians/LeaveReview/DefaultView.aspx?id=OP_BN13BF_46465,0,0,
Asda Opticians Ltd,OP_5LQ_2058__000002_BN18AS,OPT,1 Crowhurst Road,Hollingbury,Brighton,East Sussex,,BN1 8AS,Tel: 01273 560412, - ,,,No ratings yet Rate it yourself - /Services/opticians/LeaveReview/DefaultView.aspx?id=OP_5LQ_2058__000002_BN18AS,0,0,
Boots-Hove,OP_5LQ_11589__000001_BN33YA,OPT,25 George Street,,Hove,Hove,East Sussex,BN3 3YA,Tel: 01273 325970, - ,,,No ratings yet Rate it yourself - /Services/opticians/LeaveReview/DefaultView.aspx?id=OP_5LQ_11589__000001_BN33YA,0,0,
Specsavers Opticians,OP_5LQ_7171__000001_BN33YE,OPT,84 George Street,,Hove,East Sussex,,BN3 3YE,Tel: 01273 746200, - ,,,No ratings yet Rate it yourself - /Services/opticians/LeaveReview/DefaultView.aspx?id=OP_5LQ_7171__000001_BN33YE,0,0,
The Eyecare Centre,00001_BN32DL__000002_BN32DL,OPT,,156 Church Road,,Hove,,BN3 2DL,Tel: 01273 739935, - ,,,No ratings yet Rate it yourself - /Services/opticians/LeaveReview/DefaultView.aspx?id=00001_BN32DL__000002_BN32DL,0,0,
Peter Marson Optometrist,OP_5LQ_1690__000001_BN32DJ,OPT,188 Church Road,,Hove,East Sussex,,BN3 2DJ,Tel: 01273 719012, - ,,,No ratings yet Rate it yourself - /Services/opticians/LeaveReview/DefaultView.aspx?id=OP_5LQ_1690__000001_BN32DJ,0,0,
Complete Community Care (South) Ltd,10053__000003_BN37NA,OPT,,15 Court Close,,Brighton,East Sussex,BN1 8YG,Tel: 01273 220 588, - ,,,No ratings yet Rate it yourself - /Services/opticians/LeaveReview/DefaultView.aspx?id=10053__000003_BN37NA,0,0,
Eyes At Home,OP_5LQ_3261__000001_BN36BJ,OPT,87 Woodland Ave,Hove,Sussex,,,BN3 6BJ,Tel: 0800 3457509, - ,,,No ratings yet Rate it yourself - /Services/opticians/LeaveReview/DefaultView.aspx?id=OP_5LQ_3261__000001_BN36BJ,0,0,
Complete Community Care (South) Ltd,10054__000004_BN37NA,OPT,E5A,Knoll Business Centre,Old Shoreham Road,Hove,Sussex,BN3 7GS,Tel: 01273 220588, - ,,,No ratings yet Rate it yourself - /Services/opticians/LeaveReview/DefaultView.aspx?id=10054__000004_BN37NA,0,0,
Specsavers Opticians (Portslade),OPT_BN35TD_1,OPT,,58-59 Boundary Road,,Portslade,East Sussex,BN3 5TD,Tel: 01273 424860, - ,,,No ratings yet Rate it yourself - /Services/opticians/LeaveReview/DefaultView.aspx?id=OPT_BN35TD_1,0,0,
Peter Marson Optometrist,OP_5L8_10370__000001_BN424FP,OPT,31 Southwick Square,,Southwick,West Sussex,,BN42 4FP,Tel: 01273 592346, - ,,,No ratings yet Rate it yourself - /Services/opticians/LeaveReview/DefaultView.aspx?id=OP_5L8_10370__000001_BN424FP,0,0,
Hassocks Eyecare Centre Ltd,OP_5FK_3523__000001_BN68AD,OPT,,17 Keymer Road,,Hassocks,West Sussex,BN6 8AD,Tel: 01273 843946, - ,,,No ratings yet Rate it yourself - /Services/opticians/LeaveReview/DefaultView.aspx?id=OP_5FK_3523__000001_BN68AD,0,0,yes
M&S Opticians,,OPT,,Holmbush Centre,,Shoreham-by-Sea,,BN43 6TD,, - ,,,N/A - Data not available,,,
Tesco Opticians,OP_5P6_OPTICIAN TESCO__000002_BN436TD,OPT,Upper Shoreham Road,,Shoreham By Sea,West Sussex,,BN43 6TD,Tel: 01273 367638, - ,,,No ratings yet Rate it yourself - /Services/opticians/LeaveReview/DefaultView.aspx?id=OP_5P6_OPTICIAN TESCO__000002_BN436TD,0,0,
Barracloughs the Opticians,OP_5LR_1890__000001_BN266AD,OPT,58a High Street,,Polegate,East Sussex,,BN26 6AD,Tel: 01323 487122, - ,,,No ratings yet Rate it yourself - /Services/opticians/LeaveReview/DefaultView.aspx?id=OP_5LR_1890__000001_BN266AD,0,0,
Thomas H Collison Ltd,OP_5L8_2965__000001_BN435WA,OPT,33 Brunswick Road,,Shoreham By Sea,West Sussex,,BN43 5WA,Tel: 01273 455098, - ,,,No ratings yet Rate it yourself - /Services/opticians/LeaveReview/DefaultView.aspx?id=OP_5L8_2965__000001_BN435WA,0,0,
Edminson Butler Optician,OP_5L8_10932__000001_BN435ZD,OPT,2 The Vinery,St. Mary's Road,Shoreham-By-Sea,West Sussex,,BN43 5ZA,Tel: 01273 453567, - ,,,No ratings yet Rate it yourself - /Services/opticians/LeaveReview/DefaultView.aspx?id=OP_5L8_10932__000001_BN435ZD,0,0,
Green & Elliott Optometrists,OP_5LR_1291__000002_BN211SD,OPT,10 Albert Parade,Green Street,,Eastbourne,,BN21 1SD,Tel: 01323 645123, - ,,,No ratings yet Rate it yourself - /Services/opticians/LeaveReview/DefaultView.aspx?id=OP_5LR_1291__000002_BN211SD,0,0,
Jennifer Armstrong Optician,OP_5L8_6540__000001_BN435DB,OPT,86 High Street,,Shoreham By Sea,,,BN43 5DB,Tel: 01273 462887, - ,,,No ratings yet Rate it yourself - /Services/opticians/LeaveReview/DefaultView.aspx?id=OP_5L8_6540__000001_BN435DB,0,0,
Early and Edmonds,TP3XP,OPT,,"7 Keymer Parade, Keymer Road",,Burgess Hill,West Sussex,RH15 0AB,Tel: 01444 236367, - ,,,No ratings yet Rate it yourself - /Services/opticians/LeaveReview/DefaultView.aspx?id=TP3XP,0,0,
Vision Express,W1004__000004_RH159DE,OPT,19 Station Road,,Burgess Hill,West Sussex,,RH15 9DE,Tel: 01444 232402, - ,,,No ratings yet Rate it yourself - /Services/opticians/LeaveReview/DefaultView.aspx?id=W1004__000004_RH159DE,0,0,
Gardiner Opticians,OP_5FK_10075__000001_RH159BQ,OPT,,9 Church Road,Burgess Hill,West Sussex,,RH15 9BB,Tel: 01444 248277, - ,,,No ratings yet Rate it yourself - /Services/opticians/LeaveReview/DefaultView.aspx?id=OP_5FK_10075__000001_RH159BQ,0,0,
Specsavers Opticians,OP_5FK_6271__000001_RH159BB,OPT,43 Church Road,,Burgess Hill,West Sussex,,RH15 9BB,Tel: 01444 257722, - ,,,No ratings yet Rate it yourself - /Services/opticians/LeaveReview/DefaultView.aspx?id=OP_5FK_6271__000001_RH159BB,0,0,
Boots Opticians,OPT_RH159NP_1,OPT,,22-22a Market Place,,Burgess Hill,,RH15 9NP,, - ,,,No ratings yet Rate it yourself - /Services/opticians/LeaveReview/DefaultView.aspx?id=OPT_RH159NP_1,0,0,
The Spectacle Showroom,TP5AP,OPT,,A3 Ropemaker Park,Diplocks Way,Hailsham,East Sussex,BN27 3GU,Tel: 01323 440394, - ,,,No ratings yet Rate it yourself - /Services/opticians/LeaveReview/DefaultView.aspx?id=TP5AP,0,0,
Mark Soper Opticians,OP_5LR_13726__000001_BN271AU,OPT,The Grove,72 High Street,Hailsham,East Sussex,,BN27 1AU,Tel: 01323 841699, - ,,,No ratings yet Rate it yourself - /Services/opticians/LeaveReview/DefaultView.aspx?id=OP_5LR_13726__000001_BN271AU,0,0,
Specsavers Opticians,OPT_BN271DP_1,OPT,,16 The Quintins,,Hailsham,East Sussex,BN27 1DP,Tel: 01323 840526, - ,,,No ratings yet Rate it yourself - /Services/opticians/LeaveReview/DefaultView.aspx?id=OPT_BN271DP_1,0,0,
The Spectacle Showroom Ltd,OP_5P7_1234__000001_BN271AF,OPT,1 St Mary's Walk,High Street,Hailsham,East Sussex,,BN27 1AF,Tel: 01323 440394, - ,,,No ratings yet Rate it yourself - /Services/opticians/LeaveReview/DefaultView.aspx?id=OP_5P7_1234__000001_BN271AF,0,0,
Focus Medical Centre,OP_5LR_5090__000001_BN271BJ,OPT,18 High Street,,Hailsham,East Sussex,,BN27 1BJ,Tel: 01323 442062, - ,,,No ratings yet Rate it yourself - /Services/opticians/LeaveReview/DefaultView.aspx?id=OP_5LR_5090__000001_BN271BJ,0,0,
Botts Opticians,OPT_BN214TJ_1,OPT,,4a Grove Road,,Eastbourne,East Sussex,BN21 4TJ,Tel: 01323 727782, - ,,,No ratings yet Rate it yourself - /Services/opticians/LeaveReview/DefaultView.aspx?id=OPT_BN214TJ_1,0,0,
Vision Express,OP_5LT_8800__000002_TN221AG,OPT,27 High Street,,Uckfield,,,TN22 1AG,Tel: 01825 767846, - ,,,No ratings yet Rate it yourself - /Services/opticians/LeaveReview/DefaultView.aspx?id=OP_5LT_8800__000002_TN221AG,0,0,
Specsavers Opticians,OP_5P7_17109__000002_TN221BJ,OPT,100 High Street,,,Uckfield,,TN22 1PX,Tel: 01825 746750, - ,,,No ratings yet Rate it yourself - /Services/opticians/LeaveReview/DefaultView.aspx?id=OP_5P7_17109__000002_TN221BJ,0,0,
Specsavers Opticians,OP_5LR_2426__000001_BN213QL,OPT,8b Arndale centre,Terminus road,Eastbourne,East Sussex,,BN21 3QP,Tel: 01323 649767, - ,,,No ratings yet Rate it yourself - /Services/opticians/LeaveReview/DefaultView.aspx?id=OP_5LR_2426__000001_BN213QL,0,0,
Barracloughs the Opticians,OPT_TN221AP_1,OPT,,53 High Street,,Uckfield,,TN22 1AP,, - ,,,No ratings yet Rate it yourself - /Services/opticians/LeaveReview/DefaultView.aspx?id=OPT_TN221AP_1,0,0,
Boots Opticians -Eastbourne (in Boots UK),OP_5LR_41__000001_BN213NW,OPT,15 Eastbourne Arndale Centre,15 The Beacon,,Eastbourne,East Sussex,BN21 3NL,Tel: 01323 411042, - ,,,No ratings yet Rate it yourself - /Services/opticians/LeaveReview/DefaultView.aspx?id=OP_5LR_41__000001_BN213NW,0,0,
Vision Express,OP_5LR_12544__000003_BN213NW,OPT,,134 Terminus Road,The Beacon,Eastbourne,,BN21 3AN,Tel: 01323 722975, - ,,,No ratings yet Rate it yourself - /Services/opticians/LeaveReview/DefaultView.aspx?id=OP_5LR_12544__000003_BN213NW,0,0,
Barracloughs the Opticians,OP_5LR_9446__000001_BN213BB,OPT,194 Terminus Road,,Eastbourne,East Sussex,,BN21 3BB,Tel: 01323 721906, - ,,,No ratings yet Rate it yourself - /Services/opticians/LeaveReview/DefaultView.aspx?id=OP_5LR_9446__000001_BN213BB,0,0,
Lancing Eye Care,OP_5L8_11149__000001_BN158AA,OPT,6a Station Parade,,Lancing,West Sussex,,BN15 8AA,Tel: 01903 752021, - ,,,No ratings yet Rate it yourself - /Services/opticians/LeaveReview/DefaultView.aspx?id=OP_5L8_11149__000001_BN158AA,0,0,
Lancing Optical & Hearing Centre,OP_5L8_10080__000001_BN159BA,OPT,16 Queens Parade,North Road,Lancing,West Sussex,,BN15 9BA,Tel: 01903 753289, - ,,,No ratings yet Rate it yourself - /Services/opticians/LeaveReview/DefaultView.aspx?id=OP_5L8_10080__000001_BN159BA,0,0,
Scrivens Opticians,OP_5FK_4893__000001_RH164LX,OPT,,86 South Road,,Haywards Heath,West Sussex,RH16 4LA,Tel: 01444 454721, - ,,,No ratings yet Rate it yourself - /Services/opticians/LeaveReview/DefaultView.aspx?id=OP_5FK_4893__000001_RH164LX,0,0,
Specsavers Opticians,SS002__000001_RH164JW,OPT,89 South Road,,Haywards Heath,West Sussex,,RH16 4JW,Tel: 01444 255990, - ,,,No ratings yet Rate it yourself - /Services/opticians/LeaveReview/DefaultView.aspx?id=SS002__000001_RH164JW,0,0,
Leightons Opticians & Hearing Care,OP_5FK_9605__000003_RH163TH,OPT,Leightons Opticians,27 The Orchards Shopping Centre,,Haywards Heath,West Sussex,RH16 3TH,Tel: 01444 416877, - ,,,No ratings yet Rate it yourself - /Services/opticians/LeaveReview/DefaultView.aspx?id=OP_5FK_9605__000003_RH163TH,0,0,
Boots-Haywards Heath,OP_5FK_4058__000002_RH163TH,OPT,Unit 3 The Orchards,,Haywards Heath,West Sussex,,RH16 3TH,Tel: 01444 441025, - ,,,No ratings yet Rate it yourself - /Services/opticians/LeaveReview/DefaultView.aspx?id=OP_5FK_4058__000002_RH163TH,0,0,
Vision Express,OP_5FK_10444__000002_RH164LN,OPT,94 South Road,,Haywards Heath,West Sussex,,RH16 4LN,Tel: 01444 413742, - ,,,No ratings yet Rate it yourself - /Services/opticians/LeaveReview/DefaultView.aspx?id=OP_5FK_10444__000002_RH164LN,0,0,
Optical Revolution,OP_5FK_2556__000001_RH164LR,OPT,103 South Road,,Haywards Heath,West Sussex,,RH16 4LR,Tel: 01444 450193, - ,,,No ratings yet Rate it yourself - /Services/opticians/LeaveReview/DefaultView.aspx?id=OP_5FK_2556__000001_RH164LR,0,0,
Asda Opticians,OP_5P7_2058__000003_BN236JH,OPT,The Crumbles,Pevensey Bay Road,Eastbourne,East Sussex,,BN23 6JH,Tel: 01323 471873, - ,,,No ratings yet Rate it yourself - /Services/opticians/LeaveReview/DefaultView.aspx?id=OP_5P7_2058__000003_BN236JH,0,0,
UKP Consultancy Ltd t/a Dolphins Optometrists,OPT_RH164AL_1,OPT,,Dolphin House,33 Muster Green,Haywards Heath,West Sussex,RH16 4AL,Tel: 01444 454808, - ,,,No ratings yet Rate it yourself - /Services/opticians/LeaveReview/DefaultView.aspx?id=OPT_RH164AL_1,0,0,
Henfield Optical Ltd,OP_5MC_9728__000001_BN59DA,OPT,High Street,,Henfield,West Sussex,,BN5 9DA,Tel: 01273 493822, - ,,,No ratings yet Rate it yourself - /Services/opticians/LeaveReview/DefaultView.aspx?id=OP_5MC_9728__000001_BN59DA,0,0,
Henfield Eye Care,OP_5P6_OPTICIAN NIGEL BROWN__000002_BN59DA,OPT,High Street,,Henfield,West Sussex,,BN5 9DA,Tel: 01273 494030, - ,,,No ratings yet Rate it yourself - /Services/opticians/LeaveReview/DefaultView.aspx?id=OP_5P6_OPTICIAN NIGEL BROWN__000002_BN59DA,0,0,
Direct Optical,V0X1I,OPT,,80 Dominion Road,,Worthing,West Sussex,BN14 8JT,Tel: 01903206380, - ,,,No ratings yet Rate it yourself - /Services/opticians/LeaveReview/DefaultView.aspx?id=V0X1I,0,0,
Robinson Opticians,OP_5P6_9546__000001_BN443RD,OPT,,78 HIgh Street,,Steyning,,BN44 3RD,Tel: 01903 813392, - ,,,No ratings yet Rate it yourself - /Services/opticians/LeaveReview/DefaultView.aspx?id=OP_5P6_9546__000001_BN443RD,0,0,yes
Lindfield Eyecare,OPT_RH162HN_1,OPT,,53 High Street,,Lindfield,West Sussex,RH16 2HN,Tel: 01444 484123, - ,,,No ratings yet Rate it yourself - /Services/opticians/LeaveReview/DefaultView.aspx?id=OPT_RH162HN_1,0,0,
Vision Express,OP_5L8_6853__000001_BN113HA,OPT,32 Montague Street,,Worthing,West Sussex,,BN11 3HA,Tel: 01903 212244, - ,,,No ratings yet Rate it yourself - /Services/opticians/LeaveReview/DefaultView.aspx?id=OP_5L8_6853__000001_BN113HA,0,0,
Thomas H Collison Ltd,OP_5L8_11115__000001_BN111SY,OPT,1-1a Liverpool Buildings,Liverpool Road,Worthing,West Sussex,,BN11 1SY,Tel: 01903 821015, - ,,,No ratings yet Rate it yourself - /Services/opticians/LeaveReview/DefaultView.aspx?id=OP_5L8_11115__000001_BN111SY,0,0,
Boots-Worthing - Montague Centre,OP_5L8_9593__000001_BN111YJ,OPT,11 Montague Centre,,,Worthing,West Sussex,BN11 1YJ,Tel: 01903 209180, - ,,,No ratings yet Rate it yourself - /Services/opticians/LeaveReview/DefaultView.aspx?id=OP_5L8_9593__000001_BN111YJ,0,0,
Boots-Worthing - Montague St,OP_5L8_315__000003_BN113HE,OPT,48-52 Montague Street,,,Worthing,West Sussex,BN11 3HE,Tel: 01903 211882, - ,,,No ratings yet Rate it yourself - /Services/opticians/LeaveReview/DefaultView.aspx?id=OP_5L8_315__000003_BN113HE,0,0,
Specsavers Opticians,OP_5P6_OPTICIAN SPECSAVERS WORTHING__000007_BN113H,OPT,61-63 Montague Street,,Worthing,West Sussex,,BN11 3HE,Tel: 01903 215555, - ,,,No ratings yet Rate it yourself - /Services/opticians/LeaveReview/DefaultView.aspx?id=OP_5P6_OPTICIAN SPECSAVERS WORTHING__000007_BN113H,0,0,
Thomas H Collison Ltd,OP_5L8_4863__000001_BN149DB,OPT,7 Cricketers Parade,Broadwater,Worthing,West Sussex,,BN14 9DB,Tel: 01903 231041, - ,,,No ratings yet Rate it yourself - /Services/opticians/LeaveReview/DefaultView.aspx?id=OP_5L8_4863__000001_BN149DB,0,0,
Pople & Broad Opticians,OP_5P7_13327__000002_TN218JB,OPT,50 High Street,,Heathfield,East Sussex,,TN21 8JB,Tel: 01435 863232, - ,,,No ratings yet Rate it yourself - /Services/opticians/LeaveReview/DefaultView.aspx?id=OP_5P7_13327__000002_TN218JB,0,0,
Boots-Worthing - Goring Rd,OP_5L8_10097__000001_BN124AL,OPT,6 Wallace Parade,,Goring Road,Worthing,West Sussex,BN12 4AL,Tel: 01903 249 177, - ,,,No ratings yet Rate it yourself - /Services/opticians/LeaveReview/DefaultView.aspx?id=OP_5L8_10097__000001_BN124AL,0,0,
Vision Express,OP_5L8_10453__000001_BN124AD,OPT,,48 Goring Road,,Worthing,,BN12 4AD,Tel: 01903 247042, - ,,,No ratings yet Rate it yourself - /Services/opticians/LeaveReview/DefaultView.aspx?id=OP_5L8_10453__000001_BN124AD,0,0,
Individual Eyes,OP_5P6_OPTICIAN INDIVIDUAL EYES__000002_BN124PE,OPT,324 Goring Road,Goring-By-Sea,Worthing,West Sussex,,BN12 4PE,Tel: 01903 507771, - ,,,No ratings yet Rate it yourself - /Services/opticians/LeaveReview/DefaultView.aspx?id=OP_5P6_OPTICIAN INDIVIDUAL EYES__000002_BN124PE,0,0,
Arthur Hayes Opticians,OP_5LT_2866__000001_TN61DR,OPT,Campbell House,Croft Road,,Crowborough,,TN6 1DR,Tel: 01892 664826, - ,,,No ratings yet Rate it yourself - /Services/opticians/LeaveReview/DefaultView.aspx?id=OP_5LT_2866__000001_TN61DR,0,0,
Vision Express,OP_5LT_9107__000001_TN61DA,OPT,The Broadway,,Crowborough,East Sussex,,TN6 1DA,Tel: 01892 661487, - ,,,No ratings yet Rate it yourself - /Services/opticians/LeaveReview/DefaultView.aspx?id=OP_5LT_9107__000001_TN61DA,0,0,
Asda Opticians ,OP_BN126PN_85745,OPT,,Littlehampton Road,Ferring,Worthing,West Sussex,BN12 6PN,Tel: 01903 540100, - ,,,No ratings yet Rate it yourself - /Services/opticians/LeaveReview/DefaultView.aspx?id=OP_BN126PN_85745,0,0,
Simply Vision Opticians,X5N3G,OPT,,26 Cooden Sea Road,,Bexhill-on-Sea,,TN39 4SJ,, - ,,,No ratings yet Rate it yourself - /Services/opticians/LeaveReview/DefaultView.aspx?id=X5N3G,0,0,
Specsavers Opticians,Q1V1O,OPT,,9A High Street,Crowborough,East Sussex,,TN6 2QA,Tel: 01892 362091, - ,,,No ratings yet Rate it yourself - /Services/opticians/LeaveReview/DefaultView.aspx?id=Q1V1O,0,0,
Martin Steels Ltd,OP_5MC_10264__000002_RH204NQ,OPT,5 Old Mill Square,,Storrington,West Sussex,,RH20 4NQ,Tel: 01903 740420, - ,,,No ratings yet Rate it yourself - /Services/opticians/LeaveReview/DefaultView.aspx?id=OP_5MC_10264__000002_RH204NQ,0,0,
Averns & Sandall,OP_5MC_9293__000001_RH204DH,OPT,5 North Street,,Storrington,West Sussex,,RH20 4DH,Tel: 01903 742640, - ,,,No ratings yet Rate it yourself - /Services/opticians/LeaveReview/DefaultView.aspx?id=OP_5MC_9293__000001_RH204DH,0,0,
Green & Elliott Optometrists,OP_5FH_2952__000001_TN393JE,OPT,,36 Sackville Road,,Bexhill-on-Sea,,TN39 3JE,Tel: 01424 212544, - ,,,No ratings yet Rate it yourself - /Services/opticians/LeaveReview/DefaultView.aspx?id=OP_5FH_2952__000001_TN393JE,0,0,
Barracloughs the Opticians,OP_5FH_12491__000001_TN401DT,OPT,,41 Western Road,,Bexhill-on-Sea,,TN40 1DT,Tel: 01424 219543, - ,,,No ratings yet Rate it yourself - /Services/opticians/LeaveReview/DefaultView.aspx?id=OP_5FH_12491__000001_TN401DT,0,0,
Specsavers,OP_5P8_2552__000001_TN401DX,OPT,6 Western Road,,Bexhill On Sea,East Sussex,,TN40 1DX,Tel: 01424 739110, - ,,,No ratings yet Rate it yourself - /Services/opticians/LeaveReview/DefaultView.aspx?id=OP_5P8_2552__000001_TN401DX,0,0,
Vision Express,OP_5FH_9524__000001_TN401BD,OPT,43 Devonshire Road,,Bexhill-on-Sea,,,TN40 1BD,Tel: 01424 219306, - ,,,No ratings yet Rate it yourself - /Services/opticians/LeaveReview/DefaultView.aspx?id=OP_5FH_9524__000001_TN401BD,0,0,
Specsavers Opticians,OP_5P6_OPTICIAN SPECSAVERS RUSTINGTON__000002_BN16,OPT,136-138 The Street,,Rustington,West Sussex,,BN16 3DN,Tel: 01903 788667, - ,,,No ratings yet Rate it yourself - /Services/opticians/LeaveReview/DefaultView.aspx?id=OP_5P6_OPTICIAN SPECSAVERS RUSTINGTON__000002_BN16,0,0,
Thomas H Collison Ltd,OP_5L8_3877__000001_BN163DP,OPT,109 The Street,,Rustington,West Sussex,,BN16 3DP,Tel: 01903 785048, - ,,,No ratings yet Rate it yourself - /Services/opticians/LeaveReview/DefaultView.aspx?id=OP_5L8_3877__000001_BN163DP,0,0,
Boots-Rustington,OP_5L8_10626__000003_BN163DJ,OPT,8 Churchill Parade,The Street,Rustington,Littlehampton,,BN16 3DJ,Tel: 01903 786 330, - ,,,No ratings yet Rate it yourself - /Services/opticians/LeaveReview/DefaultView.aspx?id=OP_5L8_10626__000003_BN163DJ,0,0,
Boots-Rustington,OPT_BN163DJ_1,OPT,,8 Churchill Parade,The Street,Rustington,West Sussex,BN16 3DJ,Tel: 01903 786330, - ,,,No ratings yet Rate it yourself - /Services/opticians/LeaveReview/DefaultView.aspx?id=OPT_BN163DJ_1,0,0,
Golding & Maud EyeCare,L8P4W ,OPT,Broadfield Health Centre,Coachmans Drive,,Crawley,Sussex,RH11 9YZ,Tel: 01293 542049, - ,,,No ratings yet Rate it yourself - /Services/opticians/LeaveReview/DefaultView.aspx?id=L8P4W,0,0,