Organisation Name,NACS Code,Organisation Type,Address1,Address2,Address3,Address4,Address5,PostCode,Telephone Number,Opening time,Value  (Opening time),Banding Classification  (Opening time),NHS.UK users rating,Value  (NHS.UK users rating),Banding Classification  (NHS.UK users rating),Car parking (Is there car parking at this organisation?)
Wilton i Ltd,SP2 0DF,OPT,within The Old Orchard Surgery,South Street,,Wilton,,SP2 0JU,Tel: 01722 743122, - ,,,No ratings yet Rate it yourself - /Services/opticians/LeaveReview/DefaultView.aspx?id=SP2 0DF,0,0,
Mark Jones Eyecare,OP_5DJ_14125__000001_SP27SU,OPT,,21 Fisherton Street,,Salisbury,,SP2 7SU,Tel: 01722 322891, - ,,,1 rating Rate it yourself - /Services/opticians/LeaveReview/DefaultView.aspx?id=OP_5DJ_14125__000001_SP27SU,,,
EyeStyle Centre Opticians Ltd,OP_5CD_50__000001_SP78AA,OPT,56 High Street,,Shaftesbury,Shaftesbury,,SP7 8AA,Tel: 01747 851006, - ,,,No ratings yet Rate it yourself - /Services/opticians/LeaveReview/DefaultView.aspx?id=OP_5CD_50__000001_SP78AA,0,0,
Batemans (Opticians) Ltd,OP_5DJ_3495__000001_SP12LX,OPT,6 Bridge Street,,Salisbury,,,SP1 2LX,Tel: 01722 322585, - ,,,No ratings yet Rate it yourself - /Services/opticians/LeaveReview/DefaultView.aspx?id=OP_5DJ_3495__000001_SP12LX,0,0,
S H Harrold (1937) Ltd,CO-2389__000001_SP78JE,OPT,,49 High Street,,SHAFTESBURY,Dorset,SP7 8JE,Tel: 01747 853553, - ,,,1 rating Rate it yourself - /Services/opticians/LeaveReview/DefaultView.aspx?id=CO-2389__000001_SP78JE,,,
Boots-Salisbury - Silver St,SP1 2NG_29481,OPT,,41-49 Silver Street,,Salisbury,Wiltshire,SP1 2NG,Tel: 01722 412625, - ,,,4 ratings Rate it yourself - /Services/opticians/LeaveReview/DefaultView.aspx?id=SP1 2NG_29481,,,
Robert Frith Opticians (Wessex) Ltd,OP_5CD_12558__000001_SP78AR,OPT,Wesley House,12 Bell Street,,SHAFTESBURY,Dorset,SP7 8AR,Tel: 01747 854761, - ,,,No ratings yet Rate it yourself - /Services/opticians/LeaveReview/DefaultView.aspx?id=OP_5CD_12558__000001_SP78AR,0,0,
Boots Opticians Limited,OP_5DJ_11593__000001_SP12AA,OPT,49-51 New Canel,,Salisbury,,,SP1 2AA,Tel: 01722 412625, - ,,,No ratings yet Rate it yourself - /Services/opticians/LeaveReview/DefaultView.aspx?id=OP_5DJ_11593__000001_SP12AA,0,0,
Vision Express (UK) Ltd,OP_5DJ_1147__000002_SP11EP,OPT,25-27 Butcher Row,,Salisbury,,,SP1 1EP,Tel: 01722 330056, - ,,,No ratings yet Rate it yourself - /Services/opticians/LeaveReview/DefaultView.aspx?id=OP_5DJ_1147__000002_SP11EP,0,0,
Silverthornes Opticians,OP_5DJ_14126__000001_SP12DD,OPT,50 Catherine Street,,Salisbury,Wiltshire,,SP1 2DD,Tel: 01722 322880, - ,,,No ratings yet Rate it yourself - /Services/opticians/LeaveReview/DefaultView.aspx?id=OP_5DJ_14126__000001_SP12DD,0,0,
Boots-Salisbury - Catherine St,OP_5DJ_10591__000001_SP12DF,OPT,17 Catherine Street,,,Salisbury,Wiltshire,SP1 2DF,Tel: 01722 322 522, - ,,,No ratings yet Rate it yourself - /Services/opticians/LeaveReview/DefaultView.aspx?id=OP_5DJ_10591__000001_SP12DF,0,0,
Memory Opticians,OP_5DJ_8550__000002_SP12DF,OPT,13 Catherine Street,,Salisbury,,,SP1 2DF,Tel: 01722 410959, - ,,,No ratings yet Rate it yourself - /Services/opticians/LeaveReview/DefaultView.aspx?id=OP_5DJ_8550__000002_SP12DF,0,0,
Specsavers Opticians,OP_5DJ_9766__000001_SP12DG,OPT,1 Catherine Street,,Salisbury,,,SP1 2DF,Tel: 01722 412255, - ,,,No ratings yet Rate it yourself - /Services/opticians/LeaveReview/DefaultView.aspx?id=OP_5DJ_9766__000001_SP12DG,0,0,
Bourneside Optometry Limited - Mrs S Downie,OPT_SP46HL_1,OPT,,Bourneside House,,Salisbury,,SP4 6HL,Tel: 01980 611433, - ,,,No ratings yet Rate it yourself - /Services/opticians/LeaveReview/DefaultView.aspx?id=OPT_SP46HL_1,0,0,
Boots Opticians Warminster,240417135350,OPT,,51 Market Place,,Warminster,,BA12 9AZ,, - ,,,No ratings yet Rate it yourself - /Services/opticians/LeaveReview/DefaultView.aspx?id=240417135350,0,0,
Haine & Smith Opticians,OP_5DH_11016__000001_BA129AN,OPT,,10 Market Place,,Warminster,Wiltshire,BA12 9AN,Tel: 01985 212034, - ,,,No ratings yet Rate it yourself - /Services/opticians/LeaveReview/DefaultView.aspx?id=OP_5DH_11016__000001_BA129AN,0,0,
Batemans (Opticians) Ltd,OP_5DH_82__000001_BA129AY,OPT,21 Market Place,,,Warminster,Wiltshire,BA12 9AY,Tel: 01985 213347, - ,,,No ratings yet Rate it yourself - /Services/opticians/LeaveReview/DefaultView.aspx?id=OP_5DH_82__000001_BA129AY,0,0,
Specsavers Opticians,OP_5DH_645__000005_BA129AY,OPT,Unit 2,1 Market Place,Warminster,Wiltshire,,BA12 9AY,Tel: 01985 219 016, - ,,,No ratings yet Rate it yourself - /Services/opticians/LeaveReview/DefaultView.aspx?id=OP_5DH_645__000005_BA129AY,0,0,
Robert Frith Opticians Ltd,OP_5CD_13759__000001_SP84AA,OPT,Fairfield House,36 High Street,,GILLINGHAM,Dorset,SP8 4AA,Tel: 01747 825122, - ,,,1 rating Rate it yourself - /Services/opticians/LeaveReview/DefaultView.aspx?id=OP_5CD_13759__000001_SP84AA,,,
Batemans (Opticians) Ltd,OP_5DJ_10456__000004_SP47HD,OPT,12 Salisbury Street,,,Amesbury,Wiltshire,SP4 7HD,Tel: 01980 623228, - ,,,No ratings yet Rate it yourself - /Services/opticians/LeaveReview/DefaultView.aspx?id=OP_5DJ_10456__000004_SP47HD,0,0,
Memory Opticians,OP_5DJ_14124__000005_SP47HD,OPT,44b Salisbury Street,,Amesbury,,,SP4 7HD,Tel: 01980 624065, - ,,,1 rating Rate it yourself - /Services/opticians/LeaveReview/DefaultView.aspx?id=OP_5DJ_14124__000005_SP47HD,,,
Haine & Smith Opticians,SP4 7HD,OPT,,20 Salisbury Street,,Amesbury,Wiltshire,SP4 7HD,Tel: 01980 626551, - ,,,No ratings yet Rate it yourself - /Services/opticians/LeaveReview/DefaultView.aspx?id=SP4 7HD,0,0,
A J Bass,OP_5DH_11495__000001_SP53LX,OPT,53 The Borough,Downton,Salisbury,Wiltshire,,SP5 3LX,Tel: 01725 512058, - ,,,No ratings yet Rate it yourself - /Services/opticians/LeaveReview/DefaultView.aspx?id=OP_5DH_11495__000001_SP53LX,0,0,
A.J Bass BSc FCOptom,OP_5A1_14086__000001_SP61AX,OPT,36 High Street,,Fordingbridge,Hampshire,,SP6 1AX,Tel: 01425 652663, - ,,,2 ratings Rate it yourself - /Services/opticians/LeaveReview/DefaultView.aspx?id=OP_5A1_14086__000001_SP61AX,,,
Haine & Smith Opticians,OP_5DH_2366__000005_BA133BN,OPT,,19 High Street,,Westbury,Wiltshire,BA13 3BN,Tel: 01373 822163, - ,,,No ratings yet Rate it yourself - /Services/opticians/LeaveReview/DefaultView.aspx?id=OP_5DH_2366__000005_BA133BN,0,0,
Carter & Harding,OP_5DH_9220__000001_BA133DN,OPT,21 Maristow Street,,Westbury,,,BA13 3DN,Tel: 01373 822084, - ,,,No ratings yet Rate it yourself - /Services/opticians/LeaveReview/DefaultView.aspx?id=OP_5DH_9220__000001_BA133DN,0,0,
Peacock & Murphy,OP_5FN_5847__000001_BH216DR,OPT,27b Vicarage Road,,Verwood,Dorset,,BH31 6DR,Tel: 01202 825448, - ,,,No ratings yet Rate it yourself - /Services/opticians/LeaveReview/DefaultView.aspx?id=OP_5FN_5847__000001_BH216DR,0,0,
Vision Express ,OP_5CD_7572__000001_DT101AW,OPT,2 Retsel House,Bridge Street,Sturminster Newton,,,DT10 1AW,Tel: 01258 472291, - ,,,No ratings yet Rate it yourself - /Services/opticians/LeaveReview/DefaultView.aspx?id=OP_5CD_7572__000001_DT101AW,0,0,
Specsavers,CO-5497,OPT,,44-48 East Street,,Blandford Forum,,DT11 7DR,, - ,,,No ratings yet Rate it yourself - /Services/opticians/LeaveReview/DefaultView.aspx?id=CO-5497,0,0,
S H Harrold (1937) Ltd,OP_5CD_4949__000002_DT117DX,OPT,,61 East Street,,BLANDFORD FORUM,Dorset,DT11 7DX,Tel: 01258 458476, - ,,,1 rating Rate it yourself - /Services/opticians/LeaveReview/DefaultView.aspx?id=OP_5CD_4949__000002_DT117DX,,,
Scrivens Ltd,OP_5CD_2939__000001_DT117PY,OPT,,9 Market Place,,Blandford Forum,Dorset,DT11 7AF,Tel: 01258 452443, - ,,,No ratings yet Rate it yourself - /Services/opticians/LeaveReview/DefaultView.aspx?id=OP_5CD_2939__000001_DT117PY,0,0,
Robert Frith Opticians (Blandford) Ltd.,OP_5CD_2016__000001_DT117AH,OPT,,3 Market Place,,BLANDFORD FORUM,Dorset,DT11 7AH,Tel: 01258 452207, - ,,,No ratings yet Rate it yourself - /Services/opticians/LeaveReview/DefaultView.aspx?id=OP_5CD_2016__000001_DT117AH,0,0,
Boots-Frome,OP_5FX_12891__000001_BA111BN,OPT,3 Cheap Street,,,Frome,Somerset,BA11 1BN,Tel: 01373 462031, - ,,,No ratings yet Rate it yourself - /Services/opticians/LeaveReview/DefaultView.aspx?id=OP_5FX_12891__000001_BA111BN,0,0,
Eye-Tech Opticians,OP_5FX_13589__000001_BA111AH,OPT,25 Market Place,Frome,,Somerset,,BA11 1AH,Tel: 01373 462573, - ,,,No ratings yet Rate it yourself - /Services/opticians/LeaveReview/DefaultView.aspx?id=OP_5FX_13589__000001_BA111AH,0,0,
O'toid Opticians,01-19886,OPT,,5 The Bridge,,Frome,,BA11 1AR,Tel: 01373 467467, - ,,,No ratings yet Rate it yourself - /Services/opticians/LeaveReview/DefaultView.aspx?id=01-19886,0,0,
Specsavers Opticians,OP_5FX_7746__000002_BA111BS,OPT,19 Westway Centre,Frome,,Somerset,,BA11 1BS,Tel: 01373 451180, - ,,,No ratings yet Rate it yourself - /Services/opticians/LeaveReview/DefaultView.aspx?id=OP_5FX_7746__000002_BA111BS,0,0,
L & M Wincanton Limited,OPT_BA99LA_1,OPT,,16 Market Place,,Wincanton,,BA9 9LA,, - ,,,No ratings yet Rate it yourself - /Services/opticians/LeaveReview/DefaultView.aspx?id=OPT_BA99LA_1,0,0,
L & M Wincanton Limited,OPT_BA99LA_2,OPT,,16 Market Place,,Wincanton,,BA9 9LA,, - ,,,No ratings yet Rate it yourself - /Services/opticians/LeaveReview/DefaultView.aspx?id=OPT_BA99LA_2,0,0,
Sarah Gibson Optometrist ,OP_5K1_6438__000001_BA99LP,OPT,Commerce House,Market Place,,Wincanton,Somerset,BA9 9LP,Tel: 01963 34333, - ,,,1 rating Rate it yourself - /Services/opticians/LeaveReview/DefaultView.aspx?id=OP_5K1_6438__000001_BA99LP,,,
Grace Haine Eyecare Ltd,OP_DT102LZ_34883,OPT,,1 Skye House,Ring Street,STALBRIDGE,Dorset,DT10 2LZ,Tel: 01963 362775, - ,,,No ratings yet Rate it yourself - /Services/opticians/LeaveReview/DefaultView.aspx?id=OP_DT102LZ_34883,0,0,yes
EyeStyle Centre Opticians Ltd,TP7HJ,OPT,,141-143 Station Road,,Dorset,,BH22 0HT,, - ,,,No ratings yet Rate it yourself - /Services/opticians/LeaveReview/DefaultView.aspx?id=TP7HJ,0,0,
Care Opticians,SP10 3DG,OPT,,6 Heath Close,,Wimborne,Dorset,BH21 2LP,Tel: 01202 889472, - ,,,1 rating Rate it yourself - /Services/opticians/LeaveReview/DefaultView.aspx?id=SP10 3DG,,,
Specsavers,BH24 1AT__000001_BH241AT,OPT,2 The Furlong Centre,,Ringwood,Hants,,BH24 1AT,Tel: 01425 484480, - ,,,No ratings yet Rate it yourself - /Services/opticians/LeaveReview/DefaultView.aspx?id=BH24 1AT__000001_BH241AT,0,0,
Memory Opticians,OP_5K4_619__000001_SP97NN,OPT,Station Road,,Tidworth,,,SP9 7NN,Tel: 01980 843440, - ,,,No ratings yet Rate it yourself - /Services/opticians/LeaveReview/DefaultView.aspx?id=OP_5K4_619__000001_SP97NN,0,0,
Boots-Trowbridge,OP_5DH_36__000001_BA148EW,OPT,28-29 Fore Street,,,Trowbridge,Wiltshire,BA14 8EW,Tel: 01225 719055, - ,,,No ratings yet Rate it yourself - /Services/opticians/LeaveReview/DefaultView.aspx?id=OP_5DH_36__000001_BA148EW,0,0,
R D White Opticians,OP5DH__000003_BA148DE,OPT,38 Roundstone Street,,Trowbridge,Wiltshire,,BA14 8DE,Tel: 01225 753172, - ,,,No ratings yet Rate it yourself - /Services/opticians/LeaveReview/DefaultView.aspx?id=OP5DH__000003_BA148DE,0,0,
Haine & Smith Opticians,OP_5DH_2822__000004_BA148AT,OPT,,5a The Shires,,Trowbridge,Wiltshire,BA14 8AT,Tel: 01225 776871, - ,,,No ratings yet Rate it yourself - /Services/opticians/LeaveReview/DefaultView.aspx?id=OP_5DH_2822__000004_BA148AT,0,0,
Specsavers Opticians,OP_5DH_9973__000003_BA148AT,OPT,23 The Shires,Trowbridge,Wiltshire,,,BA14 8AT,Tel: 01225 775 434, - ,,,No ratings yet Rate it yourself - /Services/opticians/LeaveReview/DefaultView.aspx?id=OP_5DH_9973__000003_BA148AT,0,0,
Scrivens Opticians,OP_5A1_14100__000001_BH241AD,OPT,49 High Street,,Ringwood,Hampshire,,BH24 1AD,Tel: 01425 472534, - ,,,No ratings yet Rate it yourself - /Services/opticians/LeaveReview/DefaultView.aspx?id=OP_5A1_14100__000001_BH241AD,0,0,
Carter & Harding,OP_5DH_11493__000001_BA148HD,OPT,5a Fore Street,,Trowbridge,Wiltshire,,BA14 8HD,Tel: 01225 752143, - ,,,No ratings yet Rate it yourself - /Services/opticians/LeaveReview/DefaultView.aspx?id=OP_5DH_11493__000001_BA148HD,0,0,
Kelly Eyecare,OP_5A1_14099__000001_BH241AB,OPT,17 High Street,,Ringwood,Hampshire,,BH24 1AB,Tel: 01425 478545, - ,,,No ratings yet Rate it yourself - /Services/opticians/LeaveReview/DefaultView.aspx?id=OP_5A1_14099__000001_BH241AB,0,0,
PBS Optical,OPT_BH241TW_1,OPT,,Cornerways Cottage,,Ringwood,,BH24 1TW,, - ,,,No ratings yet Rate it yourself - /Services/opticians/LeaveReview/DefaultView.aspx?id=OPT_BH241TW_1,0,0,
Eye See Eye,OP_5A1_14098__000001_BH241DG,OPT,17-19 Christchurch Road,Friday's Cross,Ringwood,,,BH24 1DG,Tel: 01425 477922, - ,,,No ratings yet Rate it yourself - /Services/opticians/LeaveReview/DefaultView.aspx?id=OP_5A1_14098__000001_BH241DG,0,0,
Specsavers,OP_5K4_12374__000005_SN101AJ,OPT,27 The Brittox,,Devizes,Wiltshire,,SN10 1AJ,Tel: 01380 722225, - ,,,No ratings yet Rate it yourself - /Services/opticians/LeaveReview/DefaultView.aspx?id=OP_5K4_12374__000005_SN101AJ,0,0,
Haine & Smith Opticians,OP_5K4_12246__000002_SN101AJ,OPT,,31 The Brittox,,Devizes,Wiltshire,SN10 1AJ,Tel: 01380 723446, - ,,,1 rating Rate it yourself - /Services/opticians/LeaveReview/DefaultView.aspx?id=OP_5K4_12246__000002_SN101AJ,,,
Nixon & Shaw,OP_5K4_9397__000001_SN101DN,OPT,30 Monday Market Street,,Devizes,,,SN10 1DN,Tel: 01380 725802, - ,,,No ratings yet Rate it yourself - /Services/opticians/LeaveReview/DefaultView.aspx?id=OP_5K4_9397__000001_SN101DN,0,0,
Boots-Devizes,SN10 1JG_19183,OPT,,33 Market Place,,Devizes,Wiltshire,SN10 1JG,Tel: 01380 728223, - ,,,1 rating Rate it yourself - /Services/opticians/LeaveReview/DefaultView.aspx?id=SN10 1JG_19183,,,
Eye Tech Opticians,OP_5K4_12373__000001_SN101JL,OPT,34 Market Place,,Devizes,,,SN10 1JG,Tel: 01380 722228, - ,,,No ratings yet Rate it yourself - /Services/opticians/LeaveReview/DefaultView.aspx?id=OP_5K4_12373__000001_SN101JL,0,0,
Specsavers Home Visits,00025__000001_BH217SH,OPT,Unit 4a Arena Business Centre,9 Nimrod Way,Ferndown,Dorset,,BH21 7SH,Tel: 01202 862385, - ,,,9 ratings Rate it yourself - /Services/opticians/LeaveReview/DefaultView.aspx?id=00025__000001_BH217SH,,,
Optique 2000 Ltd,OP_5FN_6873__000001_BH211JN,OPT,7a West Street,,,WIMBORNE,Dorset,BH21 1JN,Tel: 01202 848808, - ,,,20 ratings Rate it yourself - /Services/opticians/LeaveReview/DefaultView.aspx?id=OP_5FN_6873__000001_BH211JN,,,
Scrivens Ltd,OP_5FN_5544__000001_BH211HT,OPT,1 High Street,,,Wimborne,Dorset,BH21 1HR,Tel: 01202 883827, - ,,,No ratings yet Rate it yourself - /Services/opticians/LeaveReview/DefaultView.aspx?id=OP_5FN_5544__000001_BH211HT,0,0,
Peter Bowen Thomas Ltd,OP_5FN_8398__000001_BH211DX,OPT,43 East Street,,Wimborne,,,BH21 1DX,Tel: 01202 889131, - ,,,No ratings yet Rate it yourself - /Services/opticians/LeaveReview/DefaultView.aspx?id=OP_5FN_8398__000001_BH211DX,0,0,
Still & Bedford,E0E1C,OPT,,61 Victoria Road,Ferndown,Bournemouth,Dorset,BH22 9HU,Tel: 01202 891727, - ,,,No ratings yet Rate it yourself - /Services/opticians/LeaveReview/DefaultView.aspx?id=E0E1C,0,0,
Knight Eyecare,,OPT,,61 Victoria Road,,Ferndown,Dorset,BH22 9HU,Tel: 01202 891 727, - ,,,N/A - Data not available,,,
Underwood Eyecare,OP_5FN_4238__000002_BH229TH,OPT,Underwood Eyecare,7 Pennys Walk,,Ferndown,Dorset,BH22 9TH,Tel: 01202 891955, - ,,,1 rating Rate it yourself - /Services/opticians/LeaveReview/DefaultView.aspx?id=OP_5FN_4238__000002_BH229TH,,,
Henderson's,OP_5FN_13758__000001_BH229HZ,OPT,54 Victoria Road,,Ferndown,Dorset,,BH22 9HZ,Tel: 01202 871711, - ,,,No ratings yet Rate it yourself - /Services/opticians/LeaveReview/DefaultView.aspx?id=OP_5FN_13758__000001_BH229HZ,0,0,
Nixon & Shaw,OP_5DH_9392__000001_SN126JU,OPT,6 High Street,,Melksham,,,SN12 6JU,Tel: 01225 703218, - ,,,No ratings yet Rate it yourself - /Services/opticians/LeaveReview/DefaultView.aspx?id=OP_5DH_9392__000001_SN126JU,0,0,
Haine & Smith Opticians,OP_5DH_5723__000002_SN126LG,OPT,,27 High Street,,Melksham,Wiltshire,SN12 6JY,Tel: 01225 707881, - ,,,No ratings yet Rate it yourself - /Services/opticians/LeaveReview/DefaultView.aspx?id=OP_5DH_5723__000002_SN126LG,0,0,
S J Hussey Opticians,OP_5K4_12376__000002_SN95AQ,OPT,2 Old Ford Court,,Pewsey,Wiltshire,,SN9 5AQ,Tel: 01672 564617, - ,,,No ratings yet Rate it yourself - /Services/opticians/LeaveReview/DefaultView.aspx?id=OP_5K4_12376__000002_SN95AQ,0,0,
Carter & Harding,OP_5DH_4248__000001_BA151LL,OPT,9 The Shambles,,,Bradford-on-Avon,,BA15 1JS,Tel: 01225 865206, - ,,,No ratings yet Rate it yourself - /Services/opticians/LeaveReview/DefaultView.aspx?id=OP_5DH_4248__000001_BA151LL,0,0,
Nixon & Shaw,OP_5DH_9177__000001_BA151LN,OPT,4 Church Street,,Bradford-on-Avon,,,BA15 1LN,Tel: 01225 863632, - ,,,No ratings yet Rate it yourself - /Services/opticians/LeaveReview/DefaultView.aspx?id=OP_5DH_9177__000001_BA151LN,0,0,
Parley Optometrists,OP_5FN_391__000002_BH228EB,OPT,127 New Road,West Parley,,FERNDOWN,Dorset,BH22 8EB,Tel: 01202 575759, - ,,,1 rating Rate it yourself - /Services/opticians/LeaveReview/DefaultView.aspx?id=OP_5FN_391__000002_BH228EB,,,yes
Robert Frith Optometrists,OP_5K1_1670__000002_BA77BG,OPT,Fore Street,Castle Cary,Somerset,Somerset,,BA7 7BG,Tel: 01963 351948, - ,,,No ratings yet Rate it yourself - /Services/opticians/LeaveReview/DefaultView.aspx?id=OP_5K1_1670__000002_BA77BG,0,0,
Scrivens Ltd,OP_5KV_6309__000003_BH188DP,OPT,,169-171 The Broadway,,Broadstone,Dorset,BH18 8DS,Tel: 01202 692859, - ,,,2 ratings Rate it yourself - /Services/opticians/LeaveReview/DefaultView.aspx?id=OP_5KV_6309__000003_BH188DP,,,
K C Opticians ,OP_BH107AZ_85049,OPT,,1553 Wimborne Road,Kinson,BOURNEMOUTH,Dorset,BH10 7AZ,Tel: 01202 571601, - ,,,No ratings yet Rate it yourself - /Services/opticians/LeaveReview/DefaultView.aspx?id=OP_BH107AZ_85049,0,0,
S H Harrold (1937) Ltd,OP_5KV_6757__000001_BH151SY,OPT,184c Lower Blandford Road,,Broadstone,Dorset,,BH18 8DP,Tel: 01202 672878, - ,,,No ratings yet Rate it yourself - /Services/opticians/LeaveReview/DefaultView.aspx?id=OP_5KV_6757__000001_BH151SY,0,0,
Tesco Stores Ltd,OL-CO1998-5QN__000002_BH124NX,OPT,Yarrow Road,Mannings Heath,Poole,Dorset,,BH12 4NX,Tel: 01202 457438, - ,,,No ratings yet Rate it yourself - /Services/opticians/LeaveReview/DefaultView.aspx?id=OL-CO1998-5QN__000002_BH124NX,0,0,
Ashleigh Sight Care,OP_5LY_14850__000001_SO518BU,OPT,,8 Church Street,,Romsey,Hampshire,SO51 8BU,Tel: 01794 512480, - ,,,1 rating Rate it yourself - /Services/opticians/LeaveReview/DefaultView.aspx?id=OP_5LY_14850__000001_SO518BU,,,
Mark Freeman Opticians,SO51 8NB__000003_SO518NB,OPT,3 Market Place,,Romsey,Hants,,SO51 8NB,Tel: 01794 513953, - ,,,No ratings yet Rate it yourself - /Services/opticians/LeaveReview/DefaultView.aspx?id=SO51 8NB__000003_SO518NB,0,0,
Onsite Eyecare Ltd,CT005__000001_BH105AS,OPT,20 Barnes Road,,Bournemouth,Dorset,,BH10 5AS,Tel: 01202 511249, - ,,,No ratings yet Rate it yourself - /Services/opticians/LeaveReview/DefaultView.aspx?id=CT005__000001_BH105AS,0,0,
Still & Bedford Ltd,OP_5CE_9449__000001_BH92SG,OPT,,922 Wimborne Road,,Bournemouth,Dorset,BH9 2DH,Tel: 01202 529414, - ,,,No ratings yet Rate it yourself - /Services/opticians/LeaveReview/DefaultView.aspx?id=OP_5CE_9449__000001_BH92SG,0,0,yes
Moordown Eyecare,OP_5CE_13760__000001_BH91BN,OPT,,922 Wimborne Road,Moordown,BOURNEMOUTH,Dorset,BH9 2DH,Tel: 01202 530500, - ,,,1 rating Rate it yourself - /Services/opticians/LeaveReview/DefaultView.aspx?id=OP_5CE_13760__000001_BH91BN,,,
D N White Opticians,OP_5LY_14855__000001_SO518NA,OPT,23 Market Place,,Romsey,Hampshire,,SO51 8NA,Tel: 01794 517311, - ,,,No ratings yet Rate it yourself - /Services/opticians/LeaveReview/DefaultView.aspx?id=OP_5LY_14855__000001_SO518NA,0,0,
Boots Opticians,G7K1V,OPT,,3-5 The Hundred,,Romsey,Hampshire,SO51 8GD,Tel: 01794 513258, - ,,,No ratings yet Rate it yourself - /Services/opticians/LeaveReview/DefaultView.aspx?id=G7K1V,0,0,
Romsey Eyecare,OPT_SO51 8DE,OPT,,"1 Victoria Place, Love Lane",,Romsey,Hampshire,SO51 8DE,Tel: 01794 522747, - ,,,3 ratings Rate it yourself - /Services/opticians/LeaveReview/DefaultView.aspx?id=OPT_SO51 8DE,,,
Boots-Bournemouth - Wallisdown Rd,OP_5CE_13054__000001_BH118PN,OPT,288a Wallisdown Road,Wallisdown,,Bournemouth,Dorset,BH11 8PN,Tel: 01202 515024, - ,,,2 ratings Rate it yourself - /Services/opticians/LeaveReview/DefaultView.aspx?id=OP_5CE_13054__000001_BH118PN,,,
M&S Opticians - Castlepoint,O7K0D,OPT,,"Castlepoint Shopping Centre, Yeomans Way",,Bournemouth,Dorset,BH8 9UL,Tel: 01202 059316, - ,,,3 ratings Rate it yourself - /Services/opticians/LeaveReview/DefaultView.aspx?id=O7K0D,,,
Vision Express UK Ltd,OP_5CD_2784__000001_DT93AX,OPT,57 Cheap Street,,Sherborne,,,DT9 3AX,Tel: 01935 812105, - ,,,No ratings yet Rate it yourself - /Services/opticians/LeaveReview/DefaultView.aspx?id=OP_5CD_2784__000001_DT93AX,0,0,
Scrivens Ltd,OP_5CD_7192__000001_DT93BJ,OPT,44 Cheap Street,,,Sherbourne,Dorset,DT9 3PX,Tel: 01935 812971, - ,,,No ratings yet Rate it yourself - /Services/opticians/LeaveReview/DefaultView.aspx?id=OP_5CD_7192__000001_DT93BJ,0,0,
Matthews Opticians - Sherborne,OP_5CD_2683__000001_DT93NL,OPT,1 Tilton Court,Digby Road,,SHERBORNE,Dorset,DT9 3NL,Tel: 01935 813355, - ,,,No ratings yet Rate it yourself - /Services/opticians/LeaveReview/DefaultView.aspx?id=OP_5CD_2683__000001_DT93NL,0,0,
Asda Stores Ltd.,OP_5CE_14967__000002_BH89UP,OPT,Castlepoint Centre,Castle Lane West,,Bournemouth,,BH8 9UP,Tel: 01202 844412, - ,,,No ratings yet Rate it yourself - /Services/opticians/LeaveReview/DefaultView.aspx?id=OP_5CE_14967__000002_BH89UP,0,0,
Nicholson Eyecare,OP_5A1_14084__000001_BH238NJ,OPT,1 Runnymeade,Ringwood Road,Bransgore,,,BH23 8NJ,Tel: 01425 673343, - ,,,No ratings yet Rate it yourself - /Services/opticians/LeaveReview/DefaultView.aspx?id=OP_5A1_14084__000001_BH238NJ,0,0,
Lovat Short Optometrists,OP_5FL_14817__000002_BA33PL,OPT,2 The Street,Radstock,,Bath,,BA3 3PL,Tel: 01761 432169, - ,,,No ratings yet Rate it yourself - /Services/opticians/LeaveReview/DefaultView.aspx?id=OP_5FL_14817__000002_BA33PL,0,0,
Spesavers - Sainsburys,,OPT,,Alder Park,4 Alder Road,Poole,Dorset,BH12 4BA,Tel: 01202403273, - ,,,N/A - Data not available,,,
Specsavers Optician,01-25615,OPT,,411 Wimborne Road,,Dorset,,BH9 2AJ,Tel: 01202 635890, - ,,,No ratings yet Rate it yourself - /Services/opticians/LeaveReview/DefaultView.aspx?id=01-25615,0,0,
Scrivens Ltd,OP_5CE_1815__000001_BH92EN,OPT,,373 Wimborne Road,,Winton,Dorset,BH9 2AQ,Tel: 01202 529700, - ,,,No ratings yet Rate it yourself - /Services/opticians/LeaveReview/DefaultView.aspx?id=OP_5CE_1815__000001_BH92EN,0,0,
Kelly Eyecare Ltd,CO-2697__000002_BH92AQ,OPT,369 Wimborne Road,Winton,,BOURNEMOUTH,Dorset,BH9 2AQ,Tel: 01202 510102, - ,,,No ratings yet Rate it yourself - /Services/opticians/LeaveReview/DefaultView.aspx?id=CO-2697__000002_BH92AQ,0,0,
Home Care Community Opticians (J2NA Ltd),00281__000002_DT93RQ,OPT,Old Yarn Business Centre,Westbury,Sherborne,Dorset,,DT9 3RQ,Tel: 01935 813800, - ,,,No ratings yet Rate it yourself - /Services/opticians/LeaveReview/DefaultView.aspx?id=00281__000002_DT93RQ,0,0,
Carol Underwood,PCTCAROLUNDERWOOD1__000001_SP103DG,OPT,King George Road,,andover,Hants,,SP10 3DG,Tel: 0845 602 3842, - ,,,No ratings yet Rate it yourself - /Services/opticians/LeaveReview/DefaultView.aspx?id=PCTCAROLUNDERWOOD1__000001_SP103DG,0,0,
Boots-Bournemouth - Winton Rd,CO-3459__000001_BH92HH,OPT,,355A Wimborne Road,Winton,BOURNEMOUTH,Dorset,BH9 2AD,Tel: 01202 516924, - ,,,2 ratings Rate it yourself - /Services/opticians/LeaveReview/DefaultView.aspx?id=CO-3459__000001_BH92HH,,,
Mobile-Eyes-UK Ltd,CO-3448__000001_BH89NL,OPT,28 Feversham Heights,Feversham Avenue,Bournemouth,Dorset,,BH8 9NL,Tel: 01202 770400, - ,,,No ratings yet Rate it yourself - /Services/opticians/LeaveReview/DefaultView.aspx?id=CO-3448__000001_BH89NL,0,0,
Parkstone Eyecare,OP_5KV_5415__000001_BH140AA,OPT,434 Ashley Road,Parkstone,,POOLE,Dorset,BH14 0AA,Tel: 01202 741963, - ,,,1 rating Rate it yourself - /Services/opticians/LeaveReview/DefaultView.aspx?id=OP_5KV_5415__000001_BH140AA,,,