Organisation Name,NACS Code,Organisation Type,Address1,Address2,Address3,Address4,Address5,PostCode,Telephone Number,Opening time,Value  (Opening time),Banding Classification  (Opening time),NHS.UK users rating,Value  (NHS.UK users rating),Banding Classification  (NHS.UK users rating),Car parking (Is there car parking at this organisation?)
Midlands Eye Care Ltd,CO/7100/5PK,OPT,,59 New Street,,Burton-on-Trent,,DE14 3QY,Tel: 01283 561320, - ,,,No ratings yet Rate it yourself - /Services/opticians/LeaveReview/DefaultView.aspx?id=CO/7100/5PK,0,0,
Carlton Opticians Burton Upon Trent,TP8WQ,OPT,,First Floor,118 Calais Road,Burton On Trent,,DE13 0UW,Tel: 01283512066, - ,,,1 rating Rate it yourself - /Services/opticians/LeaveReview/DefaultView.aspx?id=TP8WQ,,,
Vision Express (UK) Ltd,OP_5ML_7820__000001_DE141DE,OPT,2 Underhill Walk,Burton On Trent,Staffordshire,,,DE14 1DE,Tel: 01283 511772, - ,,,No ratings yet Rate it yourself - /Services/opticians/LeaveReview/DefaultView.aspx?id=OP_5ML_7820__000001_DE141DE,0,0,
Prince and Bates Opticians,OP_5ML_9729__000001_DE141BH,OPT,193 Station Street,,,Burton On Trent,Staffordshire,DE14 1BH,Tel: 01283 542482, - ,,,1 rating Rate it yourself - /Services/opticians/LeaveReview/DefaultView.aspx?id=OP_5ML_9729__000001_DE141BH,,,
Specsavers Opticians,OP_5ML_2645__000001_DE149JF,OPT,176 High Street,Burton On Trent,Staffordshire,,,DE14 1JF,Tel: 01283 500 117, - ,,,1 rating Rate it yourself - /Services/opticians/LeaveReview/DefaultView.aspx?id=OP_5ML_2645__000001_DE149JF,,,
Boots-Burton on Trent - Burton Place,OP_5ML_13082__000001_DE141BU,OPT,"Unit 8, Burton Place",,,Burton-on-Trent,Staffordshire,DE14 1BU,Tel: 01283 510130, - ,,,No ratings yet Rate it yourself - /Services/opticians/LeaveReview/DefaultView.aspx?id=OP_5ML_13082__000001_DE141BU,0,0,
Lancaster Thorpe,OP_5ML_5577__000001_DE141AN,OPT,198 Station Street,Burton On Trent,Staffordshire,,,DE14 1AN,Tel: 01283 568652, - ,,,No ratings yet Rate it yourself - /Services/opticians/LeaveReview/DefaultView.aspx?id=OP_5ML_5577__000001_DE141AN,0,0,
Tutbury Opticians,OP_5ML_7802__000001_DE139LU,OPT,"Unit 8, Tutbury Mill Mews",6 Lower High Street,Tutbury,Staffs,,DE13 9LU,Tel: 01283 813329, - ,,,No ratings yet Rate it yourself - /Services/opticians/LeaveReview/DefaultView.aspx?id=OP_5ML_7802__000001_DE139LU,0,0,
Hilton Opticians,3963,OPT,Hilton Opticians,Welland Road,,"Hilton, Derby",,DE65 5GZ,Tel: 01283736353, - ,,,No ratings yet Rate it yourself - /Services/opticians/LeaveReview/DefaultView.aspx?id=3963,0,0,yes
Grimley & Glynn Opticians,OP_5H7_2945__000002_DE119DG,OPT,15 West Street,Swadlincote,Derbyshire,,,DE11 9DG,Tel: 01283 222535, - ,,,1 rating Rate it yourself - /Services/opticians/LeaveReview/DefaultView.aspx?id=OP_5H7_2945__000002_DE119DG,,,
Elks Opticians,OP_5H7_13296__000001_DE110AG,OPT,12 Midland Road,Swadlincote,Derbyshire,,,DE11 0AG,Tel: 01283 216284, - ,,,No ratings yet Rate it yourself - /Services/opticians/LeaveReview/DefaultView.aspx?id=OP_5H7_13296__000001_DE110AG,0,0,
Personaleyez Swadlincote ltd,OPL/01-14091/5N7,OPT,,Unit 2a Rinkway Business Park,Rink Drive,Swadlincote,Derbyshire,DE11 8JL,Tel: 01283 226358, - ,,,No ratings yet Rate it yourself - /Services/opticians/LeaveReview/DefaultView.aspx?id=OPL/01-14091/5N7,0,0,yes
Specsavers Opticians,OL1743395N6__000004_DE118HY,OPT,26 High Street,,Swadlincote,Derbyshire,,DE11 8HY,Tel: 01283 552211, - ,,,No ratings yet Rate it yourself - /Services/opticians/LeaveReview/DefaultView.aspx?id=OL1743395N6__000004_DE118HY,0,0,
Scrivens Opticians & Hearing Care,OP_5H7_7184__000001_DE118HY,OPT,,18 High Street,,Swadlincote,Derbyshire,DE11 8HY,Tel: 01283 217262, - ,,,No ratings yet Rate it yourself - /Services/opticians/LeaveReview/DefaultView.aspx?id=OP_5H7_7184__000001_DE118HY,0,0,no
Prince & Bates Opticians,OP_5H7_2251__000002_DE118HY,OPT,16 High Street,Swadlincote,Derbyshire,,,DE11 8HY,Tel: 01283 216602, - ,,,No ratings yet Rate it yourself - /Services/opticians/LeaveReview/DefaultView.aspx?id=OP_5H7_2251__000002_DE118HY,0,0,
Tesco Opticians (Lichfield),OPL/5900/5PK__000003_WS136DZ,OPT,,Church Street,Lichfield,Staffordshire,,WS13 6DZ,Tel: 0845 601 3479, - ,,,No ratings yet Rate it yourself - /Services/opticians/LeaveReview/DefaultView.aspx?id=OPL/5900/5PK__000003_WS136DZ,0,0,
Boots-Lichfield,OP_5DQ_332__000001_WS136NF,OPT,2 Bakers Lane,,,Lichfield,Staffordshire,WS13 6NF,Tel: 01543 252086, - ,,,No ratings yet Rate it yourself - /Services/opticians/LeaveReview/DefaultView.aspx?id=OP_5DQ_332__000001_WS136NF,0,0,
Colin Lee Opticians (Lichfield),OP_5DQ_14951__000002_WS136LA,OPT,33 Market Street,Lichfield,Staffordshire,,,WS13 6LA,Tel: 01543 254645, - ,,,No ratings yet Rate it yourself - /Services/opticians/LeaveReview/DefaultView.aspx?id=OP_5DQ_14951__000002_WS136LA,0,0,
Specsavers Opticians,OP_5DQ_357__000001_WS136LA,OPT,Specsavers Opticians,41-43 Market Street,,Lichfield,Staffordshire,WS13 6LA,Tel: 01543 417517, - ,,,No ratings yet Rate it yourself - /Services/opticians/LeaveReview/DefaultView.aspx?id=OP_5DQ_357__000001_WS136LA,0,0,
Vision Express (UK) Ltd,OP_5DQ_4932__000001_WS136NN,OPT,"Unit 35, Bakers Lane",Three Spires Shopping Centre,12 Gresley Row,Lichfield,Staffordshire,WS13 6NN,Tel: 01543 417272, - ,,,No ratings yet Rate it yourself - /Services/opticians/LeaveReview/DefaultView.aspx?id=OP_5DQ_4932__000001_WS136NN,0,0,
D G Arthur & Partner,OP_5DQ_14953__000001_WS136JX,OPT,9 Market Street,Lichfield,Staffordshire,,,WS13 6JX,Tel: 01543 251130, - ,,,No ratings yet Rate it yourself - /Services/opticians/LeaveReview/DefaultView.aspx?id=OP_5DQ_14953__000001_WS136JX,0,0,
Vision Express,5PK_004__000002_ST148HY,OPT,,15 Market Place,,Uttoxeter,Staffordshire,ST14 8HY,Tel: 01889 567474, - ,,,No ratings yet Rate it yourself - /Services/opticians/LeaveReview/DefaultView.aspx?id=5PK_004__000002_ST148HY,0,0,
McCracken Opticians,OP_5ML_14383__000001_ST148HY,OPT,Northgate House,Church Street,Uttoxeter,Staffordshire,,ST14 8AG,Tel: 01889 562184, - ,,,No ratings yet Rate it yourself - /Services/opticians/LeaveReview/DefaultView.aspx?id=OP_5ML_14383__000001_ST148HY,0,0,
Specsavers Opticians,ST7783__000002_ST147HN,OPT,3 High Street,,Uttoxeter,Staffordshire,,ST14 7HN,Tel: 01889 561770, - ,,,No ratings yet Rate it yourself - /Services/opticians/LeaveReview/DefaultView.aspx?id=ST7783__000002_ST147HN,0,0,
Colin Lee Opticians (Rugeley),OP_5DQ_14952__000002_WS152DA,OPT,1 Shrewsbury Mall,Market Square,Rugeley,,,WS15 2DA,Tel: 01889 570544, - ,,,3 ratings Rate it yourself - /Services/opticians/LeaveReview/DefaultView.aspx?id=OP_5DQ_14952__000002_WS152DA,,,
John Fell Opticians Ltd,5N7_DE235GB__000001_DE235GB,OPT,"8 The Parade, Uttoxeter Road",Mickleover,Derby,Derbyshire,,DE3 0GB,Tel: 01332 517388, - ,,,1 rating Rate it yourself - /Services/opticians/LeaveReview/DefaultView.aspx?id=5N7_DE235GB__000001_DE235GB,,,
"Specsavers Opticians, Rugeley",CO-3227/5PK/C__000003_WS152DP,OPT,5 Upper Brook Street,,Rugeley,Staffordshire,,WS15 2DP,Tel: 01889 576060, - ,,,No ratings yet Rate it yourself - /Services/opticians/LeaveReview/DefaultView.aspx?id=CO-3227/5PK/C__000003_WS152DP,0,0,
Boots-Rugeley,OL/01-014482/5PK__000001_WS152DR,OPT,2 Brook Square,,,Rugeley,Staffordshire,WS15 2DR,Tel: 01889 579000, - ,,,1 rating Rate it yourself - /Services/opticians/LeaveReview/DefaultView.aspx?id=OL/01-014482/5PK__000001_WS152DR,,,
Scrivens Opticians & Hearing Care,OP_5MM_438__000001_WS152DN,OPT,16a Upper Brook Street,16a Upper Brook Street,Staffordshire,Rugeley,,WS15 2DN,Tel: 01889 575257, - ,,,No ratings yet Rate it yourself - /Services/opticians/LeaveReview/DefaultView.aspx?id=OP_5MM_438__000001_WS152DN,0,0,
Specsavers Opticians,LE65 5PA__000002_LE651AF,OPT,31 Market Street,,Ashby De La Zouch,Leics,,LE65 1AF,Tel: 01530 410790, - ,,,No ratings yet Rate it yourself - /Services/opticians/LeaveReview/DefaultView.aspx?id=LE65 5PA__000002_LE651AF,0,0,
Nicola Peapers Ltd,OP_5JC_4674__000001_LE651AF,OPT,29 Market Street,,,Ashby-De-La-Zouch,Leicestershire,LE65 1AF,Tel: 01530 560852, - ,,,No ratings yet Rate it yourself - /Services/opticians/LeaveReview/DefaultView.aspx?id=OP_5JC_4674__000001_LE651AF,0,0,
Scrivens Opticians Ashby de la Zouch,OP_5JC_3128__000002_LE651AL,OPT,20 Market Street,,Ashby De La Zouch,Leics,,LE65 1AL,Tel: 01530 411464, - ,,,No ratings yet Rate it yourself - /Services/opticians/LeaveReview/DefaultView.aspx?id=OP_5JC_3128__000002_LE651AL,0,0,
F T Wilson ,OL/01-9128/5PA__000002_DE127HZ,OPT,48 High Street,Measham,Swadlincote,Leicestershire County and Rutland PCT,,DE12 7HZ,Tel: 01530 271 817, - ,,,No ratings yet Rate it yourself - /Services/opticians/LeaveReview/DefaultView.aspx?id=OL/01-9128/5PA__000002_DE127HZ,0,0,
Boots-Ashby De La Zouch,OP_5JC_6679__000001_LE651AN,OPT,52 Market Street,,,Ashby-De-La-Zouch,Leicestershire,LE65 1AN,Tel: 01530 417027, - ,,,No ratings yet Rate it yourself - /Services/opticians/LeaveReview/DefaultView.aspx?id=OP_5JC_6679__000001_LE651AN,0,0,
Right Vision Ophthalmic Opticians,01-19976/5PL/C__000002_B694DS,OPT,6 Richardson Way,,Rugeley,Staffordshire,,WS15 2TD,Tel: 07966 960606, - ,,,No ratings yet Rate it yourself - /Services/opticians/LeaveReview/DefaultView.aspx?id=01-19976/5PL/C__000002_B694DS,0,0,
Adams Opticians,OP_5AL_4749__000002_DE243DS,OPT,16b Sinfin District Centre,Sinfin,Derby,Derbyshire,,DE24 3DS,Tel: 01332 272400, - ,,,1 rating Rate it yourself - /Services/opticians/LeaveReview/DefaultView.aspx?id=OP_5AL_4749__000002_DE243DS,,,
C R Beeson,OP_5DQ_1360__000001_WS78XF,OPT,"Longlea, Lichfield Road",Hopwas,Tamworth,,,B78 3AG,Tel: 01827 56541, - ,,,No ratings yet Rate it yourself - /Services/opticians/LeaveReview/DefaultView.aspx?id=OP_5DQ_1360__000001_WS78XF,0,0,
Colin Beeson Optometrists,OP_5MP_2271__000001_B781HN,OPT,Village Vision,Lichfield Road,Hopwas,Tamworth,,B78 3AG,Tel: 01827 311517, - ,,,1 rating Rate it yourself - /Services/opticians/LeaveReview/DefaultView.aspx?id=OP_5MP_2271__000001_B781HN,,,
Zeidan Eye Care Centre,OP_5DQ_14956__000001_B787AB,OPT,1a Silver Street,Tamworth,Staffordshire,,,B79 7NH,Tel: 01827 54411, - ,,,No ratings yet Rate it yourself - /Services/opticians/LeaveReview/DefaultView.aspx?id=OP_5DQ_14956__000001_B787AB,0,0,
Portland Opticians,OP_5DQ_6416__000001_B797DE,OPT,1 Middle Entry,Tamworth,Staffordshire,Tamworth,,B79 7NJ,Tel: 01827 61600, - ,,,No ratings yet Rate it yourself - /Services/opticians/LeaveReview/DefaultView.aspx?id=OP_5DQ_6416__000001_B797DE,0,0,
Jenks Opticians,OP_5DQ_14705__000001_B797LJ,OPT,31 George Street,Tamworth,Staffordshire,,,B79 7LJ,Tel: 01827 62792, - ,,,1 rating Rate it yourself - /Services/opticians/LeaveReview/DefaultView.aspx?id=OP_5DQ_14705__000001_B797LJ,,,
Philip Howard Opticans,OP_5DQ_879__000001_B797LR,OPT,23 Market Street,Tamworth,Staffordshire,,,B79 7LR,Tel: 01827 59863, - ,,,1 rating Rate it yourself - /Services/opticians/LeaveReview/DefaultView.aspx?id=OP_5DQ_879__000001_B797LR,,,
Eye Society Corporation Ltd,7801A__000006_B797LQ,OPT,44 Ankerside Shopping Centre,George Street,Tamworth,Staffordshire,,B79 7LQ,Tel: 01827 52526, - ,,,1 rating Rate it yourself - /Services/opticians/LeaveReview/DefaultView.aspx?id=7801A__000006_B797LQ,,,
Specsavers Opticians,OP_5DQ_14954__000001_B783HD,OPT,Unit 19,The Ankerside Centre,George Street,Tamworth,,B79 7LG,Tel: 01827 60622, - ,,,No ratings yet Rate it yourself - /Services/opticians/LeaveReview/DefaultView.aspx?id=OP_5DQ_14954__000001_B783HD,0,0,
Boots-Tamworth - Ankerside Centre,OP_5DQ_6619__000002_B797LG,OPT,9 Ankerside Shopping Centre,,,Tamworth,Staffordshire,B79 7LG,Tel: 01827 62923, - ,,,No ratings yet Rate it yourself - /Services/opticians/LeaveReview/DefaultView.aspx?id=OP_5DQ_6619__000002_B797LG,0,0,
Vision Express,OP_5DQ_14955__000003_B797LG,OPT,45 Ankerside Shopping Centre,George Street,Tamworth,,,B79 7LG,Tel: 01827 316 300, - ,,,No ratings yet Rate it yourself - /Services/opticians/LeaveReview/DefaultView.aspx?id=OP_5DQ_14955__000003_B797LG,0,0,
Richard Petrie Optometrist,OP_5EX_5001__000002_DE236DF,OPT,564 Burton Road,Littleover,Derby,,,DE23 6DF,Tel: 01332 291010, - ,,,1 rating Rate it yourself - /Services/opticians/LeaveReview/DefaultView.aspx?id=OP_5EX_5001__000002_DE236DF,,,
Asda Opticians,7784/CO-2058__000002_B783HD,OPT,Ventura Road,Tamworth,,Staffordshire,,B78 3HD,Tel: 01827 302212, - ,,,No ratings yet Rate it yourself - /Services/opticians/LeaveReview/DefaultView.aspx?id=7784/CO-2058__000002_B783HD,0,0,
Boots-Tamworth - Ventura Park,OP_5DQ_7038__000001_B797LG,OPT,Ventura Retail Park,,,Tamworth,Staffordshire,B78 3JD,Tel: 01827 56241, - ,,,2 ratings Rate it yourself - /Services/opticians/LeaveReview/DefaultView.aspx?id=OP_5DQ_7038__000001_B797LG,,,
Lomas Opticians,OP_5H7_4703__000001_DE731EH,OPT,1 Chapel Street,Melbourne,,Derbyshire,,DE73 8EH,Tel: 01332 865021, - ,,,No ratings yet Rate it yourself - /Services/opticians/LeaveReview/DefaultView.aspx?id=OP_5H7_4703__000001_DE731EH,0,0,
Lomas Opticians,104325PA__000001_DE738EH,OPT,1 Chapel Street,Melbourne,Derbyshire,Leicestershire County and Rutland PCT,,DE73 8EH,Tel: 01332 865021, - ,,,No ratings yet Rate it yourself - /Services/opticians/LeaveReview/DefaultView.aspx?id=104325PA__000001_DE738EH,0,0,
Specsavers Opticians,21975__000002_DE237JA,OPT,10-12 Stenson Road,Normanton,Derby,Derbyshire,,DE23 1JA,Tel: 01332 771555, - ,,,No ratings yet Rate it yourself - /Services/opticians/LeaveReview/DefaultView.aspx?id=21975__000002_DE237JA,0,0,
Colin Lee Opticians,7790_7791__000001_WS70DW,OPT,2 Swan Island Shopping Precinct,Chase Road,Burntwood,Staffordshire,,WS7 0DW,, - ,,,No ratings yet Rate it yourself - /Services/opticians/LeaveReview/DefaultView.aspx?id=7790_7791__000001_WS70DW,0,0,
Chellaston Opticians,13690__000001_DE735AS,OPT,17 Derby Road,Chellaston,Derby,,,DE73 5AS,, - ,,,1 rating Rate it yourself - /Services/opticians/LeaveReview/DefaultView.aspx?id=13690__000001_DE735AS,,,
Ultimate Spex,OP_5AL_13292__000001_DE236UT,OPT,281 Normanton Road,,Derby,,,DE23 6UU,Tel: 01332 294599, - ,,,2 ratings Rate it yourself - /Services/opticians/LeaveReview/DefaultView.aspx?id=OP_5AL_13292__000001_DE236UT,,,
David Stidwill Optometrist,OP_5DQ_9442__000001_WS78AG,OPT,31 Rugeley Road,Chase Terrace,Burntwood,,,WS7 8AG,Tel: 01543 682730, - ,,,No ratings yet Rate it yourself - /Services/opticians/LeaveReview/DefaultView.aspx?id=OP_5DQ_9442__000001_WS78AG,0,0,
MW Phillips Opticians,TP95F,OPT,,30 Ellerbeck,Wilnecote,"Stonydelph, Tamworth",Staffordshire,B77 4JA,Tel: 01827 795 161, - ,,,No ratings yet Rate it yourself - /Services/opticians/LeaveReview/DefaultView.aspx?id=TP95F,0,0,
MW Phillips Opticians,TP95F,OPT,MW Phillips Opticians,29 Ellerbeck,,"Stoneydelph, Tamworth",Staffordshire,B77 4JA,Tel: 01827 896464, - ,,,No ratings yet Rate it yourself - /Services/opticians/LeaveReview/DefaultView.aspx?id=TP95F,0,0,yes
Simply Specs,OP_5AL_1484__000001_DE249BR,OPT,851 Osmaston Road,Allenton,Derby,,,DE24 9BR,Tel: 01332 362365, - ,,,No ratings yet Rate it yourself - /Services/opticians/LeaveReview/DefaultView.aspx?id=OP_5AL_1484__000001_DE249BR,0,0,
Boots-Chase Terrace - Burntwood,OP_5DQ_14949__000002_WS78JR,OPT,Unit 14,Burntwood Town Centre,,Cannock Road,,WS7 1JR,Tel: 01543 686 498, - ,,,No ratings yet Rate it yourself - /Services/opticians/LeaveReview/DefaultView.aspx?id=OP_5DQ_14949__000002_WS78JR,0,0,
Burrows & Wozencroft Opticians,OP_5AL_5887__000001_DE236US,OPT,191 Normanton Road,,,Derby,,DE23 6US,Tel: 01332 345034, - ,,,No ratings yet Rate it yourself - /Services/opticians/LeaveReview/DefaultView.aspx?id=OP_5AL_5887__000001_DE236US,0,0,
A B Optics Ltd,OP_5MP_8951__000001_B781DR,OPT,25 Bridge Street,Polesworth,Tamworth,,,B78 1DR,Tel: 01827 897656, - ,,,2 ratings Rate it yourself - /Services/opticians/LeaveReview/DefaultView.aspx?id=OP_5MP_8951__000001_B781DR,,,
Vision Express UK Ltd,OP_5AL_1100__000003_DE12AZ,OPT,Unit 111 Level 1,"North Mall, Westfield Centre",Derby,Derbyshire,,DE1 1PG,Tel: 01332 295411, - ,,,No ratings yet Rate it yourself - /Services/opticians/LeaveReview/DefaultView.aspx?id=OP_5AL_1100__000003_DE12AZ,0,0,
Specs Opticians,OP_5AL_13293__000001_DE12RD,OPT,106 Osmaston Road,,Derby,,,DE1 2RD,Tel: 01332 385287, - ,,,No ratings yet Rate it yourself - /Services/opticians/LeaveReview/DefaultView.aspx?id=OP_5AL_13293__000001_DE12RD,0,0,
Wozencroft & Co,OP_5AL_10290__000001_DE12JH,OPT,59 Osmaston Road,,Derby,,,DE1 2JH,Tel: 01332 348063, - ,,,No ratings yet Rate it yourself - /Services/opticians/LeaveReview/DefaultView.aspx?id=OP_5AL_10290__000001_DE12JH,0,0,
Lancaster & Thorpe Ltd,OP_5AL_574__000001_DE11SR,OPT,100 St. Peters Street,,,Derby,Derbyshire,DE1 1SR,Tel: 01332 348271, - ,,,No ratings yet Rate it yourself - /Services/opticians/LeaveReview/DefaultView.aspx?id=OP_5AL_574__000001_DE11SR,0,0,no
Optical Express,OP_5AL_3683__000001_DE12NR,OPT,4 St. Peters Way,,,Derby,Derbyshire,DE1 2NR,Tel: 0800 023 2020, - ,,,2 ratings Rate it yourself - /Services/opticians/LeaveReview/DefaultView.aspx?id=OP_5AL_3683__000001_DE12NR,,,
The Eye Gallery,OP_5AL_13291__000002_DE13NR,OPT,31 Sadler Gate,Derby,,,,DE1 3NR,Tel: 01332 332759, - ,,,No ratings yet Rate it yourself - /Services/opticians/LeaveReview/DefaultView.aspx?id=OP_5AL_13291__000002_DE13NR,0,0,
Optique Vision Ltd,OL/CO/3453/5N7__000001_DE12PQ,OPT,Unit 157 Intu Centre,Unit 157 Level 1,Intu Centre,Derby,Derbyshire,DE1 2PL,Tel: 01332 208880, - ,,,No ratings yet Rate it yourself - /Services/opticians/LeaveReview/DefaultView.aspx?id=OL/CO/3453/5N7__000001_DE12PQ,0,0,yes
Specsavers Opticians,OP_5AL_52__000001_DE12AZ,OPT,22 Crown Walk,Eagle Centre,Derby,,,DE1 2NP,Tel: 01332 294939, - ,,,No ratings yet Rate it yourself - /Services/opticians/LeaveReview/DefaultView.aspx?id=OP_5AL_52__000001_DE12AZ,0,0,
Boots-Derby - Devonshire Walk (in Boots UK),OP_5AL_2840__000002_DE12AH,OPT,1 Devonshire Walk,,,Derby,Derbyshire,DE1 2AH,Tel: 01332 384701, - ,,,No ratings yet Rate it yourself - /Services/opticians/LeaveReview/DefaultView.aspx?id=OP_5AL_2840__000002_DE12AH,0,0,
Lancaster & Thorpe Ltd,OP_5AL_2249__000001_DE13NQ,OPT,14 Sadler Gate,,,Derby,Derbyshire,DE1 3NF,Tel: 01332 341186, - ,,,No ratings yet Rate it yourself - /Services/opticians/LeaveReview/DefaultView.aspx?id=OP_5AL_2249__000001_DE13NQ,0,0,no
Specs 4U Opticians,DE12NQ__000001_DE12NQ,OPT,Su 109-Level 1-North Mall,Westfield Centre,Derby,Derbyshire,,DE1 2NQ,Tel: 01332 348990, - ,,,No ratings yet Rate it yourself - /Services/opticians/LeaveReview/DefaultView.aspx?id=DE12NQ__000001_DE12NQ,0,0,
Specs 4 U Opticians,SPECS__000001_DE12NG,OPT,19 Theatre Walk,Westfield Centre,Derby,Derbyshire,,DE1 2NG,Tel: 01332 348990, - ,,,No ratings yet Rate it yourself - /Services/opticians/LeaveReview/DefaultView.aspx?id=SPECS__000001_DE12NG,0,0,
See to it Opticians Ltd,S7T7F,OPT,,21 Ruston Road,,Burntwood,,WS7 3RU,, - ,,,No ratings yet Rate it yourself - /Services/opticians/LeaveReview/DefaultView.aspx?id=S7T7F,0,0,
Alvaston Opticians,OP_5AL_8422__000001_DE28QP,OPT,1260 London Road,Alvaston,,Derby,,DE24 8QP,Tel: 01332 571642, - ,,,No ratings yet Rate it yourself - /Services/opticians/LeaveReview/DefaultView.aspx?id=OP_5AL_8422__000001_DE28QP,0,0,yes
Philip Bradley Opticians,OP_5EX_3278__000002_DE222QN,OPT,Park Farm Centre,Allestree,Derby,,,DE22 2QN,Tel: 01332 550674, - ,,,1 rating Rate it yourself - /Services/opticians/LeaveReview/DefaultView.aspx?id=OP_5EX_3278__000002_DE222QN,,,
Allestree Eyecare,OP_5EX_4179__000001_DE222QQ,OPT,29 Park Farm Centre,Allestree,Derby,,,DE22 2QN,Tel: 01332 554797, - ,,,No ratings yet Rate it yourself - /Services/opticians/LeaveReview/DefaultView.aspx?id=OP_5EX_4179__000001_DE222QQ,0,0,
Heather Bailey,OP_5MM_8119__000003_WS125AG,OPT,T/a Boots Optician,88 Market Street,,Cannock,,WS12 5AG,Tel: 01543 422113, - ,,,No ratings yet Rate it yourself - /Services/opticians/LeaveReview/DefaultView.aspx?id=OP_5MM_8119__000003_WS125AG,0,0,
Boots Opticians,OP_5DQ_14950__000004_WS125AG,OPT,88 Market Street,Hednesford,,Staffordshire,,WS12 1AG,Tel: 01543 422113, - ,,,No ratings yet Rate it yourself - /Services/opticians/LeaveReview/DefaultView.aspx?id=OP_5DQ_14950__000004_WS125AG,0,0,
Bains Optical Healthcare,TP5KL,OPT,,160-162 Hednesford Road,,"Heath Hayes, Cannock",,WS12 3DZ,Tel: 01543 270080, - ,,,18 ratings Rate it yourself - /Services/opticians/LeaveReview/DefaultView.aspx?id=TP5KL,,,
Costco Derby,OP_DE216RS_46388,OPT,Costco,Wyvernside,Wyvern Way,Derby,,DE21 6RS,Tel: 01332 680815, - ,,,No ratings yet Rate it yourself - /Services/opticians/LeaveReview/DefaultView.aspx?id=OP_DE216RS_46388,0,0,
The Eye Gallery,DE222GP__000003_DE222GP,OPT,6 Blenheim Parade,Allestree,Derby,Derbyshire,,DE22 2GP,Tel: 01332 551010, - ,,,No ratings yet Rate it yourself - /Services/opticians/LeaveReview/DefaultView.aspx?id=DE222GP__000003_DE222GP,0,0,
Specsavers Opticians,OP_WS86EQ_29574,OPT,,"Unit 1, 12 - 28 High Street",,Brownhills,,WS8 6EQ,Tel: 01543 363790, - ,,,No ratings yet Rate it yourself - /Services/opticians/LeaveReview/DefaultView.aspx?id=OP_WS86EQ_29574,0,0,
Boots-Brownhills,OP_5M3_6340__000001_WS86EL,OPT,42 High Street,Brownhills,,Walsall,West Midlands,WS8 6EL,Tel: 01543 372 696, - ,,,No ratings yet Rate it yourself - /Services/opticians/LeaveReview/DefaultView.aspx?id=OP_5M3_6340__000001_WS86EL,0,0,
Frames 4 U,OP_5M3_12441__000001_WS86HH,OPT,50 High Street,Brownhills,,Walsall,,WS8 6EL,Tel: 01543 373731, - ,,,1 rating Rate it yourself - /Services/opticians/LeaveReview/DefaultView.aspx?id=OP_5M3_12441__000001_WS86HH,,,
Silver Court Opticians,OP_5M3_2035__000001_WS86ED,OPT,High Street,Brownhills,,Walsall,,WS8 6HA,Tel: 01543 372504, - ,,,No ratings yet Rate it yourself - /Services/opticians/LeaveReview/DefaultView.aspx?id=OP_5M3_2035__000001_WS86ED,0,0,
Lancaster & Thorpe,OP_5EX_2164__000002_DE216NA,OPT,495 Nottingham Road,Chaddesden,,Derby,Derbyshire,DE21 6NA,Tel: 01332 666806, - ,,,No ratings yet Rate it yourself - /Services/opticians/LeaveReview/DefaultView.aspx?id=OP_5EX_2164__000002_DE216NA,0,0,yes
Mimi Yip Ltd,5JC_16160__000002_LE673LT,OPT,10 Jackson Street,,Coalville,Leicestershire,,LE67 3LT,Tel: 01530 832894, - ,,,No ratings yet Rate it yourself - /Services/opticians/LeaveReview/DefaultView.aspx?id=5JC_16160__000002_LE673LT,0,0,
Asda Stores Ltd,OP_5EX_14058__000001_DE27UY,OPT,Derby Road,Spondon,,Derby,,DE21 7LW,Tel: 01332 826712, - ,,,1 rating Rate it yourself - /Services/opticians/LeaveReview/DefaultView.aspx?id=OP_5EX_14058__000001_DE27UY,,,
Eye Society ,OL/01-15842/5PA__000002_LE673PD,OPT,43 Belvoir Road,,Coalville,Leicestershire County and Rutland PCT,,LE67 3PD,Tel: 01530 814 048, - ,,,No ratings yet Rate it yourself - /Services/opticians/LeaveReview/DefaultView.aspx?id=OL/01-15842/5PA__000002_LE673PD,0,0,
Boots-Coalville,OP_5JC_6618__000001_LE673XA,OPT,26 New Broadway,,,Coalville,Leicestershire,LE67 3XA,Tel: 01530 832018, - ,,,No ratings yet Rate it yourself - /Services/opticians/LeaveReview/DefaultView.aspx?id=OP_5JC_6618__000001_LE673XA,0,0,
Specsavers Coalville,OP_5JC_5105__000001_LE673PD,OPT,29 Belvoir Shopping Centre,,Coalville,Leicestershire,,LE67 3XF,Tel: 01530 817178, - ,,,4 ratings Rate it yourself - /Services/opticians/LeaveReview/DefaultView.aspx?id=OP_5JC_5105__000001_LE673PD,,,
Halls Optometrists,OP_5JC_1458__000001_LE673JA,OPT,76 London Road,,Coalville,Leicestershire,,LE67 3JA,Tel: 01530 834320, - ,,,1 rating Rate it yourself - /Services/opticians/LeaveReview/DefaultView.aspx?id=OP_5JC_1458__000001_LE673JA,,,
Mark Davis Optician,OP_5JC_4854__000001_LE675ET,OPT,6 Silver Street,,Whitwick,Leicestershire,,LE67 5ET,Tel: 01530 832769, - ,,,No ratings yet Rate it yourself - /Services/opticians/LeaveReview/DefaultView.aspx?id=OP_5JC_4854__000001_LE675ET,0,0,
Malcom Gray & Associates,5PG122,OPT,,336 Lichfield Road,,Sutton Coldfield,,B74 4BH,Tel: 0121 308 4255, - ,,,No ratings yet Rate it yourself - /Services/opticians/LeaveReview/DefaultView.aspx?id=5PG122,0,0,