Organisation Name,NACS Code,Organisation Type,Address1,Address2,Address3,Address4,Address5,PostCode,Telephone Number,Opening time,Value  (Opening time),Banding Classification  (Opening time),NHS.UK users rating,Value  (NHS.UK users rating),Banding Classification  (NHS.UK users rating),Car parking (Is there car parking at this organisation?)
Haine & Smith Opticians,OP_5DY_13238__000001_SN77HH,OPT,,7 Cornmarket,,Faringdon,,SN7 7HH,Tel: 01367 242262, - ,,,No ratings yet Rate it yourself - /Services/opticians/LeaveReview/DefaultView.aspx?id=OP_5DY_13238__000001_SN77HH,0,0,
Carterton Opticians,CARTERTONOPTICIANS1,OPT,,"Unit D6, The Giles Centre",,Carterton,,OX18 3DH,Tel: 01993 841268, - ,,,No ratings yet Rate it yourself - /Services/opticians/LeaveReview/DefaultView.aspx?id=CARTERTONOPTICIANS1,0,0,yes
Michael Lowe & Partners,OP_5DY_2881__000002_OX183XZ,OPT,5 Streatfield House,Alvescot Road,,Carterton,,OX18 3XZ,Tel: 01993 844291, - ,,,No ratings yet Rate it yourself - /Services/opticians/LeaveReview/DefaultView.aspx?id=OP_5DY_2881__000002_OX183XZ,0,0,
Cotswold Opticians,OP_5DY_10797__000001_OX86AG,OPT,43 Market Square,,Witney,,,OX28 6AG,Tel: 01993 773535, - ,,,No ratings yet Rate it yourself - /Services/opticians/LeaveReview/DefaultView.aspx?id=OP_5DY_10797__000001_OX86AG,0,0,
Vision Express Witney,T0M9W,OPT,,24 Woolgate Shopping Centre,Market Square,Witney,Oxfordshire,OX28 6AP,Tel: 01993849700, - ,,,No ratings yet Rate it yourself - /Services/opticians/LeaveReview/DefaultView.aspx?id=T0M9W,0,0,
Specsavers Opticians,OP_5DY_7975__000001_OX86AP,OPT,,18a Woolgate Centre,,Witney,Oxfordshire,OX28 6AP,Tel: 01993 779977, - ,,,No ratings yet Rate it yourself - /Services/opticians/LeaveReview/DefaultView.aspx?id=OP_5DY_7975__000001_OX86AP,0,0,
Boots-Witney,OP_5DY_11544__000001_OX286HW,OPT,,5 High Street,,Witney,Oxfordshire,OX28 6HW,Tel: 01993 778237, - ,,,No ratings yet Rate it yourself - /Services/opticians/LeaveReview/DefaultView.aspx?id=OP_5DY_11544__000001_OX286HW,0,0,
Scrivens ,OP_5DY_11106__000002_OX86HB,OPT,,16a High Street,,Witney,Oxfordshire,OX28 6HB,Tel: 01993 702543, - ,,,No ratings yet Rate it yourself - /Services/opticians/LeaveReview/DefaultView.aspx?id=OP_5DY_11106__000002_OX86HB,0,0,
Witney Community Hospital,OP_5DY_3500__000001_OX87JJ,OPT,Welch Way,,,Witney,Oxfordshire,OX28 6JJ,Tel: 01993 209400, - ,,,No ratings yet Rate it yourself - /Services/opticians/LeaveReview/DefaultView.aspx?id=OP_5DY_3500__000001_OX87JJ,0,0,
Optical View Opticians,OPTICALVIEWOPTICIANS1,OPT,,78 High Street,,Witney,Oxfordshire,OX28 6HL,Tel: 01993 771793, - ,,,No ratings yet Rate it yourself - /Services/opticians/LeaveReview/DefaultView.aspx?id=OPTICALVIEWOPTICIANS1,0,0,yes
Watchfield Opticians,TP44Y,OPT,,2 Majors Road,,Swindon,,SN6 8TQ,, - ,,,No ratings yet Rate it yourself - /Services/opticians/LeaveReview/DefaultView.aspx?id=TP44Y,0,0,
Boots-Wantage,BOOTSOPTICIANSWANTAGE1,OPT,Unit 3A Kings Walk,,,Wantage,Oxfordshire,OX12 9AJ,Tel: 01235 768177, - ,,,No ratings yet Rate it yourself - /Services/opticians/LeaveReview/DefaultView.aspx?id=BOOTSOPTICIANSWANTAGE1,0,0,
Specsavers Opticians,TP2HJ,OPT,,1A Grove Street,,Wantage,Oxfordshire,OX12 7AB,Tel: 01235 773980, - ,,,No ratings yet Rate it yourself - /Services/opticians/LeaveReview/DefaultView.aspx?id=TP2HJ,0,0,
Campbells Opticians,OP_5DY_2985__000002_OX128BU,OPT,,34 Market Place,,Wantage,Oxfordshire,OX12 8AH,Tel: 01235 763312, - ,,,No ratings yet Rate it yourself - /Services/opticians/LeaveReview/DefaultView.aspx?id=OP_5DY_2985__000002_OX128BU,0,0,
Vision Express,TESCOABINGDON1,OPT,Tesco Express,Marcham Road,,Abingdon,Oxfordshire,OX14 1TU,Tel: 0121 519 1181, - ,,,No ratings yet Rate it yourself - /Services/opticians/LeaveReview/DefaultView.aspx?id=TESCOABINGDON1,0,0,
Haine & Smith Opticians,OP_5K3_3933__000002_SN67AG,OPT,22 High Street,Highworth,,Wiltshire,,SN6 7AG,Tel: 01793 762204, - ,,,No ratings yet Rate it yourself - /Services/opticians/LeaveReview/DefaultView.aspx?id=OP_5K3_3933__000002_SN67AG,0,0,
David Spicer Opticians,OP_5DW_8831__000001_OX29LG,OPT,1 Elms Parade,Botley,,Oxford,Oxfordshire,OX2 9LG,Tel: 01865 241142, - ,,,No ratings yet Rate it yourself - /Services/opticians/LeaveReview/DefaultView.aspx?id=OP_5DW_8831__000001_OX29LG,0,0,
Ideal Eyes,OP_5DW_12641__000001_OP_5DW_12641,OPT,76 West Way,Botley,,Oxford,,OX2 9JT,Tel: 01865 244699, - ,,,No ratings yet Rate it yourself - /Services/opticians/LeaveReview/DefaultView.aspx?id=OP_5DW_12641__000001_OP_5DW_12641,0,0,
Specsavers Opticians,OP_5DY_11818__000001_OX141JZ,OPT,Unit 16,Abbey Shopping Centre,,Abingdon,,OX14 3QT,Tel: 01235 530530, - ,,,No ratings yet Rate it yourself - /Services/opticians/LeaveReview/DefaultView.aspx?id=OP_5DY_11818__000001_OX141JZ,0,0,
Boots Opticians,TP4MA,OPT,,Unit 10,Abbey Shopping Centre,Abingdon,Oxfordshire,OX14 3QX,Tel: 01235 520809, - ,,,No ratings yet Rate it yourself - /Services/opticians/LeaveReview/DefaultView.aspx?id=TP4MA,0,0,
Paul Conway,OP_5DY_1044__000001_OX145BB,OPT,,21 High Street,,Abingdon,Oxfordshire,OX14 5BB,Tel: 01235 528032, - ,,,No ratings yet Rate it yourself - /Services/opticians/LeaveReview/DefaultView.aspx?id=OP_5DY_1044__000001_OX145BB,0,0,
Abingdon Eye Centre,ABINGDONEYECENTRE1,OPT,,"Unit 3, Bury Street Shopping Centre",,Abingdon,Oxfordshire,OX14 3QY,Tel: 01235 533328, - ,,,No ratings yet Rate it yourself - /Services/opticians/LeaveReview/DefaultView.aspx?id=ABINGDONEYECENTRE1,0,0,
Scrivens inc. Russell Caulton,OP_5DY_5772__000002_OX143HA,OPT,,6 Bury Street,,Abingdon,Oxfordshire,OX14 3QY,Tel: 01235 523217, - ,,,No ratings yet Rate it yourself - /Services/opticians/LeaveReview/DefaultView.aspx?id=OP_5DY_5772__000002_OX143HA,0,0,
Robert Stanley Opticians,OP_5DY_2075__000002_OX143JF,OPT,23 Stert Street,,,Abingdon,,OX14 3JF,Tel: 01235 520849, - ,,,No ratings yet Rate it yourself - /Services/opticians/LeaveReview/DefaultView.aspx?id=OP_5DY_2075__000002_OX143JF,0,0,
Fairford Opticians,5KY 20004__000002_GL74AD,OPT,11 High Street,,Fairford,Gloucestershire,,GL7 4AD,Tel: 01285 713313, - ,,,No ratings yet Rate it yourself - /Services/opticians/LeaveReview/DefaultView.aspx?id=5KY 20004__000002_GL74AD,0,0,
John Lewis Opticians,TP8JN,OPT,101 The Westgate,Queen Street,,Oxford,Oxfordshire,OX1 1PB,Tel: 01865 240172, - ,,,No ratings yet Rate it yourself - /Services/opticians/LeaveReview/DefaultView.aspx?id=TP8JN,0,0,
Paul Conway ,OP_5DW_8773__000001_OX12AQ,OPT,,44 George Street,,Oxford,Oxfordshire,OX1 2AQ,Tel: 01865 244667, - ,,,No ratings yet Rate it yourself - /Services/opticians/LeaveReview/DefaultView.aspx?id=OP_5DW_8773__000001_OX12AQ,0,0,
M&S Opticians,,OPT,,13-18 Queen Street,,Oxford,Oxfordshire,OX1 1AB,Tel: 01865 419984, - ,,,N/A - Data not available,,,
Specsavers,OX1 3EY__000003_OX11NU,OPT,,33 Queen Street,,Oxford,Oxfordshire,OX1 1ER,Tel: 01865 255710, - ,,,No ratings yet Rate it yourself - /Services/opticians/LeaveReview/DefaultView.aspx?id=OX1 3EY__000003_OX11NU,0,0,
Boots Opticians (Oxford),,OPT,,6-8 Cornmarket Street,,Oxford,,OX1 3HL,Tel: 01865246206, - ,,,N/A - Data not available,,,
Vision Express,OP_5DW_12640__000001_OX11NU,OPT,,31-32 Queen Street,,Oxford,Oxfordshire,OX1 3ER,Tel: 01865 243567, - ,,,No ratings yet Rate it yourself - /Services/opticians/LeaveReview/DefaultView.aspx?id=OP_5DW_12640__000001_OX11NU,0,0,
David Clulow Opticians,TP3RL,OPT,,13 High Street,,Oxford,Oxfordshire,OX1 4DB,Tel: 01865 242058, - ,,,No ratings yet Rate it yourself - /Services/opticians/LeaveReview/DefaultView.aspx?id=TP3RL,0,0,
M J Anthony,OP_5K4_12375__000001_SN68PX,OPT,Foxwood House,West End,Bishopstone,,,SN6 8PX,Tel: 01793 791352, - ,,,No ratings yet Rate it yourself - /Services/opticians/LeaveReview/DefaultView.aspx?id=OP_5K4_12375__000001_SN68PX,0,0,
Ideal Eyes,IDEALEYES1,OPT,,217 Banbury Road,Summertown,Oxford,,OX2 7HQ,Tel: 01865 302288, - ,,,No ratings yet Rate it yourself - /Services/opticians/LeaveReview/DefaultView.aspx?id=IDEALEYES1,0,0,
Boots-Oxford - Mayfield House,OP_5DW_2231__000001_OX27DE,OPT,1 Mayfield House,256 Banbury Road,Summertime,Oxford,,OX2 7DE,Tel: 01865 558 951, - ,,,No ratings yet Rate it yourself - /Services/opticians/LeaveReview/DefaultView.aspx?id=OP_5DW_2231__000001_OX27DE,0,0,
Specsavers Opticians,TP98L,OPT,Sainsbury's,Heyford Hill,Littlemore,Oxford,Oxfordshire,OX4 4XR,Tel: 01865 712 500, - ,,,No ratings yet Rate it yourself - /Services/opticians/LeaveReview/DefaultView.aspx?id=TP98L,0,0,
Morgan Optometry,OP_5DT_12976__000001_OX51BL,OPT,106a Oxford Road,,,Kidlington,,OX5 1BL,Tel: 01865 372125, - ,,,No ratings yet Rate it yourself - /Services/opticians/LeaveReview/DefaultView.aspx?id=OP_5DT_12976__000001_OX51BL,0,0,
Cherwell Opticians,,OPT,,33 High Street,Kidlington,Oxfordshire,,OX5 2DH,Tel: 01865 842044, - ,,,N/A - Data not available,,,
Specsavers Kidlington,F4N7Z,OPT,,"Unit 2B, 40 High Street",,Kidlington,Oxfordshire,OX5 2DL,Tel: 01865 509578, - ,,,No ratings yet Rate it yourself - /Services/opticians/LeaveReview/DefaultView.aspx?id=F4N7Z,0,0,
Specsavers Opticians,OP_5DW_212__000001_OX43YA,OPT,119 Pound Way,Cowley,,Oxford,,OX4 3YA,Tel: 01865 773344, - ,,,No ratings yet Rate it yourself - /Services/opticians/LeaveReview/DefaultView.aspx?id=OP_5DW_212__000001_OX43YA,0,0,
Ideal Eyes ,OP_5DW_11455__000001_OX43XH,OPT,,130-131 Pound Way,Cowley,Oxford,Oxfordshire,OX4 3XH,Tel: 01865 749877, - ,,,No ratings yet Rate it yourself - /Services/opticians/LeaveReview/DefaultView.aspx?id=OP_5DW_11455__000001_OX43XH,0,0,
Glasses Direct,OP5M2_148__000001_SN169RU,OPT,Unit 3 Gemini House,Groundwell Industrial Estate,Swindon,Wiltshire,,SN25 5AJ,Tel: 08456 882020, - ,,,No ratings yet Rate it yourself - /Services/opticians/LeaveReview/DefaultView.aspx?id=OP5M2_148__000001_SN169RU,0,0,
Scrivens,OP_5DY_11103__000001_OX118RN,OPT,,182 The Broadway,,Didcot,Oxfordshire,OX11 8RN,Tel: 01235 813305, - ,,,No ratings yet Rate it yourself - /Services/opticians/LeaveReview/DefaultView.aspx?id=OP_5DY_11103__000001_OX118RN,0,0,
Optometry Department,OP_5DW_1905__000002_OX26HE,OPT,West Wing Lg1,John Radcliffe Hospital,Headington,Oxford,,OX3 9DU,Tel: 01865 234163, - ,,,No ratings yet Rate it yourself - /Services/opticians/LeaveReview/DefaultView.aspx?id=OP_5DW_1905__000002_OX26HE,0,0,
Boots-Didcot,OP_5DY_11588__000001_OX118RJ,OPT,,48 Orchard Street,,Didcot,Oxfordshire,OX11 7LG,Tel: 01235 812241, - ,,,No ratings yet Rate it yourself - /Services/opticians/LeaveReview/DefaultView.aspx?id=OP_5DY_11588__000001_OX118RJ,0,0,
Specsavers,SPECSAVERSDIDCOT1,OPT,,17 Orchard Street,,Didcot,,OX11 7LG,Tel: 01235 517100, - ,,,No ratings yet Rate it yourself - /Services/opticians/LeaveReview/DefaultView.aspx?id=SPECSAVERSDIDCOT1,0,0,
Gardiners Opticians,OP_5DW_3921__000001_OX37RA,OPT,5 Manor Buildings,Osler Road,,Oxford,,OX3 7RA,Tel: 01865 761459, - ,,,No ratings yet Rate it yourself - /Services/opticians/LeaveReview/DefaultView.aspx?id=OP_5DW_3921__000001_OX37RA,0,0,
Robert Stanley Opticians,OP_5DW_3703__000001_OX39HZ,OPT,137 London Road,Headington,,Oxford,,OX3 9HZ,Tel: 01865 766488, - ,,,No ratings yet Rate it yourself - /Services/opticians/LeaveReview/DefaultView.aspx?id=OP_5DW_3703__000001_OX39HZ,0,0,
ASDA Vision Centre,OP_5K3_14300__000002_SN254BG,OPT,North Swindon District Centre,Thamesdown Drive,,Swindon,,SN25 4BG,Tel: 01793 707882, - ,,,No ratings yet Rate it yourself - /Services/opticians/LeaveReview/DefaultView.aspx?id=OP_5K3_14300__000002_SN254BG,0,0,
Haine & Smith Opticians,OP_5K3_1303__000002_SN26AN,OPT,,105 Cricklade Road,,Swindon,Wiltshire,SN2 1AB,Tel: 01793 522572, - ,,,No ratings yet Rate it yourself - /Services/opticians/LeaveReview/DefaultView.aspx?id=OP_5K3_1303__000002_SN26AN,0,0,
Tesco Opticians,TP41K,OPT,,Ocotal Way,,Swindon,,SN1 2EH,, - ,,,No ratings yet Rate it yourself - /Services/opticians/LeaveReview/DefaultView.aspx?id=TP41K,0,0,
Optical Express,SN1 1DA_83473,OPT,,"1st Floor (suite 4), Minton Place, Station Road",,Swindon,,SN1 1DA,Tel: 08000232020, - ,,,No ratings yet Rate it yourself - /Services/opticians/LeaveReview/DefaultView.aspx?id=SN1 1DA_83473,0,0,
Specsavers Opticians,OP_5K3_12126__000001_SN11SD,OPT,62/63 Regent Street,,Swindon,,,SN1 1JS,Tel: 01793 617858, - ,,,No ratings yet Rate it yourself - /Services/opticians/LeaveReview/DefaultView.aspx?id=OP_5K3_12126__000001_SN11SD,0,0,
Haine & Smith Opticians,OP_5K3_2612__000003_SN11JS,OPT,,45c Regent Street,Swindon,Wiltshire,,SN1 1JS,Tel: 01793 487888, - ,,,No ratings yet Rate it yourself - /Services/opticians/LeaveReview/DefaultView.aspx?id=OP_5K3_2612__000003_SN11JS,0,0,
Vision Express (UK) Ltd,OP_5K3_11424__000001_SN11JY,OPT,83 Regent Street,,Swindon,,,SN1 1JY,Tel: 01793 491194, - ,,,No ratings yet Rate it yourself - /Services/opticians/LeaveReview/DefaultView.aspx?id=OP_5K3_11424__000001_SN11JY,0,0,
Andrew Rhys Evans (Optometrists),OP_5K4_273__000001_SN66DF,OPT,82 High Street,,Cricklade,,,SN6 6DF,Tel: 01793 750415, - ,,,No ratings yet Rate it yourself - /Services/opticians/LeaveReview/DefaultView.aspx?id=OP_5K4_273__000001_SN66DF,0,0,
Vision Visit,SN3 1JU,OPT,,51 Windsor Road,,Swindon,,SN3 1JU,Tel: 01793 232588, - ,,,No ratings yet Rate it yourself - /Services/opticians/LeaveReview/DefaultView.aspx?id=SN3 1JU,0,0,
The White Horse Optical Practice,OP_5K3_5315__000006_SN11LF,OPT,,7 Brunel Plaza,,Swindon,,SN1 1LF,Tel: 01793 432751, - ,,,No ratings yet Rate it yourself - /Services/opticians/LeaveReview/DefaultView.aspx?id=OP_5K3_5315__000006_SN11LF,0,0,
Boots-Swindon - Brunel Plaza (in Boots UK),OP_5K3_11563__000002_SN11LF,OPT,3 Brunel Plaza,,,Swindon,Wiltshire,SN1 1LF,Tel: 01793 433060, - ,,,No ratings yet Rate it yourself - /Services/opticians/LeaveReview/DefaultView.aspx?id=OP_5K3_11563__000002_SN11LF,0,0,
The Outside Clinic,OP_5CC_14872__000024_SN14AN,OPT,Old Town Court,10-14 High Street,Old Town,Swindon,Wiltshire,SN1 3EP,Tel: 0800 60 50 40, - ,,,No ratings yet Rate it yourself - /Services/opticians/LeaveReview/DefaultView.aspx?id=OP_5CC_14872__000024_SN14AN,0,0,
G D Monk,OP_5K3_14301__000004_SN11SD,OPT,35 Havelock Street,,Swindon,Wiltshire,,SN1 1SD,Tel: 01793 523743, - ,,,No ratings yet Rate it yourself - /Services/opticians/LeaveReview/DefaultView.aspx?id=OP_5K3_14301__000004_SN11SD,0,0,
Leightons Opticians & Hearing Care,OP_5K3_4081__000004_SN14AN,OPT,,33 Wood Street,,Swindon,Wiltshire,SN1 4AN,Tel: 01793 522 586, - ,,,No ratings yet Rate it yourself - /Services/opticians/LeaveReview/DefaultView.aspx?id=OP_5K3_4081__000004_SN14AN,0,0,
The Outside Clinic,OP_5CK_14996__000007_SN14AN,OPT,7 Wood Street,Old Town,Swindon,,,SN1 4AN,Tel: 0800 85 44 77, - ,,,No ratings yet Rate it yourself - /Services/opticians/LeaveReview/DefaultView.aspx?id=OP_5CK_14996__000007_SN14AN,0,0,
R J Holmes Opticians Ltd,OP_5K3_8460__000003_SN57DL,OPT,West Swindon District Centre,Tewkesbury Way,Swindon,,,SN5 7DL,Tel: 01793 870011, - ,,,No ratings yet Rate it yourself - /Services/opticians/LeaveReview/DefaultView.aspx?id=OP_5K3_8460__000003_SN57DL,0,0,
Michael Barfield,MICHEALBARFIELD1,OPT,,4 New Street,,Chipping Norton,,OX7 5LJ,Tel: 01608 643772, - ,,,No ratings yet Rate it yourself - /Services/opticians/LeaveReview/DefaultView.aspx?id=MICHEALBARFIELD1,0,0,
Scrivens,5QE_0X75AD__000005_OX75AD,OPT,Scrivens Opticians and   Hearing Care,8 High Street,,Chipping Norton,Oxfordshire,OX7 5AD,Tel: 01608 642 949, - ,,,No ratings yet Rate it yourself - /Services/opticians/LeaveReview/DefaultView.aspx?id=5QE_0X75AD__000005_OX75AD,0,0,
Chipping Norton Opticians,310320170916,OPT,,"Chipping Norton Health Centre, Russell Way",,Chipping Norton,Oxfordshire,OX7 5FA,Tel: 01608 648012, - ,,,No ratings yet Rate it yourself - /Services/opticians/LeaveReview/DefaultView.aspx?id=310320170916,0,0,
Haine & Smith Opticians,OP_5K3_2478__000002_SN49LN,OPT,8 Ellendune,Wroughton,,Wiltshire,,SN4 9LN,Tel: 01793 813054, - ,,,No ratings yet Rate it yourself - /Services/opticians/LeaveReview/DefaultView.aspx?id=OP_5K3_2478__000002_SN49LN,0,0,
The Opticians,5KY 20005__000001_GL541AA,OPT,Sheep Street,Sheep Street,Stow On The Wold,Gloucestershire,,GL54 1AA,Tel: 01451 830554, - ,,,No ratings yet Rate it yourself - /Services/opticians/LeaveReview/DefaultView.aspx?id=5KY 20005__000001_GL541AA,0,0,
Boots-Wallingford,BOOTSWALLINGFORD1,OPT,1 Castle Street,,,Wallingford,Oxfordshire,OX10 8DL,Tel: 01491 833200, - ,,,No ratings yet Rate it yourself - /Services/opticians/LeaveReview/DefaultView.aspx?id=BOOTSWALLINGFORD1,0,0,
Robert Stanley Opticians,OP_5DX_5409__000002_OX100AL,OPT,8 St. Martins Street,,,Wallingford,,OX10 0AL,Tel: 01491 837033, - ,,,No ratings yet Rate it yourself - /Services/opticians/LeaveReview/DefaultView.aspx?id=OP_5DX_5409__000002_OX100AL,0,0,
Patricia Hayselden & Partners,OP_5DX_8466__000002_OX100EL,OPT,,60 St Mary's Street,,Wallingford,Oxfordshire,OX10 0EL,Tel: 01491 835466, - ,,,No ratings yet Rate it yourself - /Services/opticians/LeaveReview/DefaultView.aspx?id=OP_5DX_8466__000002_OX100EL,0,0,
"Tesco’s Opticians, Cirencester",OP_GL71NP_30718,OPT,,"Kings Meadow, Cricklade Road",,Cirencester,,GL7 1NP,Tel: 0345 601 3479, - ,,,No ratings yet Rate it yourself - /Services/opticians/LeaveReview/DefaultView.aspx?id=OP_GL71NP_30718,0,0,
Posh Eyes,D-12688 ,OPT,Westbury House,52 French Laurence Way,,Oxford,Oxfordshire,OX44 7YF,Tel: 01865400384, - ,,,No ratings yet Rate it yourself - /Services/opticians/LeaveReview/DefaultView.aspx?id=D-12688,0,0,yes
Leightons Opticians & Hearing Care,OP_5KY_11919__000001_GL72PP,OPT,,Merchants House,39-41 Dyer Street,Cirencester,Gloucestershire,GL7 2PP,Tel: 01285 651 344, - ,,,No ratings yet Rate it yourself - /Services/opticians/LeaveReview/DefaultView.aspx?id=OP_5KY_11919__000001_GL72PP,0,0,
Philip Kersey & Partners,OP_5KY_7259__000003_GL72PF,OPT,56 Dyer Street,,Cirencester,Gloucestershire,,GL7 2PF,Tel: 01285 641999, - ,,,No ratings yet Rate it yourself - /Services/opticians/LeaveReview/DefaultView.aspx?id=OP_5KY_7259__000003_GL72PF,0,0,
Specsavers Opticians,5KY 20003__000003_GL71JH,OPT,"30, Cricklade Street",,Cirencester,Gloucestershire,,GL7 1JH,Tel: 01285 648610, - ,,,No ratings yet Rate it yourself - /Services/opticians/LeaveReview/DefaultView.aspx?id=5KY 20003__000003_GL71JH,0,0,
Haine & Smith Opticians,OP_5KY_2823__000002_GL71JH,OPT,,6c Cricklade Street,,Cirencester,Gloucestershire,GL7 1JH,Tel: 01285 651161, - ,,,No ratings yet Rate it yourself - /Services/opticians/LeaveReview/DefaultView.aspx?id=OP_5KY_2823__000002_GL71JH,0,0,
Boots-Cirencester,OP_5KY_1665__000001_GL71JH,OPT,42 Cricklade Street,,Cirencester,Gloucestershire,,GL7 1JH,Tel: 01285 654579, - ,,,No ratings yet Rate it yourself - /Services/opticians/LeaveReview/DefaultView.aspx?id=OP_5KY_1665__000001_GL71JH,0,0,
R J Holmes Opticians ,OP_5KY_1317__000001_GL71QA,OPT,6 Castle Street,,Cirencester,Gloucestershire,,GL7 1QA,Tel: 01285 650136, - ,,,No ratings yet Rate it yourself - /Services/opticians/LeaveReview/DefaultView.aspx?id=OP_5KY_1317__000001_GL71QA,0,0,
Vision Express,OP_5DK_11298__000002_RG170DL,OPT,,21 High Street,,Hungerford,Berkshire,RG17 0NF,Tel: 01488 682458, - ,,,No ratings yet Rate it yourself - /Services/opticians/LeaveReview/DefaultView.aspx?id=OP_5DK_11298__000002_RG170DL,0,0,yes
Haine & Smith Opticians,OP_5K4_2814__000003_SN47AY,OPT,,140 High Street,,Royal Wootton Bassett,Wiltshire,SN4 7AY,Tel: 01793 853298, - ,,,No ratings yet Rate it yourself - /Services/opticians/LeaveReview/DefaultView.aspx?id=OP_5K4_2814__000003_SN47AY,0,0,
Specsavers (Royal Wootton Bassett),T0H0Q,OPT,,10-11 Borough Fields Shopping Centre,,Royal Wootton Bassett,Wiltshire,SN4 7AX,Tel: 01793 290062, - ,,,No ratings yet Rate it yourself - /Services/opticians/LeaveReview/DefaultView.aspx?id=T0H0Q,0,0,
Boots-Bicester,OP_5DT_1929__000003_OX67HY,OPT,,Unit 6 Crown Walk,,Bicester,Oxfordshire,OX26 6HY,Tel: 01869 320027, - ,,,No ratings yet Rate it yourself - /Services/opticians/LeaveReview/DefaultView.aspx?id=OP_5DT_1929__000003_OX67HY,0,0,
Robert Stanley Opticians,ROBERTSTANLEYOPTICIANS1,OPT,,Unit EY4 Pioneer Square,Bure Place,Bicester,Oxfordshire,OX26 6FA,Tel: 01869 360557, - ,,,No ratings yet Rate it yourself - /Services/opticians/LeaveReview/DefaultView.aspx?id=ROBERTSTANLEYOPTICIANS1,0,0,
Scrivens ,OP_5DT_9615__000001_OX266JF,OPT,Scrivens Opticians and Hearing Care,21 Sheep Street,,Bicester,Oxfordshire,OX26 6JF,Tel: 01869 253577, - ,,,No ratings yet Rate it yourself - /Services/opticians/LeaveReview/DefaultView.aspx?id=OP_5DT_9615__000001_OX266JF,0,0,
Specsavers Opticians,OP_5DT_11808__000001_OX67HY,OPT,,26 Sheep Street,,Bicester,Oxfordshire,OX26 6JF,Tel: 01869 321422, - ,,,No ratings yet Rate it yourself - /Services/opticians/LeaveReview/DefaultView.aspx?id=OP_5DT_11808__000001_OX67HY,0,0,yes
Vision Express,VISIONEXPRESSBICESTER1,OPT,,47 Sheep Street,,Bicester,,OX26 6JJ,Tel: 01869 327035, - ,,,No ratings yet Rate it yourself - /Services/opticians/LeaveReview/DefaultView.aspx?id=VISIONEXPRESSBICESTER1,0,0,
Dove & Conway Opticians,SM 009 / 4060 / 5QE,OPT,,100 Sheep Street,,Bicester,Oxfordshire,OX26 6LP,Tel: 01869 242740, - ,,,No ratings yet Rate it yourself - /Services/opticians/LeaveReview/DefaultView.aspx?id=SM 009 / 4060 / 5QE,0,0,
Jacqueline Burns Opticians,OP_SN81HN_33975,OPT,,140 High Street,,Marlborough,,SN8 1HN,, - ,,,No ratings yet Rate it yourself - /Services/opticians/LeaveReview/DefaultView.aspx?id=OP_SN81HN_33975,0,0,
Specavers Opticians,SN8 1HN,OPT,,131 High Street,,Marlborough,,SN8 1HN,Tel: 01672 517900, - ,,,No ratings yet Rate it yourself - /Services/opticians/LeaveReview/DefaultView.aspx?id=SN8 1HN,0,0,
Kevin Tait Opticians,OP_5KY_3831__000001_GL560AS,OPT,3 High Street,,Moreton-In-Marsh,Gloucestershire,,GL56 0AH,Tel: 01608 650621, - ,,,No ratings yet Rate it yourself - /Services/opticians/LeaveReview/DefaultView.aspx?id=OP_5KY_3831__000001_GL560AS,0,0,
Haine & Smith Opticians,OP_5K4_11275__000002_SN81LT,OPT,,23-24  High Street,,Marlborough,Wiltshire,SN8 1LW,Tel: 01672 513432, - ,,,No ratings yet Rate it yourself - /Services/opticians/LeaveReview/DefaultView.aspx?id=OP_5K4_11275__000002_SN81LT,0,0,
Specsavers Opticians,OP_5DK_1746__000001_RG141DT,OPT,42-42a Northbrook Street,Newbury,Berkshire,,,RG14 1DT,Tel: 01635 46105, - ,,,No ratings yet Rate it yourself - /Services/opticians/LeaveReview/DefaultView.aspx?id=OP_5DK_1746__000001_RG141DT,0,0,
Ottica UK Ltd,OP_RG141AY_85774,OPT,,38 Parkway,,Newbury,,RG14 1AY,, - ,,,No ratings yet Rate it yourself - /Services/opticians/LeaveReview/DefaultView.aspx?id=OP_RG141AY_85774,0,0,
Boots-Newbury - Northbrook St (in Boots UK),OP_RG141DJ_85768,OPT,4-5 Northbrook Street,,,Newbury,Berkshire,RG14 1DJ,Tel: 01635 40397, - ,,,No ratings yet Rate it yourself - /Services/opticians/LeaveReview/DefaultView.aspx?id=OP_RG141DJ_85768,0,0,
Vision Express,OP_5DK_3370__000001_RG141AA,OPT,92 Northbrook Street,,Newbury,,,RG14 1AA,Tel: 01635 230294, - ,,,No ratings yet Rate it yourself - /Services/opticians/LeaveReview/DefaultView.aspx?id=OP_5DK_3370__000001_RG141AA,0,0,
Scott Waters Opticians,OP_5DK_5322__000002_RG141AA,OPT,,98 Northbrook Street,,Newbury,Berkshire,RG14 1AA,Tel: 01635 31113, - ,,,No ratings yet Rate it yourself - /Services/opticians/LeaveReview/DefaultView.aspx?id=OP_5DK_5322__000002_RG141AA,0,0,
Specsavers - Hectors Way Newbury,,OPT,,Sainsbury's Hectors Way,,Newbury,Berkshire,RG14 5AB,Tel: 01635 881 657, - ,,,N/A - Data not available,,,
Thame Specsavers Limited,O9Q0Q,OPT,,109 High Street,,Thame,,OX9 3DZ,Tel: 01844 394765, - ,,,No ratings yet Rate it yourself - /Services/opticians/LeaveReview/DefaultView.aspx?id=O9Q0Q,0,0,
Robert Stanley Opticians,OP_5DP_14311__000004_OX92BL,OPT,22 Cornmarket,,Thame,Oxon,,OX9 2BL,Tel: 01844 261096, - ,,,No ratings yet Rate it yourself - /Services/opticians/LeaveReview/DefaultView.aspx?id=OP_5DP_14311__000004_OX92BL,0,0,