Organisation Name,NACS Code,Organisation Type,Address1,Address2,Address3,Address4,Address5,PostCode,Telephone Number,Opening time,Value  (Opening time),Banding Classification  (Opening time),NHS.UK users rating,Value  (NHS.UK users rating),Banding Classification  (NHS.UK users rating),Car parking (Is there car parking at this organisation?)
U. Patel Optometrist,OP_5M6_11526__000002_TW26HT,OPT,135 Percy Road,Whitton,,Twickenham,,TW2 6HT,Tel: 0208 893 8041, - ,,,No ratings yet Rate it yourself - /Services/opticians/LeaveReview/DefaultView.aspx?id=OP_5M6_11526__000002_TW26HT,0,0,
Eye Smile Ltd,GOC: 0116240,OPT,,120 – 122 High Street,,Whitton,Middlesex,TW2 7LL,Tel: 0208 755 7900, - ,,,No ratings yet Rate it yourself - /Services/opticians/LeaveReview/DefaultView.aspx?id=GOC: 0116240,0,0,yes
Geoffrey Waterhouse Optometrists,OP_5M6_13286__000001_TW27LD,OPT,79 High Street,Whitton,,Twickenham,,TW2 7LD,Tel: 0208 894 7080, - ,,,No ratings yet Rate it yourself - /Services/opticians/LeaveReview/DefaultView.aspx?id=OP_5M6_13286__000001_TW27LD,0,0,
Optomansi 2 Ltd,D5N7B,OPT,,73 Montrose Avenue,,Twickenham,,TW2 6HG,Tel: 0207 229 8399, - ,,,No ratings yet Rate it yourself - /Services/opticians/LeaveReview/DefaultView.aspx?id=D5N7B,0,0,
Realeyes - The Eye Clinic,OPT_TW27LT_1,OPT,,54-56 High Street,,Whitton,,TW2 7LT,Tel: 020 3906 8555, - ,,,2 ratings Rate it yourself - /Services/opticians/LeaveReview/DefaultView.aspx?id=OPT_TW27LT_1,,,
Specsavers,OPT_TW121AW_1,OPT,,J Sainsbury,303 Uxbridge Road,Hampton Hill,,TW12 1AW,Tel: 0208 9410852, - ,,,No ratings yet Rate it yourself - /Services/opticians/LeaveReview/DefaultView.aspx?id=OPT_TW121AW_1,0,0,
Robert Frith Ophthalmic Opticians,OP_5M6_369__000002_TW14BW,OPT,,104 Heath Road,,Twickenham,,TW1 4BW,Tel: 0208 892 1682, - ,,,3 ratings Rate it yourself - /Services/opticians/LeaveReview/DefaultView.aspx?id=OP_5M6_369__000002_TW14BW,,,
NORMAN PRINCE & PARTNERS,TW11 8UD__000001_TW118UD,OPT,176 Stanley Road,,,Teddington,,TW11 8UD,Tel: 0208 977 1180, - ,,,No ratings yet Rate it yourself - /Services/opticians/LeaveReview/DefaultView.aspx?id=TW11 8UD__000001_TW118UD,0,0,
The Optical Gallery,OP_5M6_496__000001_TW13SN,OPT,,16 King Street,,Twickenham,Middlesex,TW1 3SN,Tel: 0208 892 2800, - ,,,No ratings yet Rate it yourself - /Services/opticians/LeaveReview/DefaultView.aspx?id=OP_5M6_496__000001_TW13SN,0,0,
Boots Opticians,310820171134,OPT,,17 King Street,,Twickenham,,TW1 3SD,, - ,,,No ratings yet Rate it yourself - /Services/opticians/LeaveReview/DefaultView.aspx?id=310820171134,0,0,
Specsavers,TP20H,OPT,,16-18 London Road,,Twickenham,,TW1 3RR,Tel: 0208 83175 20, - ,,,No ratings yet Rate it yourself - /Services/opticians/LeaveReview/DefaultView.aspx?id=TP20H,0,0,
David Wilson Optometrists,OPT_TW118QZ_3,OPT,,7 Broad Street,,Teddington,Middlesex,TW11 8QZ,Tel: 020 8977 7499, - ,,,No ratings yet Rate it yourself - /Services/opticians/LeaveReview/DefaultView.aspx?id=OPT_TW118QZ_3,0,0,
Boots-Teddington,OP_TW118QZ_46632,OPT,,Unit 2B,61 Broad Street,Teddington,Middlesex,TW11 8QZ,Tel: 0208 973 1635, - ,,,No ratings yet Rate it yourself - /Services/opticians/LeaveReview/DefaultView.aspx?id=OP_TW118QZ_46632,0,0,
Treaty Eye Centre,OP_5HY_7224__000001_TW31ES,OPT,41 Treaty Centre,High Street,Hounslow,,,TW3 1ES,Tel: 020 8572 2011, - ,,,No ratings yet Rate it yourself - /Services/opticians/LeaveReview/DefaultView.aspx?id=OP_5HY_7224__000001_TW31ES,0,0,
Vision Express,OP_5HY_9094__000003_TW31BL,OPT,177 High Street,Hounslow,Middlesex,,,TW3 1BL,Tel: 020 8569 4589, - ,,,No ratings yet Rate it yourself - /Services/opticians/LeaveReview/DefaultView.aspx?id=OP_5HY_9094__000003_TW31BL,0,0,
Boots-Hounslow - High St (in Boots UK),OP_5HY_10999__000002_TW31BL,OPT,193-199 High Street,,,Hounslow,,TW3 1BL,Tel: 0208 577 5038, - ,,,4 ratings Rate it yourself - /Services/opticians/LeaveReview/DefaultView.aspx?id=OP_5HY_10999__000002_TW31BL,,,
The Optical Shop,OP_5HY_139__000001_TW31HL,OPT,186 High Street,Hounslow,Middlesex,,,TW3 1HL,Tel: 020 8570 2585, - ,,,No ratings yet Rate it yourself - /Services/opticians/LeaveReview/DefaultView.aspx?id=OP_5HY_139__000001_TW31HL,0,0,
Specsavers Opticians,OP_5HY_373__000001_TW31LR,OPT,152 High Street,,Hounslow,,,TW3 1LR,Tel: 020 8577 9234, - ,,,No ratings yet Rate it yourself - /Services/opticians/LeaveReview/DefaultView.aspx?id=OP_5HY_373__000001_TW31LR,0,0,
The Eyewearshop Ltd T/A The Opticians,CO-3962-08082014-TW31LR,OPT,,134 High Street,,Hounslow,,TW3 1LR,, - ,,,No ratings yet Rate it yourself - /Services/opticians/LeaveReview/DefaultView.aspx?id=CO-3962-08082014-TW31LR,0,0,
Sims Opticians,OP_5M6_3062__000001_TW110HE,OPT,4 The Causeway,,,Teddington,,TW11 0HE,Tel: 0208 977 1039, - ,,,No ratings yet Rate it yourself - /Services/opticians/LeaveReview/DefaultView.aspx?id=OP_5M6_3062__000001_TW110HE,0,0,
Dollond & Aitchison,OP_5HY_5403__000001_TW31NA,OPT,134 High Street,Hounslow,Middlesex,,,TW3 1NA,Tel: 020 8570 9955, - ,,,No ratings yet Rate it yourself - /Services/opticians/LeaveReview/DefaultView.aspx?id=OP_5HY_5403__000001_TW31NA,0,0,
Priory Opticians,OP_5M6_13284__000001_TW122NS,OPT,37 Priory Road,Hampton,,Middlesex,,TW12 2NS,Tel: 0208 979 0203, - ,,,2 ratings Rate it yourself - /Services/opticians/LeaveReview/DefaultView.aspx?id=OP_5M6_13284__000001_TW122NS,,,
The Eye Store,OP_5M6_14592__000001_TW12SG,OPT,51 King Street,Twickenham,,Surrey,,TW1 2SG,Tel: 0208 891 2020, - ,,,No ratings yet Rate it yourself - /Services/opticians/LeaveReview/DefaultView.aspx?id=OP_5M6_14592__000001_TW12SG,0,0,
The Eye Galleria,OLCO30725M6__000002_TW12DX,OPT,The Eye Galleria Opticians,362 Richmond Road,,East Twickenham,Middlesex,TW1 2DX,Tel: 020 8891 6661, - ,,,No ratings yet Rate it yourself - /Services/opticians/LeaveReview/DefaultView.aspx?id=OLCO30725M6__000002_TW12DX,0,0,
Specsavers Opticians,OP_5HY_13898__000002_TW134BS,OPT,152 The Centre,Feltham,Middlesex,,,TW13 4BS,Tel: 020 8844 4880, - ,,,1 rating Rate it yourself - /Services/opticians/LeaveReview/DefaultView.aspx?id=OP_5HY_13898__000002_TW134BS,,,
Ronald Brown Opticians,OP_5HY_12588__000002_TW134BU,OPT,14 Wilton Parade,High Street,,Feltham,Middlesex,TW13 4BU,Tel: 020 8890 6546, - ,,,No ratings yet Rate it yourself - /Services/opticians/LeaveReview/DefaultView.aspx?id=OP_5HY_12588__000002_TW134BU,0,0,
Loptics,OP_5HY_8816__000002_TW47HT,OPT,376 Bath Road,Hounslow,Middlesex,,,TW4 7HT,Tel: 020 8570 3604, - ,,,No ratings yet Rate it yourself - /Services/opticians/LeaveReview/DefaultView.aspx?id=OP_5HY_8816__000002_TW47HT,0,0,
Feltham Eyecare Centre,TP4TN,OPT,,92 Bedfont Lane,Feltham,London,,TW14 9BP,Tel: 020 88670406, - ,,,No ratings yet Rate it yourself - /Services/opticians/LeaveReview/DefaultView.aspx?id=TP4TN,0,0,
David Clulow,TW9 1JT__000001_TW91JT,OPT,,5 George Street,,Richmond,Middlesex,TW9 1JT,Tel: 0208 332 0345, - ,,,No ratings yet Rate it yourself - /Services/opticians/LeaveReview/DefaultView.aspx?id=TW9 1JT__000001_TW91JT,0,0,
Eyecare Opticians,OP_5L7_14628__000002_GU211TB,OPT,307 Richmond Road,,Kingston-Upon-Thames,Surrey,,KT2 5QU,Tel: 0208 549 0331, - ,,,No ratings yet Rate it yourself - /Services/opticians/LeaveReview/DefaultView.aspx?id=OP_5L7_14628__000002_GU211TB,0,0,
Boots-Richmond - George St,TW9 1HE_99812,OPT,,60 George Street,,Richmond,Surrey,TW9 1HE,Tel: 0208 940 5166, - ,,,1 rating Rate it yourself - /Services/opticians/LeaveReview/DefaultView.aspx?id=TW9 1HE_99812,,,
Ten The Green,OPT_TW91PX_1,OPT,,10 The Green,,Richmond,,TW9 1PX,Tel: 0208 940 0010, - ,,,No ratings yet Rate it yourself - /Services/opticians/LeaveReview/DefaultView.aspx?id=OPT_TW91PX_1,0,0,
Zdenek-Walker,OP_5M6_13287__000001_TW91PX,OPT,10 The Green,Richmond,,Surrey,,TW9 1PX,Tel: 0208 940 0010, - ,,,No ratings yet Rate it yourself - /Services/opticians/LeaveReview/DefaultView.aspx?id=OP_5M6_13287__000001_TW91PX,0,0,
Boots-Richmond - Red Lion St,TW9 1RW_83731,OPT,,22 Red Lion Street,,Richmond,Surrey,TW9 1RW,Tel: 0208 940 2218, - ,,,No ratings yet Rate it yourself - /Services/opticians/LeaveReview/DefaultView.aspx?id=TW9 1RW_83731,0,0,
RICHMOND EYE CENTRE ,OP_5M6_2157__000001_TW91HP,OPT,,18 Duke Street,,Richmond,,TW9 1HP,Tel: 0208 948 8882, - ,,,No ratings yet Rate it yourself - /Services/opticians/LeaveReview/DefaultView.aspx?id=OP_5M6_2157__000001_TW91HP,0,0,
Osterley Opticians,00015HY__000001_TW74QE,OPT,156 Thornbury Road,Osterley Village,Osterley,Isleworth,,TW7 4QE,Tel: 0208 5606098, - ,,,1 rating Rate it yourself - /Services/opticians/LeaveReview/DefaultView.aspx?id=00015HY__000001_TW74QE,,,
Vision Express ,OP_5M6_6901__000002_TW91HE,OPT,,10 The Quadrant,,Richmond,,TW9 1BP,Tel: 020 8948 6149, - ,,,No ratings yet Rate it yourself - /Services/opticians/LeaveReview/DefaultView.aspx?id=OP_5M6_6901__000002_TW91HE,0,0,
SPECSAVERS,TW9 1DJ__000001_TW91DJ,OPT,3 Quadrant House,The Quadrant,,Richmond,,TW9 1DJ,Tel: 0208 439 9330, - ,,,No ratings yet Rate it yourself - /Services/opticians/LeaveReview/DefaultView.aspx?id=TW9 1DJ__000001_TW91DJ,0,0,
Eyecare Heston Ltd.,TP4R2,OPT,329 Vicarage Farm Road,Heston,Middlesex,London,,TW5 0DR,Tel: 020 8569 6520, - ,,,1 rating Rate it yourself - /Services/opticians/LeaveReview/DefaultView.aspx?id=TP4R2,,,
Tesco Opticians,OLCO-19985HY__000002_TW75NZ,OPT,Osterley Park,Syon Lane,Isleworth,Middlesex,,TW7 5NZ,Tel: 0345 6013479, - ,,,No ratings yet Rate it yourself - /Services/opticians/LeaveReview/DefaultView.aspx?id=OLCO-19985HY__000002_TW75NZ,0,0,
Thomas H. Collison Ltd,OP_5KP_11291__000001_KT80DT,OPT,Kent House,Walton Road,,East Molesey,Surrey,KT8 0DT,Tel: 0208 979 6751, - ,,,No ratings yet Rate it yourself - /Services/opticians/LeaveReview/DefaultView.aspx?id=OP_5KP_11291__000001_KT80DT,0,0,
B W Martin,OP_5HY_13895__000001_TW59JB,OPT,15 Fairmead Close,Heston,Middlesex,,,TW5 9JB,Tel: 020 8579 7607, - ,,,No ratings yet Rate it yourself - /Services/opticians/LeaveReview/DefaultView.aspx?id=OP_5HY_13895__000001_TW59JB,0,0,
Bailey Opticians,OP_5HY_5005__000002_TW148BN,OPT,503 Staines Road,Bedfont,Middlesex,,,TW14 8BN,Tel: 020 8890 4918, - ,,,No ratings yet Rate it yourself - /Services/opticians/LeaveReview/DefaultView.aspx?id=OP_5HY_5005__000002_TW148BN,0,0,
Thomas H. Collison Ltd,OP_5L6_4986__000002_TW167AB,OPT,11 The Parade,Staines Road West,,Sunbury-on-Thames,Surrey,TW16 7AB,Tel: 01932 782 318, - ,,,No ratings yet Rate it yourself - /Services/opticians/LeaveReview/DefaultView.aspx?id=OP_5L6_4986__000002_TW167AB,0,0,
Vision Express ,OP_5A5_6670__000002_KT11TR,OPT,Bentalls Shopping Centre,Wood Street,,Kingston-upon-Thames,,KT1 1TR,Tel: 020 8549 8010, - ,,,No ratings yet Rate it yourself - /Services/opticians/LeaveReview/DefaultView.aspx?id=OP_5A5_6670__000002_KT11TR,0,0,
Classic Eyes Brentford,OLCO-29195HY__000001_TW88JZ,OPT,Unit 7 Brentford Lock,159-188 High Street,Brentford,Middlesex,,TW8 8AQ,Tel: 020 8568 7778, - ,,,No ratings yet Rate it yourself - /Services/opticians/LeaveReview/DefaultView.aspx?id=OLCO-29195HY__000001_TW88JZ,0,0,
Cranford Opticians,OP_5HY_13896__000002_TW59TY,OPT,742 Bath Road,Cranford,,Hounslow,Middlesex,TW5 9TY,Tel: 020 8759 9395, - ,,,27 ratings Rate it yourself - /Services/opticians/LeaveReview/DefaultView.aspx?id=OP_5HY_13896__000002_TW59TY,,,Data not available
Tesco Opticians,TW167BB060716,OPT,,Escot Road,,Sunbury-on-Thames,,TW16 7BB,Tel: 0845 601 3479, - ,,,No ratings yet Rate it yourself - /Services/opticians/LeaveReview/DefaultView.aspx?id=TW167BB060716,0,0,
Optical Express,,OPT,,93-95 Bedford Street,,Kingston Upon Thames,,KT1 1SZ,, - ,,,N/A - Data not available,,,
Optical Express,KT1 1NP__000001_KT11NP,OPT,3rd Floor,14-18 Fife Road,,Kingston,Surrey,KT1 1SZ,Tel: 0800 023 2020, - ,,,No ratings yet Rate it yourself - /Services/opticians/LeaveReview/DefaultView.aspx?id=KT1 1NP__000001_KT11NP,0,0,
DOLLAND & AITCHISON,KT1 1RJ__000001_KT11RJ,OPT,10 Church Street,,,Kingston,,KT1 1RJ,Tel: 0208 546 3416, - ,,,No ratings yet Rate it yourself - /Services/opticians/LeaveReview/DefaultView.aspx?id=KT1 1RJ__000001_KT11RJ,0,0,
HORROCKS & BOYD,KT1 1SF__000001_KT11SF,OPT,,39 Fife Raod,,Kingston Upon Thames,Surrey,KT1 1SF,Tel: 0208 546 2481, - ,,,No ratings yet Rate it yourself - /Services/opticians/LeaveReview/DefaultView.aspx?id=KT1 1SF__000001_KT11SF,0,0,no
Boots-Kingston - Union St,KT1 1RP__000005_KT11RP,OPT,42 Union Street,,,Kingston Upon Thames,Surrey,KT1 1RP,Tel: 0208 5411560, - ,,,1 rating Rate it yourself - /Services/opticians/LeaveReview/DefaultView.aspx?id=KT1 1RP__000005_KT11RP,,,
The Avenue Optical,OP_5L6_11988__000002_TW165HS,OPT,9 Avenue Parade,The Avenue,,Sunbury-on-Thames,Surrey,TW16 5HS,Tel: 01932 770 977, - ,,,No ratings yet Rate it yourself - /Services/opticians/LeaveReview/DefaultView.aspx?id=OP_5L6_11988__000002_TW165HS,0,0,
Mr S Stewart Duncan,OP_5HY_4818__000002_TW88AH,OPT,213 High Street,Brentford,Middlesex,,,TW8 8AH,Tel: 020 8568 4139, - ,,,No ratings yet Rate it yourself - /Services/opticians/LeaveReview/DefaultView.aspx?id=OP_5HY_4818__000002_TW88AH,0,0,
Specsavers Opticians,OP_5A5_106__000001_KT11MP,OPT,56 - 58 Clarence Street,,,Kingston-upon-Thames,,KT1 1NP,Tel: 020 8974 6677, - ,,,No ratings yet Rate it yourself - /Services/opticians/LeaveReview/DefaultView.aspx?id=OP_5A5_106__000001_KT11MP,0,0,
B A Williams Chemists & Opticians,OP_5HY_13897__000002_TW80JW,OPT,14-15 Albany Parade,High Street,Brentford,,,TW8 0JW,Tel: 020 8560 3834, - ,,,No ratings yet Rate it yourself - /Services/opticians/LeaveReview/DefaultView.aspx?id=OP_5HY_13897__000002_TW80JW,0,0,
Eye Kew,OPT_TW93QB_1,OPT,,7 Station Approach,Kew,Surrey,,TW9 3QB,Tel: 020 8948 0803, - ,,,No ratings yet Rate it yourself - /Services/opticians/LeaveReview/DefaultView.aspx?id=OPT_TW93QB_1,0,0,
King Opticians,OP_5HX___000002_UB24DG,OPT,31-33 King Street,,Southall,Middx,,UB2 4DG,Tel: 0208 574 6927, - ,,,7 ratings Rate it yourself - /Services/opticians/LeaveReview/DefaultView.aspx?id=OP_5HX___000002_UB24DG,,,
Costco Wholesale UK Ltd,CO-1833-20,OPT,,Western International Park,Hayes Road,Hayes,,UB2 5XJ,Tel: 0208 571 8675, - ,,,No ratings yet Rate it yourself - /Services/opticians/LeaveReview/DefaultView.aspx?id=CO-1833-20,0,0,
Tolley & Partners,OP_5M6_3307__000002_SW147NX,OPT,399 Upper Richmond Road West,East Sheen,,London,,SW14 7NX,Tel: 0208 878 3415, - ,,,No ratings yet Rate it yourself - /Services/opticians/LeaveReview/DefaultView.aspx?id=OP_5M6_3307__000002_SW147NX,0,0,
Tesco Opticians,OLCO-19985HX__000002_UB25LN,OPT,Bulls Bridge Industrial Estate,Hayes Road,,Southall,,UB2 5LN,Tel: 0345 601 3479, - ,,,No ratings yet Rate it yourself - /Services/opticians/LeaveReview/DefaultView.aspx?id=OLCO-19985HX__000002_UB25LN,0,0,
Blink Optics,TP8HE,OPT,,327 Upper Richmond Road West,,London,,SW14 8QR,Tel: 02033271510, - ,,,3 ratings Rate it yourself - /Services/opticians/LeaveReview/DefaultView.aspx?id=TP8HE,,,
KALSI OPTICIANS,KT8 4QU__000001_KT64QU,OPT,24 Claremont Road,,,Surbiton,,KT6 4QU,Tel: 0208 399 9887, - ,,,No ratings yet Rate it yourself - /Services/opticians/LeaveReview/DefaultView.aspx?id=KT8 4QU__000001_KT64QU,0,0,
Hollands Opticians Surbiton,KT6 4JZ__000002_KT64JZ,OPT,24a,Victoria Road,,Surbiton,,KT6 4JZ,Tel: 0208 399 8104, - ,,,3 ratings Rate it yourself - /Services/opticians/LeaveReview/DefaultView.aspx?id=KT6 4JZ__000002_KT64JZ,,,
Opticall Ltd,685P2__000001_W52QP,OPT,7 Acantha Court,"1st Floor, 21 Victoria Road",Ealing,"Surbiton, Surrey",,KT6 4JZ,, - ,,,No ratings yet Rate it yourself - /Services/opticians/LeaveReview/DefaultView.aspx?id=685P2__000001_W52QP,0,0,
Boots-Surbiton,KT6 4NR__000001_KT66NR,OPT,2 Onslow House,67 Victoria Rd,,Surbiton,,KT6 4NR,Tel: 020 8390 9268, - ,,,No ratings yet Rate it yourself - /Services/opticians/LeaveReview/DefaultView.aspx?id=KT6 4NR__000001_KT66NR,0,0,
Specsavers Opticians,TP10G,OPT,,2 Surbiton Parade,,Surbiton,Surrey,KT6 4RB,Tel: 0208 339 8900, - ,,,No ratings yet Rate it yourself - /Services/opticians/LeaveReview/DefaultView.aspx?id=TP10G,0,0,
Specsavers Opticians,TP10G,OPT,,2 Surbiton Parade,,Surbiton,,KT6 4RB,, - ,,,No ratings yet Rate it yourself - /Services/opticians/LeaveReview/DefaultView.aspx?id=TP10G,0,0,
John  Wexler,OP_5HX_13862__000001_W54QP,OPT,151 South Ealing Road,Ealing,London,,,W5 4QP,Tel: 020 8567 7902, - ,,,No ratings yet Rate it yourself - /Services/opticians/LeaveReview/DefaultView.aspx?id=OP_5HX_13862__000001_W54QP,0,0,
Hynes Opticians,OP_5HX_12797__000001_W139RT,OPT,120 Northfield Avenue,Ealing,,london,,W13 9RT,Tel: 020 8579 3241, - ,,,2 ratings Rate it yourself - /Services/opticians/LeaveReview/DefaultView.aspx?id=OP_5HX_12797__000001_W139RT,,,
West London Home Eyecare Ltd,GOC-01-13193-01/08-W5 4JB,OPT,,18 Gloucester Road Ealing,,Ealing,Greater London,W5 4JB,Tel: 02085678707, - ,,,No ratings yet Rate it yourself - /Services/opticians/LeaveReview/DefaultView.aspx?id=GOC-01-13193-01/08-W5 4JB,0,0,
Norman Prince Opticians,V9S9S,OPT,Norman Prince Opticians,15 Church Parade,,Ashford,,TW15 2TX,Tel: 01784 252106, - ,,,1 rating Rate it yourself - /Services/opticians/LeaveReview/DefaultView.aspx?id=V9S9S,,,
Hanwell Eyecare Centre,OP_5HX_14066__000002_W71DR,OPT,20 Church Road,Hanwell,London,,,W7 1DR,Tel: 020 8840 8595, - ,,,No ratings yet Rate it yourself - /Services/opticians/LeaveReview/DefaultView.aspx?id=OP_5HX_14066__000002_W71DR,0,0,
Optical World,OP_5HX_11991__000001_UB11JR,OPT,11 The Broadway,Southall,Middlesex,,,UB1 1JR,Tel: 020 8893 5759, - ,,,No ratings yet Rate it yourself - /Services/opticians/LeaveReview/DefaultView.aspx?id=OP_5HX_11991__000001_UB11JR,0,0,
Ultimate Eye Care,OP_5HX_1706__000002_UB11JY,OPT,,49 The Broadway,,Southall,,UB1 1JY,Tel: 020 8574 4158, - ,,,No ratings yet Rate it yourself - /Services/opticians/LeaveReview/DefaultView.aspx?id=OP_5HX_1706__000002_UB11JY,0,0,
Specsavers Opticians,OP_5HX_3353__000001_W139BP,OPT,81 The Broadway,West Ealing,London,,,W13 9BP,Tel: 020 8840 8744, - ,,,No ratings yet Rate it yourself - /Services/opticians/LeaveReview/DefaultView.aspx?id=OP_5HX_3353__000001_W139BP,0,0,
Thomas H. Collison Ltd,OP_5L6_10052__000002_TW152UP,OPT,,17-19 Station Road,,Ashford,Middlesex,TW15 2UP,Tel: 01784 258 432, - ,,,No ratings yet Rate it yourself - /Services/opticians/LeaveReview/DefaultView.aspx?id=OP_5L6_10052__000002_TW152UP,0,0,
Keena Rakkado,OP_5HX_1621__000002_W130SR,OPT,18 The Broadway,West Ealing,,London,Greater London,W13 0SR,Tel: 020 8567 2320, - ,,,2 ratings Rate it yourself - /Services/opticians/LeaveReview/DefaultView.aspx?id=OP_5HX_1621__000002_W130SR,,,
Keena Rakkado,OP_SL39EA_34404,OPT,,18 The Broadway,,West Ealing,,W13 0SR,Tel: 0208 567 2320, - ,,,No ratings yet Rate it yourself - /Services/opticians/LeaveReview/DefaultView.aspx?id=OP_SL39EA_34404,0,0,
S L Choi,OP_5HX_13900__000001_W54NJ,OPT,164 Popes Lane,Ealing,London,,,W5 4NJ,Tel: 020 8840 2328, - ,,,No ratings yet Rate it yourself - /Services/opticians/LeaveReview/DefaultView.aspx?id=OP_5HX_13900__000001_W54NJ,0,0,
Eyeworks ,OP_5L6_14622__000001_KT122QP,OPT,1 Church Street,Walton-on-Thames,Surrey,Surrey,,KT12 2QP,Tel: 01932 244 266, - ,,,No ratings yet Rate it yourself - /Services/opticians/LeaveReview/DefaultView.aspx?id=OP_5L6_14622__000001_KT122QP,0,0,
Batemans (Opticians) Ltd,OP_5L6_5171__000001_KT122QS,OPT,,6 Church Street,,Walton-on-Thames,Surrey,KT12 2QS,Tel: 01932 221 524, - ,,,No ratings yet Rate it yourself - /Services/opticians/LeaveReview/DefaultView.aspx?id=OP_5L6_5171__000001_KT122QS,0,0,
Asda Opticians,OPT_SW153DT_4,OPT,,"31, ROEHAMPTON VALE",,LONDON,,SW15 3DT,, - ,,,No ratings yet Rate it yourself - /Services/opticians/LeaveReview/DefaultView.aspx?id=OPT_SW153DT_4,0,0,
Asda Opticians,OPT_SW153DT_2,OPT,,"31, ROEHAMPTON VALE",,LONDON,,SW15 3DT,, - ,,,No ratings yet Rate it yourself - /Services/opticians/LeaveReview/DefaultView.aspx?id=OPT_SW153DT_2,0,0,
Asda Opticians,OPT_SW153DT_3,OPT,,"31, ROEHAMPTON VALE",,LONDON,,SW15 3DT,Tel: 020 8780 4082, - ,,,No ratings yet Rate it yourself - /Services/opticians/LeaveReview/DefaultView.aspx?id=OPT_SW153DT_3,0,0,
Asda Opticians,OPT_SW153DT_1,OPT,,"31, ROEHAMPTON VALE",ROEHAMPTON,LONDON,,SW15 3DT,Tel: 00000 000000, - ,,,No ratings yet Rate it yourself - /Services/opticians/LeaveReview/DefaultView.aspx?id=OPT_SW153DT_1,0,0,
Asda Opticians,OPT_SW15 3DT,OPT,,"31, ROEHAMPTON VALE",,LONDON,,SW15 3DT,, - ,,,No ratings yet Rate it yourself - /Services/opticians/LeaveReview/DefaultView.aspx?id=OPT_SW15 3DT,0,0,
Boots Opticians,OPT_KT121DG_1,OPT,,25 High Street,,Walton-On-Thames,,KT12 1DG,, - ,,,No ratings yet Rate it yourself - /Services/opticians/LeaveReview/DefaultView.aspx?id=OPT_KT121DG_1,0,0,
Asda Opticians,OPT_UB3 4AZ,OPT,,Unit 3 Westlands Estate,,"Hayes, Middlesex",,UB3 4AZ,Tel: 0203 7701908, - ,,,No ratings yet Rate it yourself - /Services/opticians/LeaveReview/DefaultView.aspx?id=OPT_UB3 4AZ,0,0,
Boots Opticians,31/08/20171140,OPT,,49 Station Road,,Middlesex,,UB3 4BE,, - ,,,No ratings yet Rate it yourself - /Services/opticians/LeaveReview/DefaultView.aspx?id=31/08/20171140,0,0,
R. Stone Opticians,OP_5L6_4153__000001_KT121BY,OPT,52 High Street,,,Walton-on-Thames,,KT12 1BY,Tel: 01932 225 076, - ,,,No ratings yet Rate it yourself - /Services/opticians/LeaveReview/DefaultView.aspx?id=OP_5L6_4153__000001_KT121BY,0,0,
S H Harrold (1937) Ltd,OP_5AT_3078__000003_UB34DD,OPT,48 Station Road,Hayes,Middlesex,,,UB3 4DD,Tel: 0208 573 4400, - ,,,1 rating Rate it yourself - /Services/opticians/LeaveReview/DefaultView.aspx?id=OP_5AT_3078__000003_UB34DD,,,
VISION EXPRESS (UK) LTD,KT12 1GH__000001_KT121GH,OPT,Unit 31 Heart Shopping Centre,New Zealand Avenue,,Walton On Thames,Surrey,KT12 1GH,Tel: 01932 254270, - ,,,No ratings yet Rate it yourself - /Services/opticians/LeaveReview/DefaultView.aspx?id=KT12 1GH__000001_KT121GH,0,0,
Tesco Opticians,OPT_TW197PZ_1,OPT,,Town Lane,,"Stanwell, Staines",Surrey,TW19 7PZ,Tel: 0345 677 9018, - ,,,No ratings yet Rate it yourself - /Services/opticians/LeaveReview/DefaultView.aspx?id=OPT_TW197PZ_1,0,0,
FOCAL POINT,SW15 4DQ__000004_SW154DQ,OPT,45 Danesbury Avenue,,Roehampton,London,,SW15 4DQ,Tel: 0208 780 3288, - ,,,No ratings yet Rate it yourself - /Services/opticians/LeaveReview/DefaultView.aspx?id=SW15 4DQ__000004_SW154DQ,0,0,
Crockford Mills,OP_5AT_2104__000001_UB32HW,OPT,9 East Avenue,,Hayes,,,UB3 2HW,Tel: 0208 573 0822, - ,,,2 ratings Rate it yourself - /Services/opticians/LeaveReview/DefaultView.aspx?id=OP_5AT_2104__000001_UB32HW,,,
Mistry Opticians,OP_5A5_13282__000001_KT67AB,OPT,287 Ewell Road,Surbiton,,Surrey,,KT6 7AB,Tel: 020 8399 4491, - ,,,1 rating Rate it yourself - /Services/opticians/LeaveReview/DefaultView.aspx?id=OP_5A5_13282__000001_KT67AB,,,
Specsavers Opticians,OP 5AT 6653__000001_UB32AB,OPT,"Unit 01, 5-19 Botwell Lane",,Hayes,Middlesex,,UB3 2AB,Tel: 0208 756 4980, - ,,,No ratings yet Rate it yourself - /Services/opticians/LeaveReview/DefaultView.aspx?id=OP 5AT 6653__000001_UB32AB,0,0,
Haig Brown Opticians,OP_5KP_1837__000001_KT109PJ,OPT,Fairoak,Portsmouth Road,Esher,,,KT10 9PJ,Tel: 01372 466 762, - ,,,1 rating Rate it yourself - /Services/opticians/LeaveReview/DefaultView.aspx?id=OP_5KP_1837__000001_KT109PJ,,,
Barnes Nineteen,TP8YQ,OPT,,19 Barnes High Street,,London,,SW13 9LW,Tel: 020 3490 8560, - ,,,2 ratings Rate it yourself - /Services/opticians/LeaveReview/DefaultView.aspx?id=TP8YQ,,,no
I See 3 Limited,J2J4T,OPT,,444 Chiswick High Road,,London,,W4 5TT,Tel: 0208 995 0544, - ,,,No ratings yet Rate it yourself - /Services/opticians/LeaveReview/DefaultView.aspx?id=J2J4T,0,0,
Ian Squire Optician,OP_5L6_3873__000001_TW178AR,OPT,11 Station Approach,,Shepperton,,,TW17 8AR,Tel: 01932 226 789, - ,,,No ratings yet Rate it yourself - /Services/opticians/LeaveReview/DefaultView.aspx?id=OP_5L6_3873__000001_TW178AR,0,0,
The Eye Zone,L2D5V,OPT,25 New Broadway,Ealing,London,London,,W5 5AW,Tel: 020 8567 2020, - ,,,No ratings yet Rate it yourself - /Services/opticians/LeaveReview/DefaultView.aspx?id=L2D5V,0,0,