Organisation Name,NACS Code,Organisation Type,Address1,Address2,Address3,Address4,Address5,PostCode,Telephone Number,Opening time,Value  (Opening time),Banding Classification  (Opening time),NHS.UK users rating,Value  (NHS.UK users rating),Banding Classification  (NHS.UK users rating),Car parking (Is there car parking at this organisation?)
McAteers Opticians,OP_5L6_14623__000001_TW179AW,OPT,6 The High Street,,Shepperton,,,TW17 9AW,Tel: 01932 230 303, - ,,,No ratings yet Rate it yourself - /Services/opticians/LeaveReview/DefaultView.aspx?id=OP_5L6_14623__000001_TW179AW,0,0,
Ian Squire Optician,OP_5L6_3873__000001_TW178AR,OPT,11 Station Approach,,Shepperton,,,TW17 8AR,Tel: 01932 226 789, - ,,,No ratings yet Rate it yourself - /Services/opticians/LeaveReview/DefaultView.aspx?id=OP_5L6_3873__000001_TW178AR,0,0,
Eyeworks ,OP_5L6_14622__000001_KT122QP,OPT,1 Church Street,Walton-on-Thames,Surrey,Surrey,,KT12 2QP,Tel: 01932 244 266, - ,,,No ratings yet Rate it yourself - /Services/opticians/LeaveReview/DefaultView.aspx?id=OP_5L6_14622__000001_KT122QP,0,0,
Batemans (Opticians) Ltd,OP_5L6_5171__000001_KT122QS,OPT,,6 Church Street,,Walton-on-Thames,Surrey,KT12 2QS,Tel: 01932 221 524, - ,,,No ratings yet Rate it yourself - /Services/opticians/LeaveReview/DefaultView.aspx?id=OP_5L6_5171__000001_KT122QS,0,0,
VISION EXPRESS (UK) LTD,KT12 1GH__000001_KT121GH,OPT,Unit 31 Heart Shopping Centre,New Zealand Avenue,,Walton On Thames,Surrey,KT12 1GH,Tel: 01932 254270, - ,,,No ratings yet Rate it yourself - /Services/opticians/LeaveReview/DefaultView.aspx?id=KT12 1GH__000001_KT121GH,0,0,
Boots Opticians,OPT_KT121DG_1,OPT,,25 High Street,,Walton-On-Thames,,KT12 1DG,, - ,,,No ratings yet Rate it yourself - /Services/opticians/LeaveReview/DefaultView.aspx?id=OPT_KT121DG_1,0,0,
R. Stone Opticians,OP_5L6_4153__000001_KT121BY,OPT,52 High Street,,,Walton-on-Thames,,KT12 1BY,Tel: 01932 225 076, - ,,,No ratings yet Rate it yourself - /Services/opticians/LeaveReview/DefaultView.aspx?id=OP_5L6_4153__000001_KT121BY,0,0,
Boots-Weybridge - High St,OP_5L6_5995__000002_KT138AX,OPT,23 High Street,,,Weybridge,Surrey,KT13 8AX,Tel: 01932 842725, - ,,,No ratings yet Rate it yourself - /Services/opticians/LeaveReview/DefaultView.aspx?id=OP_5L6_5995__000002_KT138AX,0,0,
Henning & Henning Opticians,OP_5L6_9057__000001_KT138DX,OPT,14 Church Street,,Weybridge,,,KT13 8DX,Tel: 01932 829 868, - ,,,No ratings yet Rate it yourself - /Services/opticians/LeaveReview/DefaultView.aspx?id=OP_5L6_9057__000001_KT138DX,0,0,
Eyesite Opticians,OP_5L6_9625__000001_KT138DL,OPT,,60 Church Street,,Weybridge,Surrey,KT13 8DL,Tel: 01932 859 889, - ,,,No ratings yet Rate it yourself - /Services/opticians/LeaveReview/DefaultView.aspx?id=OP_5L6_9625__000001_KT138DL,0,0,
Eye Noor Limited,OPT_KT139UQ_1,OPT,,Weybridge Eye Clinic  83 Queens Road,,Weybridge,,KT13 9UQ,, - ,,,No ratings yet Rate it yourself - /Services/opticians/LeaveReview/DefaultView.aspx?id=OPT_KT139UQ_1,0,0,
Tesco Opticians,TW167BB060716,OPT,,Escot Road,,Sunbury-on-Thames,,TW16 7BB,Tel: 0845 601 3479, - ,,,No ratings yet Rate it yourself - /Services/opticians/LeaveReview/DefaultView.aspx?id=TW167BB060716,0,0,
The Avenue Optical,OP_5L6_11988__000002_TW165HS,OPT,9 Avenue Parade,The Avenue,,Sunbury-on-Thames,Surrey,TW16 5HS,Tel: 01932 770 977, - ,,,No ratings yet Rate it yourself - /Services/opticians/LeaveReview/DefaultView.aspx?id=OP_5L6_11988__000002_TW165HS,0,0,
Thomas H. Collison Ltd,OP_5L6_4986__000002_TW167AB,OPT,11 The Parade,Staines Road West,,Sunbury-on-Thames,Surrey,TW16 7AB,Tel: 01932 782 318, - ,,,No ratings yet Rate it yourself - /Services/opticians/LeaveReview/DefaultView.aspx?id=OP_5L6_4986__000002_TW167AB,0,0,
Tesco Opticians ,KT152AS060716,OPT,,117 Station Road,,Addlestone,Surrey,KT15 2AS,Tel: 0345 601 3479, - ,,,No ratings yet Rate it yourself - /Services/opticians/LeaveReview/DefaultView.aspx?id=KT152AS060716,0,0,
T H Collison Ltd,OP_5L6_2450__000003_KT169AL,OPT,,133 Guildford Street,,Chertsey,Surrey,KT16 9AL,Tel: 01932 563 076, - ,,,1 rating Rate it yourself - /Services/opticians/LeaveReview/DefaultView.aspx?id=OP_5L6_2450__000003_KT169AL,,,
 Thomas H. Collison Ltd,OP_5L6_5042__000002_KT169AL,OPT,119c Guildford Street,,Chertsey,Chertsey,,KT16 9AL,Tel: 01932 571832, - ,,,No ratings yet Rate it yourself - /Services/opticians/LeaveReview/DefaultView.aspx?id=OP_5L6_5042__000002_KT169AL,0,0,
Addlestone Specsavers Limited,T4J9A,OPT,,84 Station Road,Addlestone,Surrey,,KT15 2AD,Tel: 01932505027, - ,,,No ratings yet Rate it yourself - /Services/opticians/LeaveReview/DefaultView.aspx?id=T4J9A,0,0,
Leightons Opticians & Hearing Care,OP_5L6_11775__000002_KT152AF,OPT,,76 Station Road,,Addlestone,Surrey,KT15 2AF,Tel: 01932 853 199, - ,,,No ratings yet Rate it yourself - /Services/opticians/LeaveReview/DefaultView.aspx?id=OP_5L6_11775__000002_KT152AF,0,0,
Boots Opticians,TP97E,OPT,,2 The Lane,,Addlestone,,KT15 2GN,, - ,,,1 rating Rate it yourself - /Services/opticians/LeaveReview/DefaultView.aspx?id=TP97E,,,
Norman Prince Opticians,V9S9S,OPT,Norman Prince Opticians,15 Church Parade,,Ashford,,TW15 2TX,Tel: 01784 252106, - ,,,1 rating Rate it yourself - /Services/opticians/LeaveReview/DefaultView.aspx?id=V9S9S,,,
Thomas H. Collison Ltd,OP_5L6_10052__000002_TW152UP,OPT,,17-19 Station Road,,Ashford,Middlesex,TW15 2UP,Tel: 01784 258 432, - ,,,No ratings yet Rate it yourself - /Services/opticians/LeaveReview/DefaultView.aspx?id=OP_5L6_10052__000002_TW152UP,0,0,
Graham Johnson,OP_5L6_7561__000003_KT124HL,OPT,6 Hersham Centre,Hersham Green,,Hersham,Surrey,KT12 4HL,Tel: 01932 231 470, - ,,,No ratings yet Rate it yourself - /Services/opticians/LeaveReview/DefaultView.aspx?id=OP_5L6_7561__000003_KT124HL,0,0,yes
Tesco Opticians,OPT_TW197PZ_1,OPT,,Town Lane,,"Stanwell, Staines",Surrey,TW19 7PZ,Tel: 0345 677 9018, - ,,,No ratings yet Rate it yourself - /Services/opticians/LeaveReview/DefaultView.aspx?id=OPT_TW197PZ_1,0,0,
Bayfields Opticians and Audiologists (Staines),I9X7K,OPT,,Unit 3,The Elmsleigh Centre,Staines,Surrey,TW18 4QB,Tel: 0178 444 9992, - ,,,No ratings yet Rate it yourself - /Services/opticians/LeaveReview/DefaultView.aspx?id=I9X7K,0,0,
VISION EXPRESS ,I8V0C,OPT,Unit 5,Elmsleigh  Centre,,Staines,Surrey,TW18 4QB,Tel: 01784 469 109, - ,,,No ratings yet Rate it yourself - /Services/opticians/LeaveReview/DefaultView.aspx?id=I8V0C,0,0,
Specsavers Opticians,OP_5L6_10293__000001_TW184DS,OPT,Unit 5ud,Two Rivers,Staines,Middlesex,,TW18 4UP,Tel: 01784 493 355, - ,,,No ratings yet Rate it yourself - /Services/opticians/LeaveReview/DefaultView.aspx?id=OP_5L6_10293__000001_TW184DS,0,0,
TESCO OPTICANS,KT13 0XF__000003_KT130XF,OPT,,Barnes Wallace Drive,,Weybridge,Surrey,KT13 0XF,Tel: 0345 601 3479, - ,,,No ratings yet Rate it yourself - /Services/opticians/LeaveReview/DefaultView.aspx?id=KT13 0XF__000003_KT130XF,0,0,
Priory Opticians,OP_5M6_13284__000001_TW122NS,OPT,37 Priory Road,Hampton,,Middlesex,,TW12 2NS,Tel: 0208 979 0203, - ,,,2 ratings Rate it yourself - /Services/opticians/LeaveReview/DefaultView.aspx?id=OP_5M6_13284__000001_TW122NS,,,
Ronald Brown Opticians,OP_5HY_12588__000002_TW134BU,OPT,14 Wilton Parade,High Street,,Feltham,Middlesex,TW13 4BU,Tel: 020 8890 6546, - ,,,No ratings yet Rate it yourself - /Services/opticians/LeaveReview/DefaultView.aspx?id=OP_5HY_12588__000002_TW134BU,0,0,
Boots-Staines - Two Rivers Centre,OP_5L6_3819__000001_TW184DR,OPT,"Unit S3, Two Rivers Retail Park",,,Staines,Middlesex,TW18 4WB,Tel: 01784 455437, - ,,,1 rating Rate it yourself - /Services/opticians/LeaveReview/DefaultView.aspx?id=OP_5L6_3819__000001_TW184DR,,,
Specsavers Opticians,OP_5HY_13898__000002_TW134BS,OPT,152 The Centre,Feltham,Middlesex,,,TW13 4BS,Tel: 020 8844 4880, - ,,,1 rating Rate it yourself - /Services/opticians/LeaveReview/DefaultView.aspx?id=OP_5HY_13898__000002_TW134BS,,,
Feltham Eyecare Centre,TP4TN,OPT,,92 Bedfont Lane,Feltham,London,,TW14 9BP,Tel: 020 88670406, - ,,,No ratings yet Rate it yourself - /Services/opticians/LeaveReview/DefaultView.aspx?id=TP4TN,0,0,
Bailey Opticians,OP_5HY_5005__000002_TW148BN,OPT,503 Staines Road,Bedfont,Middlesex,,,TW14 8BN,Tel: 020 8890 4918, - ,,,No ratings yet Rate it yourself - /Services/opticians/LeaveReview/DefaultView.aspx?id=OP_5HY_5005__000002_TW148BN,0,0,
Thomas H. Collison Ltd,OP_5KP_11291__000001_KT80DT,OPT,Kent House,Walton Road,,East Molesey,Surrey,KT8 0DT,Tel: 0208 979 6751, - ,,,No ratings yet Rate it yourself - /Services/opticians/LeaveReview/DefaultView.aspx?id=OP_5KP_11291__000001_KT80DT,0,0,
Esher Eye Centre,OP_5KP_14521__000001_KT109QJ,OPT,122 High Street,,Esher,,,KT10 9QJ,Tel: 01372 464492, - ,,,No ratings yet Rate it yourself - /Services/opticians/LeaveReview/DefaultView.aspx?id=OP_5KP_14521__000001_KT109QJ,0,0,
Specsavers,OP_5L6_14625__000001_KT101BY,OPT,22 High Street,22 High Street,Walton-on-Thames,Surrey,,KT10 1DA,Tel: 01932 251 960, - ,,,No ratings yet Rate it yourself - /Services/opticians/LeaveReview/DefaultView.aspx?id=OP_5L6_14625__000001_KT101BY,0,0,
Visioncare,OP_5KP_849__000002_KT109RL,OPT,,17 High Street,,Esher,Surrey,KT10 9RL,Tel: 01372 462 401, - ,,,No ratings yet Rate it yourself - /Services/opticians/LeaveReview/DefaultView.aspx?id=OP_5KP_849__000002_KT109RL,0,0,
Haig Brown Opticians,OP_5KP_1837__000001_KT109PJ,OPT,Fairoak,Portsmouth Road,Esher,,,KT10 9PJ,Tel: 01372 466 762, - ,,,1 rating Rate it yourself - /Services/opticians/LeaveReview/DefaultView.aspx?id=OP_5KP_1837__000001_KT109PJ,,,
Specsavers,OPT_TW121AW_1,OPT,,J Sainsbury,303 Uxbridge Road,Hampton Hill,,TW12 1AW,Tel: 0208 9410852, - ,,,No ratings yet Rate it yourself - /Services/opticians/LeaveReview/DefaultView.aspx?id=OPT_TW121AW_1,0,0,
JOHN ROSE EYE CARE,KT11 1BQ__000001_KT111BQ,OPT,,1 Eden Street,,Kingston,Surrey,KT11 1BQ,Tel: 0208 546 9292, - ,,,1 rating Rate it yourself - /Services/opticians/LeaveReview/DefaultView.aspx?id=KT11 1BQ__000001_KT111BQ,,,
T H Collison Ltd,OP_5L7_6600__000002_KT146NG,OPT,,15 Old Woking Road,,West Byfleet,Surrey,KT14 6LW,Tel: 01932 342 457, - ,,,No ratings yet Rate it yourself - /Services/opticians/LeaveReview/DefaultView.aspx?id=OP_5L7_6600__000002_KT146NG,0,0,
Batemans (opticians),OP_5L7_11137__000001_KT146LF,OPT,,57 Old Woking Road,,West Byfleet,Surrey,KT14 6LF,Tel: 01932 343 732, - ,,,No ratings yet Rate it yourself - /Services/opticians/LeaveReview/DefaultView.aspx?id=OP_5L7_11137__000001_KT146LF,0,0,
Specsavers Egham,TP71E,OPT,,29 The Precinct,,Egham,,TW20 9HN,Tel: 01784 220580, - ,,,No ratings yet Rate it yourself - /Services/opticians/LeaveReview/DefaultView.aspx?id=TP71E,0,0,
Robinson and Lamb Opticians,TP9JP ,OPT,,7 The Precinct,,Egham,,TW20 9HN,, - ,,,No ratings yet Rate it yourself - /Services/opticians/LeaveReview/DefaultView.aspx?id=TP9JP,0,0,
David Clulow Opticians,KT11 2LR__000002_KT112LR,OPT,21 Oakdene Parade,,Cobham,Surrey,,KT11 2LR,Tel: 01932 590415, - ,,,No ratings yet Rate it yourself - /Services/opticians/LeaveReview/DefaultView.aspx?id=KT11 2LR__000002_KT112LR,0,0,
The Optical Co. ,TP9G6,OPT,,3 High Street,,Cobham,Surrey,KT11 3DH,Tel: 01932 867565, - ,,,No ratings yet Rate it yourself - /Services/opticians/LeaveReview/DefaultView.aspx?id=TP9G6,0,0,
Leightons Opticians & Hearing Care,OP_5KP_3130__000001_KT112LR,OPT,,Unit 5,1-7 Holly Parade,Cobham,Surrey,KT11 3EB,Tel: 01932 867 890, - ,,,No ratings yet Rate it yourself - /Services/opticians/LeaveReview/DefaultView.aspx?id=OP_5KP_3130__000001_KT112LR,0,0,
The Optical Studio,OPT_GU254DW_1,OPT,,13 Station Approach,,Virginia Water,,GU25 4DW,Tel: 01344 849077, - ,,,No ratings yet Rate it yourself - /Services/opticians/LeaveReview/DefaultView.aspx?id=OPT_GU254DW_1,0,0,
NORMAN PRINCE & PARTNERS,TW11 8UD__000001_TW118UD,OPT,176 Stanley Road,,,Teddington,,TW11 8UD,Tel: 0208 977 1180, - ,,,No ratings yet Rate it yourself - /Services/opticians/LeaveReview/DefaultView.aspx?id=TW11 8UD__000001_TW118UD,0,0,
David Wilson Optometrists,OPT_TW118QZ_3,OPT,,7 Broad Street,,Teddington,Middlesex,TW11 8QZ,Tel: 020 8977 7499, - ,,,No ratings yet Rate it yourself - /Services/opticians/LeaveReview/DefaultView.aspx?id=OPT_TW118QZ_3,0,0,
Optomansi 2 Ltd,D5N7B,OPT,,73 Montrose Avenue,,Twickenham,,TW2 6HG,Tel: 0207 229 8399, - ,,,No ratings yet Rate it yourself - /Services/opticians/LeaveReview/DefaultView.aspx?id=D5N7B,0,0,
Boots-Teddington,OP_TW118QZ_46632,OPT,,Unit 2B,61 Broad Street,Teddington,Middlesex,TW11 8QZ,Tel: 0208 973 1635, - ,,,No ratings yet Rate it yourself - /Services/opticians/LeaveReview/DefaultView.aspx?id=OP_TW118QZ_46632,0,0,
Sims Opticians,OP_5M6_3062__000001_TW110HE,OPT,4 The Causeway,,,Teddington,,TW11 0HE,Tel: 0208 977 1039, - ,,,No ratings yet Rate it yourself - /Services/opticians/LeaveReview/DefaultView.aspx?id=OP_5M6_3062__000001_TW110HE,0,0,
U. Patel Optometrist,OP_5M6_11526__000002_TW26HT,OPT,135 Percy Road,Whitton,,Twickenham,,TW2 6HT,Tel: 0208 893 8041, - ,,,No ratings yet Rate it yourself - /Services/opticians/LeaveReview/DefaultView.aspx?id=OP_5M6_11526__000002_TW26HT,0,0,
Eye Smile Ltd,GOC: 0116240,OPT,,120 – 122 High Street,,Whitton,Middlesex,TW2 7LL,Tel: 0208 755 7900, - ,,,No ratings yet Rate it yourself - /Services/opticians/LeaveReview/DefaultView.aspx?id=GOC: 0116240,0,0,yes
Geoffrey Waterhouse Optometrists,OP_5M6_13286__000001_TW27LD,OPT,79 High Street,Whitton,,Twickenham,,TW2 7LD,Tel: 0208 894 7080, - ,,,No ratings yet Rate it yourself - /Services/opticians/LeaveReview/DefaultView.aspx?id=OP_5M6_13286__000001_TW27LD,0,0,
Realeyes - The Eye Clinic,OPT_TW27LT_1,OPT,,54-56 High Street,,Whitton,,TW2 7LT,Tel: 020 3906 8555, - ,,,2 ratings Rate it yourself - /Services/opticians/LeaveReview/DefaultView.aspx?id=OPT_TW27LT_1,,,
Asda Opticians,OPT_GU21 5SE,OPT,,Forsyth Road,,Sheerwater,,GU21 5SE,Tel: 01483220 955, - ,,,No ratings yet Rate it yourself - /Services/opticians/LeaveReview/DefaultView.aspx?id=OPT_GU21 5SE,0,0,
Asda Stores Ltd,OPT_GU215SE_1,OPT,Asda Opticians,Forsyth Road,,"Sheerwater, Woking",Surrey,GU21 5SE,Tel: 01483 702700, - ,,,No ratings yet Rate it yourself - /Services/opticians/LeaveReview/DefaultView.aspx?id=OPT_GU215SE_1,0,0,
Englefield Green Opticians,OP_TW200QX_34400,OPT,,44 Victoria Street,,Engelfield Green,,TW20 0QX,Tel: 01784 432818, - ,,,No ratings yet Rate it yourself - /Services/opticians/LeaveReview/DefaultView.aspx?id=OP_TW200QX_34400,0,0,
Loptics,OP_5HY_8816__000002_TW47HT,OPT,376 Bath Road,Hounslow,Middlesex,,,TW4 7HT,Tel: 020 8570 3604, - ,,,No ratings yet Rate it yourself - /Services/opticians/LeaveReview/DefaultView.aspx?id=OP_5HY_8816__000002_TW47HT,0,0,
Cranford Opticians,OP_5HY_13896__000002_TW59TY,OPT,742 Bath Road,Cranford,,Hounslow,Middlesex,TW5 9TY,Tel: 020 8759 9395, - ,,,27 ratings Rate it yourself - /Services/opticians/LeaveReview/DefaultView.aspx?id=OP_5HY_13896__000002_TW59TY,,,Data not available
Robert Frith Ophthalmic Opticians,OP_5M6_369__000002_TW14BW,OPT,,104 Heath Road,,Twickenham,,TW1 4BW,Tel: 0208 892 1682, - ,,,3 ratings Rate it yourself - /Services/opticians/LeaveReview/DefaultView.aspx?id=OP_5M6_369__000002_TW14BW,,,
Hollands Opticians Surbiton,KT6 4JZ__000002_KT64JZ,OPT,24a,Victoria Road,,Surbiton,,KT6 4JZ,Tel: 0208 399 8104, - ,,,3 ratings Rate it yourself - /Services/opticians/LeaveReview/DefaultView.aspx?id=KT6 4JZ__000002_KT64JZ,,,
Opticall Ltd,685P2__000001_W52QP,OPT,7 Acantha Court,"1st Floor, 21 Victoria Road",Ealing,"Surbiton, Surrey",,KT6 4JZ,, - ,,,No ratings yet Rate it yourself - /Services/opticians/LeaveReview/DefaultView.aspx?id=685P2__000001_W52QP,0,0,
Treaty Eye Centre,OP_5HY_7224__000001_TW31ES,OPT,41 Treaty Centre,High Street,Hounslow,,,TW3 1ES,Tel: 020 8572 2011, - ,,,No ratings yet Rate it yourself - /Services/opticians/LeaveReview/DefaultView.aspx?id=OP_5HY_7224__000001_TW31ES,0,0,
Boots-Surbiton,KT6 4NR__000001_KT66NR,OPT,2 Onslow House,67 Victoria Rd,,Surbiton,,KT6 4NR,Tel: 020 8390 9268, - ,,,No ratings yet Rate it yourself - /Services/opticians/LeaveReview/DefaultView.aspx?id=KT6 4NR__000001_KT66NR,0,0,
Boots Opticians,310820171134,OPT,,17 King Street,,Twickenham,,TW1 3SD,, - ,,,No ratings yet Rate it yourself - /Services/opticians/LeaveReview/DefaultView.aspx?id=310820171134,0,0,
The Optical Gallery,OP_5M6_496__000001_TW13SN,OPT,,16 King Street,,Twickenham,Middlesex,TW1 3SN,Tel: 0208 892 2800, - ,,,No ratings yet Rate it yourself - /Services/opticians/LeaveReview/DefaultView.aspx?id=OP_5M6_496__000001_TW13SN,0,0,
The Optical Shop,OP_5HY_139__000001_TW31HL,OPT,186 High Street,Hounslow,Middlesex,,,TW3 1HL,Tel: 020 8570 2585, - ,,,No ratings yet Rate it yourself - /Services/opticians/LeaveReview/DefaultView.aspx?id=OP_5HY_139__000001_TW31HL,0,0,
Boots-Hounslow - High St (in Boots UK),OP_5HY_10999__000002_TW31BL,OPT,193-199 High Street,,,Hounslow,,TW3 1BL,Tel: 0208 577 5038, - ,,,4 ratings Rate it yourself - /Services/opticians/LeaveReview/DefaultView.aspx?id=OP_5HY_10999__000002_TW31BL,,,
Vision Express,OP_5HY_9094__000003_TW31BL,OPT,177 High Street,Hounslow,Middlesex,,,TW3 1BL,Tel: 020 8569 4589, - ,,,No ratings yet Rate it yourself - /Services/opticians/LeaveReview/DefaultView.aspx?id=OP_5HY_9094__000003_TW31BL,0,0,
KALSI OPTICIANS,KT8 4QU__000001_KT64QU,OPT,24 Claremont Road,,,Surbiton,,KT6 4QU,Tel: 0208 399 9887, - ,,,No ratings yet Rate it yourself - /Services/opticians/LeaveReview/DefaultView.aspx?id=KT8 4QU__000001_KT64QU,0,0,
Boots-Kingston - Union St,KT1 1RP__000005_KT11RP,OPT,42 Union Street,,,Kingston Upon Thames,Surrey,KT1 1RP,Tel: 0208 5411560, - ,,,1 rating Rate it yourself - /Services/opticians/LeaveReview/DefaultView.aspx?id=KT1 1RP__000005_KT11RP,,,
Specsavers Opticians,TP10G,OPT,,2 Surbiton Parade,,Surbiton,,KT6 4RB,, - ,,,No ratings yet Rate it yourself - /Services/opticians/LeaveReview/DefaultView.aspx?id=TP10G,0,0,
Specsavers Opticians,TP10G,OPT,,2 Surbiton Parade,,Surbiton,Surrey,KT6 4RB,Tel: 0208 339 8900, - ,,,No ratings yet Rate it yourself - /Services/opticians/LeaveReview/DefaultView.aspx?id=TP10G,0,0,
DOLLAND & AITCHISON,KT1 1RJ__000001_KT11RJ,OPT,10 Church Street,,,Kingston,,KT1 1RJ,Tel: 0208 546 3416, - ,,,No ratings yet Rate it yourself - /Services/opticians/LeaveReview/DefaultView.aspx?id=KT1 1RJ__000001_KT11RJ,0,0,
Specsavers,TP20H,OPT,,16-18 London Road,,Twickenham,,TW1 3RR,Tel: 0208 83175 20, - ,,,No ratings yet Rate it yourself - /Services/opticians/LeaveReview/DefaultView.aspx?id=TP20H,0,0,
Vision Express ,OP_5A5_6670__000002_KT11TR,OPT,Bentalls Shopping Centre,Wood Street,,Kingston-upon-Thames,,KT1 1TR,Tel: 020 8549 8010, - ,,,No ratings yet Rate it yourself - /Services/opticians/LeaveReview/DefaultView.aspx?id=OP_5A5_6670__000002_KT11TR,0,0,
The Eyewearshop Ltd T/A The Opticians,CO-3962-08082014-TW31LR,OPT,,134 High Street,,Hounslow,,TW3 1LR,, - ,,,No ratings yet Rate it yourself - /Services/opticians/LeaveReview/DefaultView.aspx?id=CO-3962-08082014-TW31LR,0,0,
Specsavers Opticians,OP_5HY_373__000001_TW31LR,OPT,152 High Street,,Hounslow,,,TW3 1LR,Tel: 020 8577 9234, - ,,,No ratings yet Rate it yourself - /Services/opticians/LeaveReview/DefaultView.aspx?id=OP_5HY_373__000001_TW31LR,0,0,
Dollond & Aitchison,OP_5HY_5403__000001_TW31NA,OPT,134 High Street,Hounslow,Middlesex,,,TW3 1NA,Tel: 020 8570 9955, - ,,,No ratings yet Rate it yourself - /Services/opticians/LeaveReview/DefaultView.aspx?id=OP_5HY_5403__000001_TW31NA,0,0,
Optical Express,,OPT,,93-95 Bedford Street,,Kingston Upon Thames,,KT1 1SZ,, - ,,,N/A - Data not available,,,
Optical Express,KT1 1NP__000001_KT11NP,OPT,3rd Floor,14-18 Fife Road,,Kingston,Surrey,KT1 1SZ,Tel: 0800 023 2020, - ,,,No ratings yet Rate it yourself - /Services/opticians/LeaveReview/DefaultView.aspx?id=KT1 1NP__000001_KT11NP,0,0,
Specsavers Opticians,OP_5A5_106__000001_KT11MP,OPT,56 - 58 Clarence Street,,,Kingston-upon-Thames,,KT1 1NP,Tel: 020 8974 6677, - ,,,No ratings yet Rate it yourself - /Services/opticians/LeaveReview/DefaultView.aspx?id=OP_5A5_106__000001_KT11MP,0,0,
HORROCKS & BOYD,KT1 1SF__000001_KT11SF,OPT,,39 Fife Raod,,Kingston Upon Thames,Surrey,KT1 1SF,Tel: 0208 546 2481, - ,,,No ratings yet Rate it yourself - /Services/opticians/LeaveReview/DefaultView.aspx?id=KT1 1SF__000001_KT11SF,0,0,no
The Optical Gallery (Chessington),OP_5A5_5843__000001_KT91NU,OPT,340 Hook Road,Chessington,,Surrey,,KT9 1NU,Tel: 0208 391 0900, - ,,,No ratings yet Rate it yourself - /Services/opticians/LeaveReview/DefaultView.aspx?id=OP_5A5_5843__000001_KT91NU,0,0,
Eyecare Opticians,OP_5L7_14628__000002_GU211TB,OPT,307 Richmond Road,,Kingston-Upon-Thames,Surrey,,KT2 5QU,Tel: 0208 549 0331, - ,,,No ratings yet Rate it yourself - /Services/opticians/LeaveReview/DefaultView.aspx?id=OP_5L7_14628__000002_GU211TB,0,0,
B W Martin,OP_5HY_13895__000001_TW59JB,OPT,15 Fairmead Close,Heston,Middlesex,,,TW5 9JB,Tel: 020 8579 7607, - ,,,No ratings yet Rate it yourself - /Services/opticians/LeaveReview/DefaultView.aspx?id=OP_5HY_13895__000001_TW59JB,0,0,
Eyecare Heston Ltd.,TP4R2,OPT,329 Vicarage Farm Road,Heston,Middlesex,London,,TW5 0DR,Tel: 020 8569 6520, - ,,,1 rating Rate it yourself - /Services/opticians/LeaveReview/DefaultView.aspx?id=TP4R2,,,
Mistry Opticians,OP_5A5_13282__000001_KT67AB,OPT,287 Ewell Road,Surbiton,,Surrey,,KT6 7AB,Tel: 020 8399 4491, - ,,,1 rating Rate it yourself - /Services/opticians/LeaveReview/DefaultView.aspx?id=OP_5A5_13282__000001_KT67AB,,,
Thomas H. Collison Ltd,OP_5A5_11523__000001_KT67BA,OPT,372 Ewell Road,Tolworth,,Surrey,,KT6 7BA,Tel: 020 8399 0700, - ,,,1 rating Rate it yourself - /Services/opticians/LeaveReview/DefaultView.aspx?id=OP_5A5_11523__000001_KT67BA,,,
Dollond & Aitchison,OP_5L7_3550__000001_GU211XX,OPT,35 Wolsey Walk,,Woking,,,GU21 6YH,Tel: 01483 761 495, - ,,,No ratings yet Rate it yourself - /Services/opticians/LeaveReview/DefaultView.aspx?id=OP_5L7_3550__000001_GU211XX,0,0,
Bayfields Opticians,OP_5L7_9872__000001_GU211XU,OPT,,35 Commercial Way,,Woking,,GU21 6XR,Tel: 01483 766 800, - ,,,No ratings yet Rate it yourself - /Services/opticians/LeaveReview/DefaultView.aspx?id=OP_5L7_9872__000001_GU211XU,0,0,
Costco Wholesale UK Ltd,CO-1833-20,OPT,,Western International Park,Hayes Road,Hayes,,UB2 5XJ,Tel: 0208 571 8675, - ,,,No ratings yet Rate it yourself - /Services/opticians/LeaveReview/DefaultView.aspx?id=CO-1833-20,0,0,
Specsavers Opticians,OP_5L7_375__000001_GU211XS,OPT,,17-19 Wolsey Walk,Wolsey Place Shopping Centre,Woking,Surrey,GU21 6XU,Tel: 01483 767 170, - ,,,No ratings yet Rate it yourself - /Services/opticians/LeaveReview/DefaultView.aspx?id=OP_5L7_375__000001_GU211XS,0,0,
Boots Opticians Woking ,OP_5L7_6031__000002_GU211YA,OPT,1-9 Commercial Way,"10 Wolsey Walk, Wolsey Place Shopping Centre",,Woking,Surrey,GU21 6XU,Tel: 01483 761640, - ,,,1 rating Rate it yourself - /Services/opticians/LeaveReview/DefaultView.aspx?id=OP_5L7_6031__000002_GU211YA,,,
The Eye Store,OP_5M6_14592__000001_TW12SG,OPT,51 King Street,Twickenham,,Surrey,,TW1 2SG,Tel: 0208 891 2020, - ,,,No ratings yet Rate it yourself - /Services/opticians/LeaveReview/DefaultView.aspx?id=OP_5M6_14592__000001_TW12SG,0,0,
The Eye Galleria,OLCO30725M6__000002_TW12DX,OPT,The Eye Galleria Opticians,362 Richmond Road,,East Twickenham,Middlesex,TW1 2DX,Tel: 020 8891 6661, - ,,,No ratings yet Rate it yourself - /Services/opticians/LeaveReview/DefaultView.aspx?id=OLCO30725M6__000002_TW12DX,0,0,
Anthony Opticians,OP_5A5_7931__000001_KT67HR,OPT,84 The Broadway,Tolworth,,Surrey,,KT6 7HR,Tel: 0208 390 5219, - ,,,No ratings yet Rate it yourself - /Services/opticians/LeaveReview/DefaultView.aspx?id=OP_5A5_7931__000001_KT67HR,0,0,
Tesco Opticians,OLCO-19985HX__000002_UB25LN,OPT,Bulls Bridge Industrial Estate,Hayes Road,,Southall,,UB2 5LN,Tel: 0345 601 3479, - ,,,No ratings yet Rate it yourself - /Services/opticians/LeaveReview/DefaultView.aspx?id=OLCO-19985HX__000002_UB25LN,0,0,
Asda Opticians,OPT_UB3 4AZ,OPT,,Unit 3 Westlands Estate,,"Hayes, Middlesex",,UB3 4AZ,Tel: 0203 7701908, - ,,,No ratings yet Rate it yourself - /Services/opticians/LeaveReview/DefaultView.aspx?id=OPT_UB3 4AZ,0,0,